Parámetros para la placa de plomo de 0 gr·cm⁻²:
 Media: 1710.3123083959697  +-  0.9470884309244589
 STD: 2520.9462634676593  +-  12552.650440331909
 Norm. const: 0.30112907457595556  +-  2.8229294388167086e-05
 Integral: 1902.8572619825106  +-  35815101.25133712
 Despl. vertical (baseline): 0.0011538063921711576  +-  5.356038339895753e-06
Matriz de covarianzas:
 [[ 9.47088431e-01  6.74348568e-06  2.37318210e-09 -1.31087383e-09]
 [ 6.74348568e-06  1.25526504e+04 -1.95522713e-01 -1.26817874e-01]
 [ 2.37318210e-09 -1.95522713e-01  2.82292944e-05 -3.78731617e-06]
 [-1.31087383e-09 -1.26817874e-01 -3.78731617e-06  5.35603834e-06]]
Tiempo en ajustar:
 0.0030670166015625 segundos

Parámetros para la placa de plomo de 1120 gr·cm⁻²:
 Media: 1708.7211379288633  +-  0.998003802910104
 STD: 2418.4121270860337  +-  12569.442638890952
 Norm. const: 0.28190892659708017  +-  2.7077489619399378e-05
 Integral: 1708.9488888722378  +-  31473107.92532937
 Despl. vertical (baseline): 0.0021683759513042604  +-  4.954362022908621e-06
Matriz de covarianzas:
 [[ 9.98003803e-01 -4.09538918e-06  2.10085633e-09 -8.76837418e-10]
 [-4.09538918e-06  1.25694426e+04 -1.96356596e-01 -1.20198524e-01]
 [ 2.10085633e-09 -1.96356596e-01  2.70774896e-05 -3.50327686e-06]
 [-8.76837418e-10 -1.20198524e-01 -3.50327686e-06  4.95436202e-06]]
Tiempo en ajustar:
 0.0026543140411376953 segundos

Parámetros para la placa de plomo de 1716 gr·cm⁻²:
 Media: 1702.3856642428646  +-  0.9081328737387693
 STD: 2221.355679576557  +-  10320.85459224187
 Norm. const: 0.28385708412082117  +-  2.7002793402019495e-05
 Integral: 1580.5483073023568  +-  21513978.371983744
 Despl. vertical (baseline): 0.0022096736032964767  +-  4.5956848877035e-06
Matriz de covarianzas:
 [[ 9.08132874e-01 -1.23136572e-05  1.80518636e-09 -4.77272848e-10]
 [-1.23136572e-05  1.03208546e+04 -1.85850071e-01 -1.01723159e-01]
 [ 1.80518636e-09 -1.85850071e-01  2.70027934e-05 -3.24964893e-06]
 [-4.77272848e-10 -1.01723159e-01 -3.24964893e-06  4.59568489e-06]]
Tiempo en ajustar:
 0.002643585205078125 segundos

Parámetros para la placa de plomo de 2066 gr·cm⁻²:
 Media: 1709.2819749402358  +-  1.22135438881038
 STD: 2498.69048829526  +-  16013.518926796054
 Norm. const: 0.25093458779636235  +-  2.548153091705497e-05
 Integral: 1571.6756496206426  +-  40474784.28117597
 Despl. vertical (baseline): 0.0013266511766773425  +-  4.797529445770004e-06
Matriz de covarianzas:
 [[ 1.22135439e+00  9.16034431e-06  2.56500837e-09 -1.42402680e-09]
 [ 9.16034431e-06  1.60135189e+04 -2.10930333e-01 -1.35124374e-01]
 [ 2.56500837e-09 -2.10930333e-01  2.54815309e-05 -3.39238622e-06]
 [-1.42402680e-09 -1.35124374e-01 -3.39238622e-06  4.79752945e-06]]
Tiempo en ajustar:
 0.0024042129516601562 segundos

Parámetros para la placa de plomo de 3448 gr·cm⁻²:
 Media: 1713.9136472083824  +-  1.0537009149739631
 STD: 2323.721648622691  +-  12644.651930608361
 Norm. const: 0.23047924120770716  +-  1.9815994986999648e-05
 Integral: 1342.4739082896083  +-  21289591.250111345
 Despl. vertical (baseline): 0.004006099095562231  +-  3.503906810563321e-06
Matriz de covarianzas:
 [[ 1.05370091e+00 -2.04479765e-05  1.49958408e-09 -2.29951748e-10]
 [-2.04479765e-05  1.26446519e+04 -1.72193574e-01 -9.99281456e-02]
 [ 1.49958408e-09 -1.72193574e-01  1.98159950e-05 -2.47763971e-06]
 [-2.29951748e-10 -9.99281456e-02 -2.47763971e-06  3.50390681e-06]]
Tiempo en ajustar:
 0.0018973350524902344 segundos

Parámetros para la placa de plomo de 7367 gr·cm⁻²:
 Media: 1708.8918020848375  +-  1.238175453900755
 STD: 2263.6928626484028  +-  14395.154090726744
 Norm. const: 0.14887002396222668  +-  9.951725845811832e-06
 Integral: 844.7237288724812  +-  11511637.013971386
 Despl. vertical (baseline): 0.005030900297846304  +-  1.7209107676221634e-06
Matriz de covarianzas:
 [[ 1.23817545e+00 -2.25336937e-05  1.18832581e-09 -2.11203385e-10]
 [-2.25336937e-05  1.43951541e+04 -1.31988986e-01 -7.40162664e-02]
 [ 1.18832581e-09 -1.31988986e-01  9.95172585e-06 -1.21686949e-06]
 [-2.11203385e-10 -7.40162664e-02 -1.21686949e-06  1.72091077e-06]]
Tiempo en ajustar:
 0.0033588409423828125 segundos

Total fitting time:  0.016025304794311523 seconds.
