{
	"Spain":{
		"URL": "https://en.wikipedia.org/w/index.php?title=Template:COVID-19_pandemic_data/Spain_medical_cases_chart&action=edit",
		"RegEx": "(202.-..-..);([\\d]*);\\(?([\\d\\-]*)\\)?;([\\d]*)",
		"Population": 47000000,
		"Start of SOA": "14/03/2020",
		"Conservadurism": 2,
		"OfficialURL": "https://covid19.isciii.es"
	},
	"Italy":{
		"URL": "https://en.wikipedia.org/w/index.php?title=Template:COVID-19_pandemic_data/Italy_medical_cases_chart&action=edit",
		"RegEx": "^([\\d-]*);([\\d]*);([\\d]*);([\\d]*).*$",
		"Population": 60317116,
		"Start of SOA": "10/03/2020",
		"Conservadurism": 2
	},
	"Poland":{
		"URL": "https://en.wikipedia.org/w/index.php?title=Template:2019%E2%80%9320_coronavirus_pandemic_data/Poland_medical_cases_chart&action=edit",
		"RegEx": "^([\\d-]*);([\\d]*);([\\d]*);([\\d]*).*$",
		"Population": 38386000,
		"Start of SOA": "31/03/2020",
		"Conservadurism": 2
	},
	"Belgium":{
		"URL": "https://en.wikipedia.org/w/index.php?title=Template:2019%E2%80%9320_coronavirus_pandemic_data/Belgium_medical_cases_chart&action=edit",
		"RegEx": "([\\d-]*);([\\d]*);([\\d]*);([\\d]*).*",
		"Population": 11515793,
		"Start of SOA": "20/03/2020",
		"Conservadurism": 2
	}
}
