<?xml version="1.0" encoding="UTF-8" standalone="no"?>
<!-- Created with Inkscape (http://www.inkscape.org/) -->

<svg
   width="41"
   height="41"
   viewBox="0 0 41.000001 41.000001"
   version="1.1"
   id="svg5"
   shape-rendering="optimizeQuality"
   xmlns="http://www.w3.org/2000/svg"
   xmlns:svg="http://www.w3.org/2000/svg"
   xmlns:rdf="http://www.w3.org/1999/02/22-rdf-syntax-ns#"
   xmlns:cc="http://creativecommons.org/ns#"
   xmlns:dc="http://purl.org/dc/elements/1.1/">
  <title
     id="title1098">coil horizontal</title>
  <defs
     id="defs2" />
  <g
     id="layer1">
    <g
       id="g1065"
       transform="matrix(0,0.99986832,-1,0,41,-0.01734338)"
       style="stroke-width:1.00007">
      <g
         id="g1041"
         transform="rotate(90,26.677392,-11.280127)"
         style="stroke-width:1.00007">
        <path
           style="fill:none;stroke:#000000;stroke-width:1.33056;stroke-linecap:square;stroke-linejoin:bevel"
           id="path847"
           d="m 58.249804,-4.937499 a 4.292285,3.6275797 0 0 1 -2.146142,3.1415761 4.292285,3.6275797 0 0 1 -4.292285,0 4.292285,3.6275797 0 0 1 -2.146142,-3.1415761" />
        <path
           style="fill:none;stroke:#000000;stroke-width:1.33056;stroke-linecap:square;stroke-linejoin:bevel"
           id="path951"
           d="m 67.249804,-4.937499 a 4.292285,3.6275797 0 0 1 -2.146142,3.1415761 4.292285,3.6275797 0 0 1 -4.292285,0 4.292285,3.6275797 0 0 1 -2.146142,-3.1415761" />
        <path
           style="fill:none;stroke:#000000;stroke-width:1.33056;stroke-linecap:square;stroke-linejoin:bevel"
           id="path953"
           d="m 76.249804,-4.937499 a 4.292285,3.6275797 0 0 1 -2.146142,3.1415761 4.292285,3.6275797 0 0 1 -4.292285,0 4.292285,3.6275797 0 0 1 -2.146142,-3.1415761" />
        <path
           style="fill:none;stroke:#000000;stroke-width:1.33056;stroke-linecap:square;stroke-linejoin:bevel"
           id="path955"
           d="m 49.249804,-4.937499 a 4.292285,3.6275797 0 0 1 -2.146142,3.1415761 4.292285,3.6275797 0 0 1 -4.292285,0 4.292285,3.6275797 0 0 1 -2.146142,-3.1415761" />
      </g>
      <path
         style="fill:none;stroke:#000000;stroke-width:1.00007;stroke-linecap:butt;stroke-linejoin:miter;stroke-miterlimit:4;stroke-dasharray:none;stroke-opacity:1"
         d="m 20.5,0 c 0,2.9999999 0,2.9999999 0,2.9999999"
         id="path1266" />
      <path
         style="fill:none;stroke:#000000;stroke-width:1.00007;stroke-linecap:butt;stroke-linejoin:miter;stroke-miterlimit:4;stroke-dasharray:none;stroke-opacity:1"
         d="m 20.5,38 c 0,3 0,3 0,3"
         id="path1043" />
    </g>
  </g>
  <metadata
     id="metadata237">
    <rdf:RDF>
      <cc:Work
         rdf:about="">
        <dc:title>coil horizontal</dc:title>
        <cc:license
           rdf:resource="http://creativecommons.org/licenses/by-sa/4.0/" />
      </cc:Work>
      <cc:License
         rdf:about="http://creativecommons.org/licenses/by-sa/4.0/">
        <cc:permits
           rdf:resource="http://creativecommons.org/ns#Reproduction" />
        <cc:permits
           rdf:resource="http://creativecommons.org/ns#Distribution" />
        <cc:requires
           rdf:resource="http://creativecommons.org/ns#Notice" />
        <cc:requires
           rdf:resource="http://creativecommons.org/ns#Attribution" />
        <cc:permits
           rdf:resource="http://creativecommons.org/ns#DerivativeWorks" />
        <cc:requires
           rdf:resource="http://creativecommons.org/ns#ShareAlike" />
      </cc:License>
    </rdf:RDF>
  </metadata>
</svg>
