<?xml version="1.0" encoding="UTF-8" standalone="no"?>
<!-- Created with Inkscape (http://www.inkscape.org/) -->

<svg
   width="41"
   height="41"
   viewBox="0 0 41.000001 41.000001"
   version="1.1"
   id="svg5"
   shape-rendering="optimizeQuality"
   xmlns="http://www.w3.org/2000/svg"
   xmlns:svg="http://www.w3.org/2000/svg"
   xmlns:rdf="http://www.w3.org/1999/02/22-rdf-syntax-ns#">
  <defs
     id="defs2">
    <rect
       x="-95.999996"
       y="-179.99999"
       width="260.99999"
       height="334.99998"
       id="rect4942" />
    <rect
       x="-95.999996"
       y="-179.99999"
       width="260.99999"
       height="334.99998"
       id="rect7830" />
    <rect
       x="-95.999996"
       y="-179.99999"
       width="260.99999"
       height="334.99998"
       id="rect7888" />
    <rect
       x="-95.999996"
       y="-179.99999"
       width="260.99999"
       height="334.99998"
       id="rect7910" />
    <rect
       x="-95.999996"
       y="-179.99999"
       width="260.99999"
       height="334.99998"
       id="rect7950" />
    <rect
       x="-95.999996"
       y="-179.99999"
       width="260.99999"
       height="334.99998"
       id="rect7974" />
    <rect
       x="-95.999996"
       y="-179.99999"
       width="260.99999"
       height="334.99998"
       id="rect7998" />
    <rect
       x="-95.999996"
       y="-179.99999"
       width="260.99999"
       height="334.99998"
       id="rect8000" />
    <rect
       x="-95.999996"
       y="-179.99999"
       width="260.99999"
       height="334.99998"
       id="rect8010" />
    <rect
       x="-95.999996"
       y="-179.99999"
       width="260.99999"
       height="334.99998"
       id="rect8014" />
    <rect
       x="-95.999996"
       y="-179.99999"
       width="260.99999"
       height="334.99998"
       id="rect8054" />
    <rect
       x="-95.999996"
       y="-179.99999"
       width="260.99999"
       height="334.99998"
       id="rect8058" />
  </defs>
  <g
     id="layer1">
    <path
       style="fill:none;stroke:#000000;stroke-width:1;stroke-linecap:butt;stroke-linejoin:miter;stroke-miterlimit:4;stroke-dasharray:none;stroke-opacity:1"
       d="m 41,20.5 c -11,0 -11,0 -11,0"
       id="path830" />
    <path
       style="fill:none;stroke:#000000;stroke-width:1;stroke-linecap:butt;stroke-linejoin:miter;stroke-miterlimit:4;stroke-dasharray:none;stroke-opacity:1"
       d="m 11,30.499999 c -11,0 -11,0 -11,0"
       id="path7942" />
    <path
       style="fill:none;stroke:#000000;stroke-width:1;stroke-linecap:butt;stroke-linejoin:miter;stroke-miterlimit:4;stroke-dasharray:none;stroke-opacity:1"
       d="m 11,10.499999 c -11,0 -11,0 -11,0"
       id="path7944" />
    <rect
       style="fill:none;stroke:#000000;stroke-width:1;stroke-linecap:square"
       id="rect892"
       width="20"
       height="30"
       x="10.5"
       y="5.5" />
    <text
       xml:space="preserve"
       style="font-style:normal;font-variant:normal;font-weight:normal;font-stretch:normal;font-size:9.33333px;line-height:1.25;font-family:sans-serif;-inkscape-font-specification:'sans-serif, Normal';font-variant-ligatures:normal;font-variant-caps:normal;font-variant-numeric:normal;font-variant-east-asian:normal;letter-spacing:0px;word-spacing:0px;writing-mode:lr-tb"
       x="13.556969"
       y="13.897459"
       id="text7744"><tspan
         id="tspan11164">=1</tspan></text>
    <path
       style="fill:none;stroke:#000000;stroke-width:0.999998;stroke-linecap:round;stroke-linejoin:miter;stroke-miterlimit:4;stroke-dasharray:none;stroke-opacity:1"
       d="M 35.35019,20.173413 C 30.842384,15.665608 30.842384,15.665608 30.842384,15.665608"
       id="path8618" />
  </g>
  <metadata
     id="metadata237">
    <rdf:RDF />
  </metadata>
</svg>
