<?xml version="1.0" encoding="UTF-8" standalone="no"?>
<!-- Created with Inkscape (http://www.inkscape.org/) -->

<svg
   width="41"
   height="41"
   viewBox="0 0 41.000001 41.000001"
   version="1.1"
   id="svg5"
   shape-rendering="optimizeQuality"
   xmlns="http://www.w3.org/2000/svg"
   xmlns:svg="http://www.w3.org/2000/svg"
   xmlns:rdf="http://www.w3.org/1999/02/22-rdf-syntax-ns#"
   xmlns:cc="http://creativecommons.org/ns#">
  <defs
     id="defs2">
    <rect
       x="-95.999996"
       y="-179.99999"
       width="260.99999"
       height="334.99998"
       id="rect4942" />
    <rect
       x="-95.999996"
       y="-179.99999"
       width="260.99999"
       height="334.99998"
       id="rect7830" />
    <rect
       x="-95.999996"
       y="-179.99999"
       width="260.99999"
       height="334.99998"
       id="rect7888" />
    <rect
       x="-95.999996"
       y="-179.99999"
       width="260.99999"
       height="334.99998"
       id="rect7910" />
    <rect
       x="-95.999996"
       y="-179.99999"
       width="260.99999"
       height="334.99998"
       id="rect7950" />
    <rect
       x="-95.999996"
       y="-179.99999"
       width="260.99999"
       height="334.99998"
       id="rect7974" />
    <rect
       x="-95.999996"
       y="-179.99999"
       width="260.99999"
       height="334.99998"
       id="rect7998" />
    <rect
       x="-95.999996"
       y="-179.99999"
       width="260.99999"
       height="334.99998"
       id="rect8000" />
    <rect
       x="-95.999996"
       y="-179.99999"
       width="260.99999"
       height="334.99998"
       id="rect8010" />
    <rect
       x="-95.999996"
       y="-179.99999"
       width="260.99999"
       height="334.99998"
       id="rect8014" />
    <rect
       x="-95.999996"
       y="-179.99999"
       width="260.99999"
       height="334.99998"
       id="rect8054" />
    <rect
       x="-95.999996"
       y="-179.99999"
       width="260.99999"
       height="334.99998"
       id="rect8058" />
  </defs>
  <g
     id="layer1">
    <path
       style="fill:none;stroke:#000000;stroke-width:1;stroke-linecap:butt;stroke-linejoin:miter;stroke-miterlimit:4;stroke-dasharray:none;stroke-opacity:1"
       d="m 41,20.611111 c -5.5,0 -5.5,0 -5.5,0"
       id="path830" />
    <path
       style="fill:none;stroke:#000000;stroke-width:0.999993;stroke-linecap:butt;stroke-linejoin:miter;stroke-miterlimit:4;stroke-dasharray:none;stroke-opacity:1"
       d="m 5.5,30.423076 c -5.5,0 -5.5,0 -5.5,0"
       id="path7942" />
    <path
       style="fill:none;stroke:#000000;stroke-width:0.999993;stroke-linecap:butt;stroke-linejoin:miter;stroke-miterlimit:4;stroke-dasharray:none;stroke-opacity:1"
       d="m 5.5,10.423076 c -5.5,0 -5.5,0 -5.5,0"
       id="path7944" />
    <path
       id="rect892"
       style="fill:none;stroke:#000000;stroke-width:1;stroke-linecap:square"
       d="M 5.5,35.491387 V 5.5 l 15.035027,0.00833 c 8.281893,0.00833 14.995694,6.722131 14.995694,15.004024 0,8.281892 -6.713801,14.995693 -14.995694,14.987363 z" />
  </g>
  <metadata
     id="metadata237">
    <rdf:RDF>
      <cc:Work
         rdf:about="">
        <cc:license
           rdf:resource="http://creativecommons.org/licenses/by-sa/4.0/" />
      </cc:Work>
      <cc:License
         rdf:about="http://creativecommons.org/licenses/by-sa/4.0/">
        <cc:permits
           rdf:resource="http://creativecommons.org/ns#Reproduction" />
        <cc:permits
           rdf:resource="http://creativecommons.org/ns#Distribution" />
        <cc:requires
           rdf:resource="http://creativecommons.org/ns#Notice" />
        <cc:requires
           rdf:resource="http://creativecommons.org/ns#Attribution" />
        <cc:permits
           rdf:resource="http://creativecommons.org/ns#DerivativeWorks" />
        <cc:requires
           rdf:resource="http://creativecommons.org/ns#ShareAlike" />
      </cc:License>
    </rdf:RDF>
  </metadata>
</svg>
