<?xml version="1.0" encoding="UTF-8" standalone="no"?>
<!-- Created with Inkscape (http://www.inkscape.org/) -->

<svg
   width="41"
   height="41"
   viewBox="0 0 41.000001 41.000001"
   version="1.1"
   id="svg5"
   inkscape:version="1.1.1 (3bf5ae0d25, 2021-09-20)"
   sodipodi:docname="op-amp-rails-4b4a.svg"
   shape-rendering="optimizeQuality"
   xmlns:inkscape="http://www.inkscape.org/namespaces/inkscape"
   xmlns:sodipodi="http://sodipodi.sourceforge.net/DTD/sodipodi-0.dtd"
   xmlns="http://www.w3.org/2000/svg"
   xmlns:svg="http://www.w3.org/2000/svg"
   xmlns:rdf="http://www.w3.org/1999/02/22-rdf-syntax-ns#"
   xmlns:cc="http://creativecommons.org/ns#">
  <sodipodi:namedview
     id="namedview7"
     pagecolor="#ffffff"
     bordercolor="#999999"
     borderopacity="1"
     inkscape:pageshadow="0"
     inkscape:pageopacity="0"
     inkscape:pagecheckerboard="true"
     inkscape:document-units="px"
     showgrid="false"
     inkscape:zoom="8.0000004"
     inkscape:cx="18.999999"
     inkscape:cy="15.187499"
     inkscape:window-width="1857"
     inkscape:window-height="1057"
     inkscape:window-x="-8"
     inkscape:window-y="-8"
     inkscape:window-maximized="1"
     inkscape:current-layer="layer1"
     width="40px"
     units="px"
     inkscape:snap-text-baseline="true" />
  <defs
     id="defs2">
    <rect
       x="-95.999996"
       y="-179.99999"
       width="260.99999"
       height="334.99998"
       id="rect4942" />
    <rect
       x="-95.999996"
       y="-179.99999"
       width="260.99999"
       height="334.99998"
       id="rect7830" />
    <rect
       x="-95.999996"
       y="-179.99999"
       width="260.99999"
       height="334.99998"
       id="rect7888" />
    <rect
       x="-95.999996"
       y="-179.99999"
       width="260.99999"
       height="334.99998"
       id="rect7910" />
    <rect
       x="-95.999996"
       y="-179.99999"
       width="260.99999"
       height="334.99998"
       id="rect7950" />
    <rect
       x="-95.999996"
       y="-179.99999"
       width="260.99999"
       height="334.99998"
       id="rect7974" />
    <rect
       x="-95.999996"
       y="-179.99999"
       width="260.99999"
       height="334.99998"
       id="rect7998" />
    <rect
       x="-95.999996"
       y="-179.99999"
       width="260.99999"
       height="334.99998"
       id="rect8000" />
    <rect
       x="-95.999996"
       y="-179.99999"
       width="260.99999"
       height="334.99998"
       id="rect8010" />
    <rect
       x="-95.999996"
       y="-179.99999"
       width="260.99999"
       height="334.99998"
       id="rect8014" />
    <rect
       x="-95.999996"
       y="-179.99999"
       width="260.99999"
       height="334.99998"
       id="rect8054" />
    <rect
       x="-95.999996"
       y="-179.99999"
       width="260.99999"
       height="334.99998"
       id="rect8058" />
  </defs>
  <g
     inkscape:label="Capa 1"
     inkscape:groupmode="layer"
     id="layer1">
    <g
       id="g872">
      <path
         style="fill:none;stroke:#000000;stroke-width:1;stroke-linecap:butt;stroke-linejoin:miter;stroke-miterlimit:4;stroke-dasharray:none;stroke-opacity:1"
         d="m 20.5,41 c 0,-9.000001 0,-9.000001 0,-9.000001"
         id="path1268" />
      <path
         style="fill:none;stroke:#000000;stroke-width:0.999996;stroke-linecap:butt;stroke-linejoin:miter;stroke-miterlimit:4;stroke-dasharray:none;stroke-opacity:1"
         d="M 20.5,8.9687504 C 20.5,0 20.5,0 20.5,0"
         id="path914" />
      <path
         style="fill:none;stroke:#000000;stroke-width:0.999999;stroke-linecap:butt;stroke-linejoin:miter;stroke-miterlimit:4;stroke-dasharray:none;stroke-opacity:1"
         d="m 41,20.5 c -0.499951,0 -0.499951,0 -0.499951,0"
         id="path830" />
      <path
         style="fill:none;stroke:#000000;stroke-width:1;stroke-linecap:butt;stroke-linejoin:miter;stroke-miterlimit:4;stroke-dasharray:none;stroke-opacity:1"
         d="m 9,30.5 c -9,0 -9,0 -9,0"
         id="path7942" />
      <path
         style="fill:none;stroke:#000000;stroke-width:1;stroke-linecap:butt;stroke-linejoin:miter;stroke-miterlimit:4;stroke-dasharray:none;stroke-opacity:1"
         d="m 9,10.499999 c -9,0 -9,0 -9,0"
         id="path7944" />
      <path
         sodipodi:type="star"
         style="fill:none;stroke:#000000;stroke-linecap:square;stroke-linejoin:round"
         id="path2012"
         inkscape:flatsided="true"
         sodipodi:sides="3"
         sodipodi:cx="19.551266"
         sodipodi:cy="20.5"
         sodipodi:r1="20.948784"
         sodipodi:r2="10.474392"
         sodipodi:arg1="0"
         sodipodi:arg2="1.0471976"
         inkscape:rounded="0"
         inkscape:randomized="0"
         d="m 40.50005,20.5 -31.4231762,18.142179 0,-36.284358 z"
         inkscape:transform-center-x="-5.237196" />
      <g
         id="g2180"
         transform="matrix(0.71428577,0,0,0.71428577,28.059918,4.3221078)"
         style="stroke-width:1.4;fill:none">
        <path
           style="fill:none;stroke:#000000;stroke-width:1.4;stroke-linecap:butt;stroke-linejoin:miter;stroke-miterlimit:4;stroke-dasharray:none;stroke-opacity:1"
           d="m -16.883883,8.649047 c -7,0 -7,0 -7,0"
           id="path2174" />
        <path
           style="fill:none;stroke:#000000;stroke-width:1.4;stroke-linecap:butt;stroke-linejoin:miter;stroke-miterlimit:4;stroke-dasharray:none;stroke-opacity:1"
           d="m -20.383884,5.1490485 c 0,6.9999995 0,6.9999995 0,6.9999995"
           id="path2176" />
      </g>
      <path
         style="fill:none;stroke:#000000;stroke-width:1;stroke-linecap:butt;stroke-linejoin:miter;stroke-miterlimit:4;stroke-dasharray:none;stroke-opacity:1"
         d="m 16.000001,30.499999 c -5.000001,0 -5.000001,0 -5.000001,0"
         id="path2182" />
    </g>
  </g>
  <metadata
     id="metadata237">
    <rdf:RDF>
      <cc:Work
         rdf:about="">
        <cc:license
           rdf:resource="http://creativecommons.org/licenses/by-sa/4.0/" />
      </cc:Work>
      <cc:License
         rdf:about="http://creativecommons.org/licenses/by-sa/4.0/">
        <cc:permits
           rdf:resource="http://creativecommons.org/ns#Reproduction" />
        <cc:permits
           rdf:resource="http://creativecommons.org/ns#Distribution" />
        <cc:requires
           rdf:resource="http://creativecommons.org/ns#Notice" />
        <cc:requires
           rdf:resource="http://creativecommons.org/ns#Attribution" />
        <cc:permits
           rdf:resource="http://creativecommons.org/ns#DerivativeWorks" />
        <cc:requires
           rdf:resource="http://creativecommons.org/ns#ShareAlike" />
      </cc:License>
    </rdf:RDF>
  </metadata>
</svg>
