<?xml version="1.0" encoding="UTF-8" standalone="no"?>
<!-- Created with Inkscape (http://www.inkscape.org/) -->

<svg
   width="41"
   height="41"
   viewBox="0 0 41.000001 41.000001"
   version="1.1"
   id="svg5"
   inkscape:version="1.1.1 (3bf5ae0d25, 2021-09-20)"
   sodipodi:docname="mosfet-p-231.svg"
   shape-rendering="optimizeQuality"
   xmlns:inkscape="http://www.inkscape.org/namespaces/inkscape"
   xmlns:sodipodi="http://sodipodi.sourceforge.net/DTD/sodipodi-0.dtd"
   xmlns="http://www.w3.org/2000/svg"
   xmlns:svg="http://www.w3.org/2000/svg"
   xmlns:rdf="http://www.w3.org/1999/02/22-rdf-syntax-ns#"
   xmlns:cc="http://creativecommons.org/ns#">
  <sodipodi:namedview
     id="namedview7"
     pagecolor="#ffffff"
     bordercolor="#999999"
     borderopacity="1"
     inkscape:pageshadow="0"
     inkscape:pageopacity="0"
     inkscape:pagecheckerboard="true"
     inkscape:document-units="px"
     showgrid="false"
     inkscape:zoom="8.0000004"
     inkscape:cx="23.749999"
     inkscape:cy="17.937499"
     inkscape:window-width="1857"
     inkscape:window-height="1057"
     inkscape:window-x="-8"
     inkscape:window-y="-8"
     inkscape:window-maximized="1"
     inkscape:current-layer="layer1"
     width="40px"
     units="px" />
  <defs
     id="defs2" />
  <g
     inkscape:label="Capa 1"
     inkscape:groupmode="layer"
     id="layer1">
    <g
       id="g892">
      <path
         style="fill:none;stroke:#000000;stroke-width:0.999997;stroke-linecap:butt;stroke-linejoin:miter;stroke-miterlimit:4;stroke-dasharray:none;stroke-opacity:1"
         d="m 20.5,7 c 0,-7 0,-7 0,-7"
         id="path914" />
      <circle
         style="fill:none;stroke:#000000;stroke-width:1.5;stroke-linecap:square;stroke-linejoin:bevel"
         id="path1384"
         cx="-20.5"
         cy="16.5"
         r="14.635631"
         transform="scale(-1,1)" />
      <path
         style="fill:none;stroke:#000000;stroke-width:0.999997;stroke-linecap:butt;stroke-linejoin:miter;stroke-miterlimit:4;stroke-dasharray:none;stroke-opacity:1"
         d="m 29,20.5 c 12,0 12,0 12,0"
         id="path836" />
      <path
         style="fill:none;stroke:#000000;stroke-width:0.999992;stroke-linecap:butt;stroke-linejoin:miter;stroke-miterlimit:4;stroke-dasharray:none;stroke-opacity:1"
         d="m 20.499998,41 c 0,-25 0,-25 0,-25"
         id="path1268" />
      <path
         style="fill:none;stroke:#000000;stroke-width:0.999989;stroke-linecap:butt;stroke-linejoin:miter;stroke-miterlimit:4;stroke-dasharray:none;stroke-opacity:1"
         d="m 20,16.5 c 7,0 7,0 7,0"
         id="path1087" />
      <path
         style="fill:none;stroke:#000000;stroke-width:0.99999;stroke-linecap:butt;stroke-linejoin:miter;stroke-miterlimit:4;stroke-dasharray:none;stroke-opacity:1"
         d="m 29.500005,21.999999 c 0,-11.000001 0,-11.000001 0,-11.000001"
         id="path1555" />
      <path
         style="fill:none;stroke:#000000;stroke-width:0.999989;stroke-linecap:butt;stroke-linejoin:miter;stroke-miterlimit:4;stroke-dasharray:none;stroke-opacity:1"
         d="m 26.500006,19 c 0,-5 0,-5 0,-5"
         id="path1070" />
      <path
         style="fill:none;stroke:#000000;stroke-width:0.999989;stroke-linecap:butt;stroke-linejoin:miter;stroke-miterlimit:4;stroke-dasharray:none;stroke-opacity:1"
         d="m 26.500006,25 c 0,-5 0,-5 0,-5"
         id="path1072" />
      <path
         style="fill:none;stroke:#000000;stroke-width:0.999989;stroke-linecap:butt;stroke-linejoin:miter;stroke-miterlimit:4;stroke-dasharray:none;stroke-opacity:1"
         d="m 26.500006,13 c 0,-5 0,-5 0,-5"
         id="path1074" />
      <path
         sodipodi:type="star"
         style="fill:#000000;stroke:#000000;stroke-width:2.70754;stroke-linecap:square;stroke-linejoin:miter"
         id="path1123"
         inkscape:flatsided="true"
         sodipodi:sides="3"
         sodipodi:cx="-16.374998"
         sodipodi:cy="15.874999"
         sodipodi:r1="2.5031228"
         sodipodi:r2="1.2515615"
         sodipodi:arg1="0"
         sodipodi:arg2="1.0471976"
         inkscape:rounded="0"
         inkscape:randomized="0"
         transform="matrix(-0.55400851,0,0,0.55400851,13.814863,7.7051159)"
         inkscape:transform-center-x="-0.3466879"
         d="m -13.871875,15.874999 -3.754684,2.167768 v -4.335536 z" />
      <path
         style="fill:none;stroke:#000000;stroke-width:0.99999;stroke-linecap:butt;stroke-linejoin:miter;stroke-miterlimit:4;stroke-dasharray:none;stroke-opacity:1"
         d="m 13.999999,22.500001 c 13,0 13,0 13,0"
         id="path1226" />
      <path
         style="fill:none;stroke:#000000;stroke-width:0.99999;stroke-linecap:butt;stroke-linejoin:miter;stroke-miterlimit:4;stroke-dasharray:none;stroke-opacity:1"
         d="m 13.999999,10.5 c 13,0 13,0 13,0"
         id="path1228" />
      <path
         style="fill:none;stroke:#000000;stroke-width:0.999989;stroke-linecap:butt;stroke-linejoin:miter;stroke-miterlimit:4;stroke-dasharray:none;stroke-opacity:1"
         d="M 20.499994,10.000001 C 20.499994,1 20.499994,1 20.499994,1"
         id="path1230" />
      <g
         id="g1309"
         transform="matrix(0,-1,-1,0,31.999995,65.665059)">
        <path
           style="fill:none;stroke:#000000;stroke-width:0.999989;stroke-linecap:butt;stroke-linejoin:miter;stroke-miterlimit:4;stroke-dasharray:none;stroke-opacity:1"
           d="m 47.749993,20 c 0,-5 0,-5 0,-5"
           id="path1303" />
        <path
           sodipodi:type="star"
           style="fill:#000000;stroke:#000000;stroke-width:2.70754;stroke-linecap:square;stroke-linejoin:miter"
           id="path1305"
           inkscape:flatsided="true"
           sodipodi:sides="3"
           sodipodi:cx="-16.374998"
           sodipodi:cy="15.874999"
           sodipodi:r1="2.5031228"
           sodipodi:r2="1.2515615"
           sodipodi:arg1="0"
           sodipodi:arg2="1.0471976"
           inkscape:rounded="0"
           inkscape:randomized="0"
           transform="matrix(-0.55400851,0,0,-0.55400851,41.064862,26.294885)"
           inkscape:transform-center-x="0.34668792"
           d="m -13.871875,15.874999 -3.754684,2.167768 v -4.335536 z" />
      </g>
      <path
         style="fill:none;stroke:#000000;stroke-width:0.99999;stroke-linecap:butt;stroke-linejoin:miter;stroke-miterlimit:4;stroke-dasharray:none;stroke-opacity:1"
         d="m 14.499994,22.999996 c 0,-13 0,-13 0,-13"
         id="path1311" />
    </g>
  </g>
  <metadata
     id="metadata237">
    <rdf:RDF>
      <cc:Work
         rdf:about="">
        <cc:license
           rdf:resource="http://creativecommons.org/licenses/by-sa/4.0/" />
      </cc:Work>
      <cc:License
         rdf:about="http://creativecommons.org/licenses/by-sa/4.0/">
        <cc:permits
           rdf:resource="http://creativecommons.org/ns#Reproduction" />
        <cc:permits
           rdf:resource="http://creativecommons.org/ns#Distribution" />
        <cc:requires
           rdf:resource="http://creativecommons.org/ns#Notice" />
        <cc:requires
           rdf:resource="http://creativecommons.org/ns#Attribution" />
        <cc:permits
           rdf:resource="http://creativecommons.org/ns#DerivativeWorks" />
        <cc:requires
           rdf:resource="http://creativecommons.org/ns#ShareAlike" />
      </cc:License>
    </rdf:RDF>
  </metadata>
</svg>
