<?xml version="1.0" encoding="UTF-8" standalone="no"?>
<!-- Created with Inkscape (http://www.inkscape.org/) -->

<svg
   width="41"
   height="41"
   viewBox="0 0 41.000001 41.000001"
   version="1.1"
   id="svg5"
   inkscape:version="1.1.1 (3bf5ae0d25, 2021-09-20)"
   sodipodi:docname="gate-buffer.svg"
   shape-rendering="optimizeQuality"
   xmlns:inkscape="http://www.inkscape.org/namespaces/inkscape"
   xmlns:sodipodi="http://sodipodi.sourceforge.net/DTD/sodipodi-0.dtd"
   xmlns="http://www.w3.org/2000/svg"
   xmlns:svg="http://www.w3.org/2000/svg"
   xmlns:rdf="http://www.w3.org/1999/02/22-rdf-syntax-ns#">
  <sodipodi:namedview
     id="namedview7"
     pagecolor="#ffffff"
     bordercolor="#999999"
     borderopacity="1"
     inkscape:pageshadow="0"
     inkscape:pageopacity="0"
     inkscape:pagecheckerboard="true"
     inkscape:document-units="px"
     showgrid="false"
     inkscape:zoom="11.313709"
     inkscape:cx="15.733125"
     inkscape:cy="13.744387"
     inkscape:window-width="1857"
     inkscape:window-height="1057"
     inkscape:window-x="-8"
     inkscape:window-y="-8"
     inkscape:window-maximized="1"
     inkscape:current-layer="layer1"
     width="40px"
     units="px"
     inkscape:snap-text-baseline="true" />
  <defs
     id="defs2">
    <rect
       x="-95.999996"
       y="-179.99999"
       width="260.99999"
       height="334.99998"
       id="rect4942" />
    <rect
       x="-95.999996"
       y="-179.99999"
       width="260.99999"
       height="334.99998"
       id="rect7830" />
    <rect
       x="-95.999996"
       y="-179.99999"
       width="260.99999"
       height="334.99998"
       id="rect7888" />
    <rect
       x="-95.999996"
       y="-179.99999"
       width="260.99999"
       height="334.99998"
       id="rect7910" />
    <rect
       x="-95.999996"
       y="-179.99999"
       width="260.99999"
       height="334.99998"
       id="rect7950" />
    <rect
       x="-95.999996"
       y="-179.99999"
       width="260.99999"
       height="334.99998"
       id="rect7974" />
    <rect
       x="-95.999996"
       y="-179.99999"
       width="260.99999"
       height="334.99998"
       id="rect7998" />
    <rect
       x="-95.999996"
       y="-179.99999"
       width="260.99999"
       height="334.99998"
       id="rect8000" />
    <rect
       x="-95.999996"
       y="-179.99999"
       width="260.99999"
       height="334.99998"
       id="rect8010" />
    <rect
       x="-95.999996"
       y="-179.99999"
       width="260.99999"
       height="334.99998"
       id="rect8014" />
    <rect
       x="-95.999996"
       y="-179.99999"
       width="260.99999"
       height="334.99998"
       id="rect8054" />
    <rect
       x="-95.999996"
       y="-179.99999"
       width="260.99999"
       height="334.99998"
       id="rect8058" />
  </defs>
  <g
     inkscape:label="Capa 1"
     inkscape:groupmode="layer"
     id="layer1">
    <path
       style="fill:none;stroke:#000000;stroke-width:1;stroke-linecap:butt;stroke-linejoin:miter;stroke-miterlimit:4;stroke-dasharray:none;stroke-opacity:1"
       d="m 41,20.5 c -11,0 -11,0 -11,0"
       id="path830" />
    <rect
       style="fill:none;stroke:#000000;stroke-width:1;stroke-linecap:square"
       id="rect892"
       width="20"
       height="30"
       x="10.5"
       y="5.5" />
    <text
       xml:space="preserve"
       style="font-style:normal;font-variant:normal;font-weight:normal;font-stretch:normal;font-size:9.33333px;line-height:1.25;font-family:sans-serif;-inkscape-font-specification:'sans-serif, Normal';font-variant-ligatures:normal;font-variant-caps:normal;font-variant-numeric:normal;font-variant-east-asian:normal;letter-spacing:0px;word-spacing:0px;writing-mode:lr-tb"
       x="17.448895"
       y="13.897459"
       id="text7744"><tspan
         sodipodi:role="line"
         id="tspan11555"
         x="17.448895"
         y="13.897459">1</tspan></text>
    <path
       style="fill:none;stroke:#000000;stroke-width:1;stroke-linecap:butt;stroke-linejoin:miter;stroke-miterlimit:4;stroke-dasharray:none;stroke-opacity:1"
       d="m 11,20.5 c -11,0 -11,0 -11,0"
       id="path11535" />
  </g>
  <metadata
     id="metadata237">
    <rdf:RDF />
  </metadata>
</svg>
