<?xml version="1.0" encoding="UTF-8" standalone="no"?>
<svg
   xmlns:dc="http://purl.org/dc/elements/1.1/"
   xmlns:cc="http://creativecommons.org/ns#"
   xmlns:rdf="http://www.w3.org/1999/02/22-rdf-syntax-ns#"
   xmlns:svg="http://www.w3.org/2000/svg"
   xmlns="http://www.w3.org/2000/svg"
   xmlns:sodipodi="http://sodipodi.sourceforge.net/DTD/sodipodi-0.dtd"
   xmlns:inkscape="http://www.inkscape.org/namespaces/inkscape"
   width="530pt"
   height="335pt"
   viewBox="0 0 530 335"
   version="1.1"
   id="svg60"
   sodipodi:docname="green-02.svg"
   inkscape:version="0.92.4 (5da689c313, 2019-01-14)">
  <metadata
     id="metadata66">
    <rdf:RDF>
      <cc:Work
         rdf:about="">
        <dc:format>image/svg+xml</dc:format>
        <dc:type
           rdf:resource="http://purl.org/dc/dcmitype/StillImage" />
        <dc:title />
      </cc:Work>
    </rdf:RDF>
  </metadata>
  <defs
     id="defs64" />
  <sodipodi:namedview
     pagecolor="#ffffff"
     bordercolor="#666666"
     borderopacity="1"
     objecttolerance="10"
     gridtolerance="10"
     guidetolerance="10"
     inkscape:pageopacity="0"
     inkscape:pageshadow="2"
     inkscape:window-width="1851"
     inkscape:window-height="1057"
     id="namedview62"
     showgrid="false"
     inkscape:zoom="0.40613208"
     inkscape:cx="-56.631823"
     inkscape:cy="223.33333"
     inkscape:window-x="-8"
     inkscape:window-y="-8"
     inkscape:window-maximized="1"
     inkscape:current-layer="layer1" />
  <g
     inkscape:groupmode="layer"
     id="layer1"
     inkscape:label="bg">
    <rect
       style="opacity:1;fill:#5599ff;fill-opacity:1;stroke:#5599ff;stroke-width:78.12735748;stroke-linecap:butt;stroke-linejoin:round;stroke-miterlimit:4;stroke-dasharray:none;stroke-opacity:1"
       id="rect838"
       width="425.37259"
       height="240.12263"
       x="52.313705"
       y="47.438683" />
  </g>
  <g
     inkscape:groupmode="layer"
     id="layer2"
     inkscape:label="fg">
    <g
       style=""
       id="#000000ff">
      <path
         fill="#000000"
         opacity="1.00"
         d=" M 228.44 13.01 C 233.32 12.76 238.16 13.62 242.96 14.33 C 239.48 15.50 235.75 14.49 232.27 15.37 C 228.85 17.06 226.01 19.68 222.94 21.90 C 214.78 28.10 206.63 35.55 203.67 45.71 C 201.19 53.78 204.86 63.22 212.22 67.39 C 210.50 59.92 207.91 51.76 211.75 44.49 C 210.57 52.03 210.12 60.15 213.98 67.05 C 215.22 67.04 216.46 67.03 217.70 67.02 C 222.38 53.79 229.88 41.85 236.76 29.70 C 239.44 24.74 242.91 20.31 246.25 15.81 C 246.15 14.42 244.52 13.91 243.74 12.96 C 245.93 13.01 248.13 13.03 250.33 13.09 C 243.96 24.21 235.49 34.20 230.70 46.20 C 246.50 32.08 264.80 19.94 285.58 14.81 C 286.56 14.24 287.53 13.66 288.51 13.06 C 311.33 12.97 334.16 13.07 356.99 13.01 C 360.82 12.94 364.59 13.59 368.39 13.91 C 371.91 15.65 376.15 16.14 380.00 17.22 C 379.97 18.42 379.95 19.62 379.94 20.83 C 367.96 21.40 356.45 25.08 344.91 28.01 C 330.13 31.87 315.85 37.30 301.47 42.38 C 299.66 43.01 297.89 43.78 296.35 44.93 C 307.16 45.15 318.17 43.62 328.79 46.30 C 347.08 50.82 364.29 59.32 379.28 70.70 C 389.82 78.00 399.50 86.43 408.31 95.75 C 417.59 104.87 426.16 114.93 432.09 126.59 C 431.28 127.32 430.48 128.06 429.69 128.80 C 405.78 121.17 381.66 114.17 357.69 106.76 C 367.05 115.60 374.34 126.94 377.46 139.50 C 380.55 157.74 374.00 177.02 361.44 190.43 C 360.54 191.58 358.74 191.00 358.03 189.94 C 353.83 185.43 350.57 180.13 346.25 175.73 C 346.11 181.65 346.68 187.65 345.47 193.51 C 344.06 201.08 342.04 208.69 338.37 215.51 C 336.93 218.20 333.28 217.54 331.57 215.46 C 325.85 209.12 321.95 201.42 318.57 193.65 C 316.05 203.91 314.51 214.38 312.89 224.81 C 322.50 228.56 332.76 230.40 342.17 234.70 C 347.23 237.12 353.05 238.86 356.74 243.34 C 358.64 245.54 357.68 248.47 356.89 250.92 C 355.25 255.60 352.77 259.94 350.08 264.09 C 351.62 266.88 353.02 269.76 353.95 272.82 C 353.28 275.36 352.68 277.92 352.00 280.46 C 356.25 284.27 361.71 286.36 365.97 290.16 C 370.49 294.21 374.83 299.01 376.25 305.08 C 377.95 311.11 376.16 317.43 373.80 323.02 C 372.99 323.00 371.37 322.95 370.57 322.93 C 371.77 318.32 373.79 313.76 373.69 308.93 C 372.66 303.10 369.85 296.52 363.90 294.33 C 352.84 293.70 342.13 298.20 332.89 303.94 C 326.59 308.90 320.06 313.76 314.90 319.97 C 313.70 321.36 312.37 322.70 310.59 323.31 C 319.85 310.77 332.43 300.33 347.28 295.22 C 352.51 293.57 358.02 292.99 363.49 292.94 C 355.98 286.15 346.46 282.17 337.61 277.47 C 334.97 275.89 331.64 275.53 328.84 276.93 C 296.66 290.15 264.76 304.53 235.18 322.97 C 233.27 322.97 231.35 322.99 229.45 323.01 C 235.93 317.62 243.54 313.92 250.79 309.72 C 273.16 297.27 296.33 286.16 320.38 277.34 C 324.25 275.89 327.87 273.59 332.02 273.03 C 337.88 273.74 342.95 277.08 348.33 279.24 C 349.23 276.65 350.57 273.92 349.87 271.11 C 349.25 269.00 348.29 267.01 347.42 265.00 C 344.51 265.29 341.70 266.10 338.93 266.99 C 318.63 273.72 297.51 277.81 277.58 285.69 C 276.26 286.18 274.92 286.61 273.58 287.02 C 277.67 284.65 282.04 282.86 286.50 281.33 C 302.20 275.30 318.20 270.07 334.32 265.27 C 338.81 263.91 343.90 263.66 347.59 260.46 C 349.92 258.68 350.81 255.76 352.18 253.29 C 353.40 251.05 354.36 248.56 354.01 245.96 C 353.02 244.05 351.12 242.84 349.34 241.75 C 337.38 235.74 324.39 232.23 312.07 227.08 C 311.85 229.91 311.48 232.74 311.09 235.55 C 318.09 236.58 325.29 238.17 331.08 242.48 C 332.51 248.23 326.21 250.99 322.09 253.17 C 297.79 263.45 272.97 272.59 249.31 284.31 C 240.60 287.99 232.49 292.89 224.07 297.16 C 212.00 303.10 200.41 309.96 189.02 317.11 C 186.59 318.63 183.90 319.62 181.18 320.48 C 182.30 310.96 182.88 301.33 184.63 291.87 C 187.24 277.37 188.85 262.59 193.42 248.53 C 194.70 243.73 199.31 241.21 203.17 238.69 C 202.88 237.32 202.58 235.96 202.28 234.60 C 195.22 239.36 188.12 244.11 181.70 249.71 C 179.39 251.70 177.08 254.02 176.39 257.10 C 174.95 264.69 174.92 272.48 173.35 280.05 C 172.27 274.64 173.17 269.13 173.03 263.67 C 165.81 266.24 159.22 271.85 157.44 279.56 C 154.74 294.60 160.22 309.30 165.43 323.14 C 164.72 322.97 163.29 322.61 162.57 322.44 C 159.41 316.99 157.14 311.06 155.57 304.97 C 153.12 295.18 151.76 284.74 154.85 274.91 C 144.12 282.30 131.76 287.27 121.97 295.99 C 114.38 303.38 109.26 312.97 106.22 323.05 C 104.43 322.90 102.65 322.76 100.86 322.64 C 101.15 322.18 101.72 321.27 102.01 320.81 C 102.49 320.66 103.46 320.37 103.94 320.22 C 106.10 311.17 110.59 302.72 117.08 296.04 C 129.18 283.55 146.32 278.11 160.01 267.78 C 163.87 264.66 168.19 262.21 172.63 260.02 C 173.02 256.31 173.90 252.36 176.63 249.61 C 184.10 242.33 192.90 236.58 202.08 231.69 C 201.21 219.66 197.88 207.23 190.10 197.77 C 189.26 196.23 187.45 197.17 186.17 197.35 C 177.16 199.94 168.26 203.02 159.04 204.83 C 153.40 205.42 148.63 201.65 143.94 199.10 C 139.00 201.05 133.63 203.31 128.26 201.73 C 123.19 200.61 119.04 196.31 118.11 191.20 C 117.63 188.25 118.64 185.37 119.20 182.51 C 111.60 181.63 109.24 173.56 105.77 168.02 C 101.00 161.24 97.31 153.35 97.03 144.96 C 97.84 138.96 101.40 133.82 103.12 128.08 C 105.00 122.27 108.91 116.81 114.94 114.88 C 124.06 111.88 133.26 109.07 142.25 105.64 C 140.49 102.11 138.00 98.89 137.04 95.00 C 136.18 91.63 137.44 88.27 138.24 85.03 C 142.77 85.03 147.31 85.00 151.85 85.06 C 150.81 82.23 150.19 79.28 149.86 76.29 C 163.26 70.90 177.80 69.86 191.98 68.01 C 197.34 67.53 202.70 66.72 208.10 67.04 C 203.19 62.36 198.88 56.01 200.02 48.88 C 201.52 37.40 210.40 28.89 218.74 21.71 C 222.13 18.99 225.65 16.38 228.44 13.01 M 229.72 51.69 C 225.39 55.81 223.28 61.54 220.87 66.87 C 225.23 67.17 229.94 67.20 233.74 64.71 C 240.10 60.73 245.46 55.38 251.87 51.46 C 246.85 57.21 239.64 60.47 234.46 66.07 C 238.62 65.57 242.79 65.13 246.96 64.69 C 249.97 63.76 252.30 61.47 254.99 59.91 C 265.56 54.00 276.80 49.48 287.91 44.71 C 304.46 37.27 321.71 31.57 338.97 26.05 C 348.73 23.14 358.72 21.13 368.52 18.37 C 358.85 16.21 348.96 14.80 339.03 14.89 C 327.35 15.06 315.67 14.93 304.00 14.97 C 275.80 17.63 249.64 31.92 229.72 51.69 M 277.80 51.94 C 268.90 55.86 259.87 59.69 251.61 64.85 C 258.37 63.73 265.35 63.53 272.04 65.20 C 277.77 66.26 282.75 69.95 288.70 70.09 C 287.45 70.76 286.11 71.83 284.58 70.88 C 288.92 74.67 292.74 79.19 297.63 82.28 C 317.32 90.22 337.88 95.70 357.75 103.17 C 366.70 106.02 375.68 108.74 384.70 111.37 C 398.70 115.34 412.50 120.02 426.50 123.98 C 421.47 113.74 413.06 105.80 405.49 97.47 C 400.45 93.24 396.16 88.21 391.06 84.05 C 380.68 75.56 369.75 67.65 358.00 61.14 C 345.92 54.62 332.72 50.01 319.06 48.32 C 311.02 47.52 302.94 48.04 294.90 48.34 C 289.10 48.96 283.16 49.43 277.80 51.94 M 206.91 73.97 C 202.59 75.13 199.88 79.12 195.75 80.68 C 196.93 75.28 201.98 72.36 206.50 69.99 C 188.89 72.41 170.67 72.66 153.84 78.86 C 154.07 80.96 154.59 83.00 155.11 85.04 C 160.55 85.08 165.99 84.89 171.38 84.17 C 180.75 83.71 190.19 84.57 199.51 83.19 C 209.00 82.70 218.52 83.38 228.01 82.79 C 239.01 81.38 250.14 82.39 261.18 81.52 C 266.13 80.89 271.16 80.84 276.14 81.17 C 283.16 83.38 289.33 87.60 296.15 90.33 C 290.01 76.52 275.28 66.40 259.96 67.21 C 242.25 69.20 224.28 69.61 206.91 73.97 M 221.88 86.35 C 210.07 87.88 198.10 86.04 186.30 87.72 C 178.56 88.34 170.77 87.66 163.01 88.18 C 155.59 88.00 148.23 89.31 140.81 88.98 C 140.46 94.39 141.37 100.43 145.85 104.03 C 152.36 103.97 158.57 101.82 164.99 101.00 C 172.74 100.00 180.27 97.68 188.03 96.80 C 196.08 97.17 202.97 101.85 210.31 104.63 C 218.37 107.55 226.33 110.76 234.54 113.23 C 244.40 115.49 255.45 114.03 263.54 107.65 C 269.98 101.95 274.10 93.65 274.10 84.98 C 265.73 85.09 257.33 84.65 248.98 85.32 C 240.00 86.67 230.89 85.42 221.88 86.35 M 276.13 84.70 C 274.88 87.55 274.13 90.57 273.78 93.66 C 282.69 95.21 291.74 95.58 300.67 96.93 C 297.50 94.32 293.49 93.14 289.93 91.19 C 285.44 88.80 280.76 86.78 276.13 84.70 M 299.39 89.00 C 302.10 93.90 308.11 94.75 312.30 97.79 C 314.39 102.10 317.40 105.83 320.80 109.18 C 325.27 113.53 328.16 119.14 332.21 123.84 C 336.51 129.27 341.08 134.54 344.64 140.51 C 341.48 137.88 339.18 134.47 336.78 131.19 C 331.63 124.40 325.73 118.23 320.24 111.72 C 316.49 107.39 313.15 101.32 306.82 100.77 C 308.36 107.89 311.12 114.67 313.52 121.53 C 315.22 126.08 315.92 131.12 318.97 135.06 C 322.98 140.36 327.29 145.43 331.27 150.76 C 340.53 163.23 350.50 175.14 360.13 187.33 C 369.63 175.85 375.51 160.96 374.74 145.96 C 373.56 130.43 364.66 116.77 354.07 105.88 C 351.90 104.14 349.14 103.43 346.56 102.53 C 332.83 98.04 319.19 93.25 305.40 88.94 C 317.59 96.26 329.97 103.61 340.46 113.35 C 343.70 115.79 346.43 118.85 348.39 122.41 C 343.46 117.05 337.87 112.26 331.60 108.53 C 325.77 104.98 320.42 100.64 314.25 97.68 C 311.65 96.50 309.84 94.14 307.30 92.86 C 304.70 91.50 302.05 90.24 299.39 89.00 M 275.64 97.09 C 273.49 100.45 271.43 103.88 268.97 107.02 C 265.71 111.43 260.45 113.65 255.55 115.71 C 247.96 118.30 239.36 119.15 231.76 116.16 C 224.25 113.24 216.50 110.98 208.98 108.09 C 203.94 105.92 199.23 102.95 193.94 101.36 C 188.15 100.35 182.19 101.12 176.51 102.44 C 164.89 104.85 152.94 105.88 141.64 109.68 C 132.59 112.62 123.63 115.85 114.52 118.58 C 111.68 119.82 109.18 122.08 108.24 125.10 C 105.76 131.92 102.51 138.45 100.53 145.44 C 99.75 147.79 101.02 150.10 101.66 152.32 C 103.09 156.85 104.79 161.40 107.80 165.15 C 111.39 169.49 112.92 175.24 117.30 178.95 C 124.33 177.58 131.35 176.12 138.29 174.39 C 148.47 171.98 158.81 170.33 168.94 167.73 C 180.28 165.30 191.53 162.44 202.99 160.58 C 206.85 159.82 209.44 156.59 212.51 154.41 C 219.18 149.45 226.40 145.19 232.53 139.51 C 235.34 136.80 238.48 134.48 241.51 132.04 C 239.55 131.97 237.59 131.92 235.64 131.87 C 242.17 126.33 251.04 124.56 259.36 123.93 C 256.12 128.40 250.97 130.63 246.38 133.38 C 240.00 137.01 234.88 142.40 228.80 146.49 C 229.97 148.91 231.17 151.32 232.38 153.72 C 229.90 155.55 226.69 156.29 223.74 155.21 C 224.18 156.72 224.62 158.23 225.09 159.74 C 223.80 160.62 222.55 161.60 221.08 162.18 C 219.03 162.50 217.09 161.53 215.15 161.02 C 215.41 162.95 215.78 164.86 216.18 166.77 C 215.14 167.54 214.14 168.36 213.02 169.00 C 207.70 168.71 203.38 164.00 197.87 165.11 C 190.14 166.70 181.77 167.44 175.21 172.26 C 164.70 179.31 154.68 187.34 146.41 196.93 C 150.06 198.80 153.75 201.19 158.02 201.06 C 162.68 201.24 167.05 199.40 171.45 198.13 C 182.73 194.40 194.39 191.43 206.28 190.58 C 201.64 192.59 196.73 193.83 191.89 195.23 C 202.70 206.38 204.88 222.65 206.46 237.42 C 207.65 244.75 207.11 252.36 204.35 259.30 C 203.98 255.73 204.00 252.13 203.99 248.55 C 200.78 250.22 197.36 251.93 195.17 254.91 C 194.32 258.90 196.72 262.50 197.64 266.24 C 199.18 270.92 199.20 275.87 199.86 280.71 C 196.41 274.43 197.02 266.84 193.65 260.55 C 192.50 266.37 191.52 272.22 190.46 278.05 C 188.70 290.48 185.51 302.73 184.97 315.31 C 192.62 312.24 199.07 306.98 206.29 303.11 C 239.29 283.73 274.47 268.33 310.16 254.63 C 307.90 252.54 305.60 250.43 304.07 247.74 C 307.93 235.12 309.32 221.97 311.87 209.08 C 314.24 194.40 316.92 179.77 319.64 165.16 C 319.56 154.52 317.92 143.77 314.18 133.74 C 310.04 123.02 306.96 111.92 302.59 101.29 C 293.76 98.95 284.54 98.97 275.64 97.09 M 324.00 163.97 C 325.23 174.75 325.69 185.58 326.58 196.39 C 325.01 190.02 324.11 183.50 323.78 176.96 C 323.73 174.77 323.02 172.68 322.41 170.60 C 321.27 175.57 320.33 180.58 319.39 185.58 C 318.67 188.98 320.79 192.07 322.25 194.96 C 326.16 201.43 329.29 208.71 335.33 213.57 C 341.80 200.85 344.03 186.12 342.76 171.98 C 340.35 167.67 336.95 164.01 334.12 159.98 C 330.71 155.73 327.88 150.99 324.00 147.14 C 329.45 160.84 336.15 174.45 337.58 189.33 C 335.62 183.55 334.67 177.44 332.08 171.89 C 328.63 163.78 325.97 155.36 322.04 147.46 C 321.96 153.03 323.42 158.46 324.00 163.97 M 222.58 151.70 C 224.47 152.28 226.38 152.80 228.32 153.19 C 228.02 151.58 227.47 150.05 226.71 148.62 C 225.30 149.60 223.93 150.63 222.58 151.70 M 214.67 158.65 C 217.22 158.79 219.76 158.94 222.30 159.07 C 221.02 157.15 219.63 155.31 218.09 153.59 C 216.93 155.26 215.77 156.93 214.67 158.65 M 205.52 164.51 C 207.99 165.01 210.47 165.51 212.96 165.89 C 212.59 163.71 212.04 161.56 211.42 159.44 C 209.34 160.99 207.28 162.59 205.52 164.51 M 142.16 177.33 C 137.46 178.56 135.36 183.36 132.91 187.06 C 133.60 184.15 135.00 181.49 136.26 178.81 C 131.23 178.78 125.37 179.80 122.49 184.43 C 121.63 187.40 121.56 190.69 122.52 193.65 C 124.46 196.38 127.61 198.18 130.86 198.86 C 136.28 199.95 141.24 196.57 145.02 193.09 C 151.65 186.31 158.62 179.80 166.39 174.33 C 167.81 173.36 169.08 172.18 170.29 170.96 C 160.92 173.09 151.50 175.07 142.16 177.33 Z"
         id="path31" />
      <path
         fill="#000000"
         opacity="1.00"
         d=" M 245.88 47.11 C 247.54 44.64 249.72 42.58 252.09 40.81 C 250.69 43.49 248.46 45.59 245.88 47.11 Z"
         id="path33" />
      <path
         fill="#000000"
         opacity="1.00"
         d=" M 231.94 63.36 C 234.25 57.24 238.66 52.05 243.86 48.17 C 240.06 53.37 235.87 58.26 231.94 63.36 Z"
         id="path35" />
      <path
         fill="#000000"
         opacity="1.00"
         d=" M 280.20 66.75 C 280.66 66.52 281.57 66.06 282.03 65.83 C 288.72 65.47 295.35 66.72 302.02 67.02 C 309.23 67.70 316.63 68.53 323.17 71.90 C 316.76 70.80 310.51 68.80 304.01 68.26 C 296.05 68.29 288.12 67.41 280.20 66.75 Z"
         id="path37" />
      <path
         fill="#000000"
         opacity="1.00"
         d=" M 288.33 71.95 C 288.95 71.54 289.57 71.14 290.21 70.75 C 297.92 74.31 306.87 74.33 314.22 78.75 C 305.58 76.54 297.13 73.47 288.33 71.95 Z"
         id="path39" />
      <path
         fill="#000000"
         opacity="1.00"
         d=" M 176.80 111.98 C 181.92 109.09 186.92 105.92 192.44 103.79 C 187.68 107.28 182.63 110.63 176.80 111.98 Z"
         id="path41" />
      <path
         fill="#000000"
         opacity="1.00"
         d=" M 292.42 113.61 C 293.49 110.91 296.03 109.26 298.15 107.45 C 297.02 111.50 294.86 115.97 296.97 120.09 C 300.82 128.90 304.46 137.86 306.70 147.23 C 307.66 150.38 305.88 153.54 303.77 155.77 C 299.25 160.24 293.55 163.16 288.23 166.53 C 288.66 178.60 285.47 190.44 282.01 201.90 C 279.22 210.22 277.47 219.04 273.00 226.69 C 273.48 224.10 274.21 221.56 275.25 219.14 C 279.65 208.95 281.17 197.86 283.23 187.04 C 284.70 181.11 283.20 174.85 284.98 168.97 C 274.06 171.89 263.76 177.24 252.42 178.67 C 259.98 174.90 268.25 172.82 275.66 168.70 C 285.76 164.84 295.02 158.98 302.91 151.59 C 303.01 149.03 302.93 146.43 302.08 143.99 C 299.54 136.06 296.82 128.17 293.34 120.60 C 292.45 118.44 291.31 115.90 292.42 113.61 Z"
         id="path43" />
      <path
         fill="#000000"
         opacity="1.00"
         d=" M 263.77 117.88 C 267.11 118.51 270.34 119.63 273.40 121.12 C 273.21 123.75 272.20 126.17 270.10 127.84 C 270.39 125.96 270.68 124.09 270.93 122.21 C 268.47 120.89 266.04 119.51 263.77 117.88 Z"
         id="path45" />
      <path
         fill="#000000"
         opacity="1.00"
         d=" M 205.07 126.07 C 206.62 123.59 207.99 120.96 210.10 118.90 C 209.23 126.20 203.32 131.62 197.02 134.66 C 199.56 131.67 202.77 129.27 205.07 126.07 Z"
         id="path47" />
      <path
         fill="#000000"
         opacity="1.00"
         d=" M 268.33 128.63 C 269.81 127.36 271.37 129.95 269.86 130.92 C 268.39 132.23 266.79 129.58 268.33 128.63 Z"
         id="path49" />
      <path
         fill="#000000"
         opacity="1.00"
         d=" M 160.37 136.30 C 163.79 134.05 167.99 133.64 171.98 133.92 C 171.98 134.60 171.98 135.97 171.98 136.66 C 166.61 138.35 162.10 141.75 157.01 144.01 C 154.98 145.54 153.66 147.79 151.93 149.62 C 153.22 144.46 155.60 139.10 160.37 136.30 M 158.35 142.35 C 160.70 141.25 162.79 139.67 164.51 137.72 C 161.83 138.22 159.39 139.74 158.35 142.35 Z"
         id="path51" />
      <path
         fill="#000000"
         opacity="1.00"
         d=" M 104.53 137.35 C 105.37 136.73 106.21 136.12 107.06 135.52 C 111.64 139.61 115.06 145.06 116.18 151.16 C 114.04 148.53 112.20 145.51 109.10 143.91 C 106.55 142.60 105.73 139.71 104.53 137.35 Z"
         id="path53" />
      <path
         fill="#000000"
         opacity="1.00"
         d=" M 259.00 265.94 C 264.52 264.35 270.36 264.56 276.02 265.00 C 276.12 265.49 276.32 266.47 276.42 266.96 C 270.99 267.15 265.36 266.33 260.14 268.21 C 248.72 271.64 237.26 275.23 226.64 280.75 C 223.70 282.33 220.50 283.34 217.23 283.96 C 231.07 277.78 244.24 269.84 259.00 265.94 Z"
         id="path55" />
      <path
         fill="#000000"
         opacity="1.00"
         d=" M 134.59 322.93 C 135.96 314.77 138.81 306.97 142.86 299.77 C 140.92 307.45 138.69 315.11 137.80 323.01 C 137.00 322.99 135.39 322.95 134.59 322.93 Z"
         id="path57" />
    </g>
  </g>
</svg>
