<?xml version="1.0" encoding="UTF-8" standalone="no"?>
<svg
   xmlns:dc="http://purl.org/dc/elements/1.1/"
   xmlns:cc="http://creativecommons.org/ns#"
   xmlns:rdf="http://www.w3.org/1999/02/22-rdf-syntax-ns#"
   xmlns:svg="http://www.w3.org/2000/svg"
   xmlns="http://www.w3.org/2000/svg"
   xmlns:sodipodi="http://sodipodi.sourceforge.net/DTD/sodipodi-0.dtd"
   xmlns:inkscape="http://www.inkscape.org/namespaces/inkscape"
   width="530pt"
   height="335pt"
   viewBox="0 0 530 335"
   version="1.1"
   id="svg60"
   sodipodi:docname="red-03.svg"
   inkscape:version="0.92.4 (5da689c313, 2019-01-14)">
  <metadata
     id="metadata66">
    <rdf:RDF>
      <cc:Work
         rdf:about="">
        <dc:format>image/svg+xml</dc:format>
        <dc:type
           rdf:resource="http://purl.org/dc/dcmitype/StillImage" />
        <dc:title />
      </cc:Work>
    </rdf:RDF>
  </metadata>
  <defs
     id="defs64" />
  <sodipodi:namedview
     pagecolor="#ffffff"
     bordercolor="#666666"
     borderopacity="1"
     objecttolerance="10"
     gridtolerance="10"
     guidetolerance="10"
     inkscape:pageopacity="0"
     inkscape:pageshadow="2"
     inkscape:window-width="1851"
     inkscape:window-height="1057"
     id="namedview62"
     showgrid="false"
     inkscape:zoom="0.40613208"
     inkscape:cx="-56.631823"
     inkscape:cy="234.01733"
     inkscape:window-x="-8"
     inkscape:window-y="-8"
     inkscape:window-maximized="1"
     inkscape:current-layer="layer1" />
  <g
     inkscape:groupmode="layer"
     id="layer1"
     inkscape:label="bg">
    <rect
       style="opacity:1;fill:#ff2a2a;fill-opacity:1;stroke:#ff2a2a;stroke-width:78.12735748;stroke-linecap:butt;stroke-linejoin:round;stroke-miterlimit:4;stroke-dasharray:none;stroke-opacity:1"
       id="rect838"
       width="425.37259"
       height="240.12263"
       x="52.313705"
       y="47.438683" />
  </g>
  <g
     inkscape:groupmode="layer"
     id="layer2"
     inkscape:label="fg">
    <g
       id="#ffffffff"
       style="fill:#000000">
      <path
         fill="#ffffff"
         opacity="1.00"
         d=" M 212.13 31.01 C 220.26 26.33 229.67 23.72 239.07 24.01 C 247.40 24.05 256.18 23.49 263.93 27.09 C 265.32 27.62 266.10 28.94 267.03 30.02 C 263.10 32.10 258.89 33.55 254.58 34.59 C 257.70 35.25 260.91 34.86 264.06 35.21 C 272.28 36.36 279.53 43.51 280.01 51.92 C 280.55 58.07 276.47 63.18 273.06 67.85 C 274.70 69.76 277.29 71.23 277.80 73.88 C 278.46 83.56 278.21 93.42 280.85 102.85 C 284.90 105.41 288.96 108.27 291.56 112.39 C 293.42 114.90 294.61 118.03 297.23 119.87 C 299.93 121.14 302.95 121.47 305.82 122.19 C 322.10 125.34 338.28 129.30 353.80 135.21 C 363.26 139.12 372.91 143.37 380.40 150.55 C 385.51 156.45 390.65 162.98 391.58 171.01 C 385.38 171.09 379.15 170.56 372.99 171.44 C 363.75 172.79 354.39 172.85 345.10 173.62 C 321.38 175.48 297.64 176.68 273.90 178.05 C 275.32 191.42 279.25 204.54 286.03 216.19 C 290.49 225.12 296.76 233.09 303.91 240.01 C 311.78 243.30 320.47 241.39 328.72 241.39 C 326.65 245.88 322.89 249.14 318.97 252.00 C 323.98 250.66 328.79 248.70 333.62 246.84 C 337.30 245.42 340.74 242.86 344.85 243.02 C 344.97 245.42 345.19 247.93 344.18 250.19 C 341.80 256.17 338.34 261.65 336.06 267.68 C 343.67 269.29 351.06 272.17 357.61 276.40 C 360.87 278.38 362.93 281.69 365.25 284.62 C 373.42 296.28 377.34 310.15 383.30 322.94 C 374.54 323.23 365.80 322.21 357.04 322.54 C 347.96 322.14 338.92 323.59 329.86 322.70 C 322.89 322.07 315.91 323.11 308.95 322.56 C 303.95 322.81 299.04 324.12 294.02 323.99 C 286.97 324.16 280.05 322.36 273.00 322.53 C 260.29 322.62 247.58 322.38 234.87 322.65 C 218.60 323.86 202.30 321.56 186.04 322.96 C 180.70 323.13 175.37 322.76 170.04 322.55 C 148.36 322.51 126.69 322.56 105.01 322.52 C 101.61 322.47 98.23 322.87 94.84 323.06 C 96.54 312.77 101.89 303.42 108.60 295.58 C 117.31 286.55 128.70 280.90 139.46 274.72 C 147.86 270.08 153.75 261.18 154.82 251.64 C 155.17 247.67 156.83 244.03 158.64 240.54 C 159.04 240.16 159.86 239.42 160.27 239.05 C 148.27 243.01 133.11 244.08 123.31 234.70 C 124.79 233.03 126.31 231.27 128.48 230.50 C 135.63 227.50 142.45 223.49 148.03 218.06 C 142.14 219.98 136.17 221.74 130.56 224.42 C 128.42 225.49 125.94 224.99 123.76 224.32 C 126.69 214.76 132.58 206.10 140.67 200.18 C 134.20 197.40 127.64 194.77 121.40 191.47 C 112.80 187.39 105.33 181.15 99.40 173.74 C 93.26 166.45 88.28 158.13 85.11 149.12 C 83.62 145.19 80.80 141.09 82.67 136.76 C 86.66 138.14 90.56 139.83 94.71 140.74 C 88.02 135.69 81.44 130.48 75.15 124.95 C 69.27 119.35 63.09 113.67 59.77 106.09 C 63.65 105.17 67.67 105.27 71.60 104.67 C 84.39 102.52 97.07 99.43 109.32 95.13 C 133.52 87.29 156.89 76.37 177.61 61.52 C 183.11 57.90 186.46 52.03 189.57 46.40 C 192.46 41.37 192.45 35.31 195.12 30.18 C 198.79 33.35 200.85 38.03 200.57 42.89 C 204.22 38.75 207.17 33.76 212.13 31.01 M 218.16 32.27 C 209.51 36.54 203.84 44.65 198.38 52.28 C 198.66 48.02 197.96 43.80 197.27 39.62 C 195.31 42.75 193.94 46.18 192.46 49.54 C 190.23 54.61 186.00 58.37 181.99 62.03 C 172.79 69.39 162.95 75.96 152.54 81.46 C 127.69 94.39 100.82 103.52 73.26 108.51 C 76.78 109.30 80.41 108.99 83.98 109.05 C 90.83 109.26 97.40 106.47 104.27 107.08 C 100.09 108.68 95.62 109.26 91.19 109.67 C 83.08 110.61 74.99 112.04 66.80 111.50 C 69.18 114.02 71.33 116.78 74.08 118.91 C 86.02 128.48 96.99 139.93 111.50 145.61 C 115.60 147.53 120.56 147.62 124.00 150.85 C 111.09 152.03 99.28 145.80 87.02 143.04 C 89.08 147.99 90.52 153.23 93.23 157.90 C 96.75 163.82 100.75 169.51 105.42 174.59 C 114.64 184.80 127.03 191.67 139.82 196.38 C 143.28 197.87 147.07 197.46 150.72 197.30 C 153.35 197.02 155.09 199.38 156.90 200.87 C 152.57 201.13 147.78 200.24 143.88 202.62 C 137.92 207.18 132.81 213.01 129.67 219.87 C 136.40 218.42 142.68 215.28 149.60 214.56 C 150.81 214.52 152.02 214.49 153.22 214.47 C 149.90 225.21 138.62 230.33 129.16 234.59 C 134.92 237.69 141.66 238.18 148.08 237.99 C 155.76 237.74 162.53 233.38 170.17 232.86 C 166.48 237.95 161.51 242.20 159.20 248.20 C 166.66 247.25 173.83 244.70 181.35 244.10 C 173.99 247.74 165.89 249.67 158.80 253.89 C 158.19 255.80 157.69 257.75 157.35 259.73 C 169.03 262.72 178.92 270.26 187.10 278.88 C 199.59 290.69 210.06 304.75 217.29 320.37 C 221.12 321.41 225.11 320.94 229.03 321.02 C 245.34 321.13 261.65 320.91 277.96 321.08 C 284.22 321.03 290.65 323.00 296.76 320.92 C 303.38 317.45 307.56 310.90 311.84 305.01 C 301.98 303.79 291.96 304.44 282.19 302.57 C 286.52 299.49 291.96 298.97 296.74 296.87 C 307.02 292.13 316.98 285.86 323.78 276.60 C 330.88 268.56 336.47 259.17 340.02 249.04 C 327.60 252.87 315.61 258.16 302.81 260.77 C 308.22 254.52 315.61 250.44 321.78 245.01 C 315.26 244.96 307.97 246.51 302.16 242.65 C 294.68 237.19 289.24 229.49 284.55 221.61 C 278.68 211.52 273.79 200.66 271.91 189.07 C 271.22 185.36 271.52 181.50 270.44 177.86 C 260.73 179.38 250.77 178.84 240.95 178.99 C 232.07 179.36 223.48 176.64 215.08 174.13 C 212.06 173.10 208.18 170.71 209.15 166.93 C 210.65 160.37 217.54 157.28 220.40 151.49 C 224.07 143.90 228.51 136.71 232.17 129.13 C 234.12 124.11 236.79 119.43 239.97 115.10 C 241.95 113.68 243.84 112.03 246.17 111.21 C 249.48 110.81 252.82 111.09 256.15 111.03 C 255.82 103.29 254.02 95.43 255.89 87.76 C 256.70 83.79 260.79 79.98 265.03 81.29 C 269.85 83.49 272.25 88.76 274.01 93.46 C 274.22 93.55 274.63 93.73 274.84 93.82 C 274.99 93.46 275.29 92.75 275.44 92.39 C 275.53 85.74 275.16 79.01 273.51 72.54 C 271.99 71.90 270.43 71.38 268.84 70.99 C 265.77 70.46 263.22 68.25 260.02 68.38 C 256.98 77.38 250.48 84.99 242.20 89.60 C 241.05 86.95 239.57 84.47 237.90 82.13 C 234.88 80.05 232.20 77.52 229.70 74.85 C 235.37 75.27 240.16 78.66 243.99 82.62 L 245.02 82.55 C 252.29 77.58 257.94 68.22 255.34 59.29 C 251.44 53.77 243.97 54.13 237.99 53.67 C 241.96 50.72 247.20 51.45 251.63 52.72 C 254.67 54.08 256.91 56.65 259.63 58.50 C 262.97 60.78 266.28 63.14 269.02 66.14 C 272.54 63.01 275.86 59.02 276.05 54.09 C 276.57 48.22 272.55 42.97 267.58 40.32 C 261.12 37.35 253.82 38.58 247.04 39.46 C 240.56 40.16 234.79 43.38 228.63 45.19 C 236.85 36.79 248.17 32.30 259.28 29.14 C 245.68 26.33 231.00 26.54 218.16 32.27 M 259.98 62.83 C 259.97 64.23 259.97 65.63 259.98 67.03 C 261.37 67.02 262.77 67.01 264.17 67.00 C 262.77 65.61 261.37 64.22 259.98 62.83 M 258.27 92.34 C 260.25 92.98 262.77 92.95 264.05 94.87 C 267.74 100.14 268.14 107.71 264.43 113.09 C 265.31 113.06 267.06 112.99 267.94 112.96 C 272.90 107.24 272.84 99.04 271.12 92.07 C 269.63 88.82 267.68 84.92 263.96 83.93 C 259.62 84.11 259.10 89.10 258.27 92.34 M 275.21 94.92 C 274.13 96.17 275.27 98.40 274.98 100.00 C 275.47 105.34 272.32 109.88 269.25 113.90 C 276.89 115.31 284.42 117.31 292.05 118.80 C 288.21 113.42 283.18 109.11 278.38 104.64 C 275.66 102.21 276.64 98.16 275.72 95.01 L 275.21 94.92 M 258.50 95.54 C 258.27 101.24 259.09 106.89 260.18 112.47 C 262.37 110.97 264.71 108.98 264.49 106.03 C 265.08 102.23 263.21 98.81 261.88 95.40 C 261.04 95.43 259.34 95.50 258.50 95.54 M 245.23 115.13 C 240.66 118.64 238.60 124.29 235.90 129.19 C 232.02 135.96 229.00 143.20 224.69 149.73 C 225.73 149.24 227.80 148.26 228.84 147.78 C 224.46 155.51 215.34 159.68 212.22 168.13 C 216.11 171.29 221.32 172.51 226.05 174.03 C 242.49 177.54 259.38 175.70 275.96 174.46 C 286.33 174.07 296.65 172.83 307.03 173.01 C 322.79 171.36 338.65 171.15 354.39 169.34 C 346.49 167.00 338.16 167.23 330.02 166.58 C 314.78 164.69 299.39 164.77 284.14 163.05 C 267.72 163.26 251.46 159.77 235.03 160.64 C 231.36 161.26 227.92 162.93 224.15 163.07 C 226.74 158.47 232.29 157.54 236.97 156.47 C 241.70 156.85 246.26 158.74 251.10 158.54 C 258.43 159.45 265.82 158.71 273.17 159.22 C 311.40 161.56 349.62 164.27 387.73 168.12 C 385.27 161.48 381.44 155.06 375.57 150.91 C 364.31 142.40 350.81 137.61 337.49 133.35 C 312.05 126.48 286.15 121.53 260.59 115.15 C 255.58 114.25 250.07 112.86 245.23 115.13 M 156.19 260.84 C 155.36 262.49 154.57 264.16 153.82 265.85 C 159.24 269.08 164.68 272.32 169.60 276.32 C 175.03 280.66 181.45 284.17 185.24 290.22 C 180.67 287.34 177.04 283.23 172.57 280.23 C 165.64 276.07 158.92 271.36 151.15 268.88 C 150.15 270.27 149.15 271.66 148.13 273.05 C 155.02 276.36 161.06 281.12 166.84 286.05 C 171.40 291.52 176.21 296.87 179.81 303.05 C 183.14 308.75 186.02 314.72 188.42 320.87 C 197.04 321.20 205.67 320.95 214.30 321.02 C 207.10 306.84 197.79 293.73 186.60 282.43 C 177.92 273.51 168.67 264.01 156.19 260.84 M 327.81 279.03 C 328.53 280.60 329.54 282.02 330.49 283.46 C 338.05 294.67 343.00 307.59 344.60 321.04 C 355.68 321.30 366.82 320.41 377.86 321.62 C 375.51 313.39 372.15 305.47 368.21 297.88 C 365.71 292.88 363.35 287.65 359.41 283.57 C 352.93 276.16 343.06 273.35 334.05 270.35 C 331.42 272.79 329.45 275.86 327.81 279.03 M 147.44 274.89 C 137.91 280.54 127.63 285.04 118.92 291.99 C 109.48 299.18 102.03 309.34 99.33 321.02 C 127.78 321.02 156.23 321.04 184.68 321.01 C 180.39 309.43 173.87 298.63 165.62 289.45 C 160.00 284.15 154.98 277.46 147.44 274.89 M 326.68 280.05 C 323.44 283.80 319.54 286.85 315.91 290.20 C 316.99 298.21 317.95 306.30 317.43 314.41 C 317.00 316.40 316.70 318.42 316.35 320.44 C 324.82 321.50 333.40 320.94 341.91 321.54 C 338.79 307.08 334.37 292.78 326.68 280.05 M 297.73 300.68 C 303.65 301.27 309.60 300.95 315.54 301.03 C 315.30 297.77 315.03 294.51 314.54 291.28 C 309.18 294.80 303.79 298.49 297.73 300.68 M 302.82 321.33 C 306.52 321.06 310.23 320.98 313.95 321.01 C 314.20 316.65 314.52 312.29 314.61 307.91 C 311.38 312.89 307.75 317.92 302.82 321.33 Z"
         id="path35"
         style="fill:#000000" />
      <path
         fill="#ffffff"
         opacity="1.00"
         d=" M 211.23 48.25 C 216.17 46.55 221.74 47.47 226.43 49.52 C 226.93 50.57 227.40 51.63 227.83 52.72 C 224.84 53.07 221.86 53.57 218.92 54.19 C 221.88 56.95 225.97 60.10 225.11 64.70 C 221.72 63.91 218.57 62.39 216.03 60.00 C 218.36 60.32 220.68 60.73 223.02 61.08 C 220.55 58.56 217.46 56.91 214.14 55.84 C 217.11 54.03 219.86 51.75 223.22 50.69 C 219.86 50.04 216.32 49.35 212.96 50.41 C 210.52 51.23 209.79 54.61 207.10 54.94 C 208.03 52.51 208.35 49.17 211.23 48.25 Z"
         id="path37"
         style="fill:#000000" />
      <path
         fill="#ffffff"
         opacity="1.00"
         d=" M 205.58 71.57 C 208.67 68.71 212.79 66.15 217.19 67.17 C 219.93 67.72 220.84 70.84 222.05 72.96 C 219.70 72.21 217.64 70.87 215.68 69.43 C 209.92 71.50 204.72 75.11 200.89 79.90 C 198.58 82.39 196.92 85.53 194.00 87.41 C 197.14 81.65 201.08 76.34 205.58 71.57 Z"
         id="path39"
         style="fill:#000000" />
      <path
         fill="#ffffff"
         opacity="1.00"
         d=" M 257.62 76.34 C 259.76 76.12 261.90 76.00 264.05 75.90 C 260.63 78.32 257.58 81.29 253.83 83.24 C 254.93 80.85 256.25 78.58 257.62 76.34 Z"
         id="path41"
         style="fill:#000000" />
      <path
         fill="#ffffff"
         opacity="1.00"
         d=" M 216.61 83.21 C 219.43 84.00 222.20 84.95 224.99 85.85 C 225.90 87.64 226.82 89.41 227.74 91.19 C 224.70 89.58 221.64 86.99 217.96 87.57 C 214.95 87.93 211.98 88.57 208.97 88.99 C 208.68 88.56 208.10 87.69 207.81 87.26 C 211.23 87.30 214.06 85.24 216.61 83.21 Z"
         id="path43"
         style="fill:#000000" />
      <path
         fill="#ffffff"
         opacity="1.00"
         d=" M 198.39 109.14 C 201.04 99.48 209.65 91.71 219.68 90.55 C 221.02 90.88 222.37 91.21 223.72 91.53 C 228.70 96.65 235.76 102.04 235.00 110.02 C 234.83 116.72 230.03 121.89 226.00 126.76 C 224.43 127.33 222.81 127.76 221.14 127.86 C 214.26 128.32 207.38 129.02 200.49 128.88 C 198.07 122.69 196.29 115.68 198.39 109.14 M 208.20 99.28 C 210.33 100.02 212.53 100.64 214.50 101.77 C 219.13 105.19 221.17 111.39 220.43 116.97 C 219.92 121.03 216.71 123.84 214.13 126.71 C 217.24 125.99 220.54 126.04 223.50 124.77 C 231.44 119.53 235.20 107.42 229.07 99.42 C 226.52 95.40 221.44 94.26 216.98 94.54 C 213.60 95.07 210.98 97.47 208.20 99.28 M 207.09 102.03 C 202.81 105.58 201.60 111.67 201.92 117.00 C 201.86 120.41 203.06 124.26 206.25 125.98 C 211.00 126.25 216.13 123.45 217.39 118.62 C 220.13 111.70 215.43 101.15 207.09 102.03 Z"
         id="path45"
         style="fill:#000000" />
      <path
         fill="#ffffff"
         opacity="1.00"
         d=" M 109.14 105.44 C 109.61 105.10 110.56 104.43 111.03 104.09 C 111.64 104.58 112.24 105.08 112.85 105.57 C 112.38 105.90 111.44 106.57 110.96 106.91 C 110.35 106.42 109.75 105.93 109.14 105.44 Z"
         id="path47"
         style="fill:#000000" />
      <path
         fill="#ffffff"
         opacity="1.00"
         d=" M 104.14 106.40 C 104.60 106.08 105.53 105.45 106.00 105.13 C 106.47 105.45 107.40 106.08 107.87 106.40 C 107.24 106.91 106.61 107.43 105.99 107.94 C 105.37 107.43 104.75 106.91 104.14 106.40 Z"
         id="path49"
         style="fill:#000000" />
      <path
         fill="#ffffff"
         opacity="1.00"
         d=" M 157.19 141.07 C 159.95 135.20 164.64 130.40 170.07 126.93 C 165.57 133.77 158.77 140.30 158.96 149.07 C 161.97 159.55 172.08 165.20 180.41 171.07 C 172.88 169.16 165.78 165.21 160.39 159.58 C 155.74 154.82 154.01 147.08 157.19 141.07 Z"
         id="path51"
         style="fill:#000000" />
      <path
         fill="#ffffff"
         opacity="1.00"
         d=" M 335.61 146.00 C 340.25 145.55 344.56 148.02 347.34 151.59 C 343.12 150.49 339.01 148.79 335.61 146.00 Z"
         id="path53"
         style="fill:#000000" />
      <path
         fill="#ffffff"
         opacity="1.00"
         d=" M 378.92 219.15 C 392.02 214.18 406.11 212.59 420.01 212.05 C 429.56 212.55 439.23 213.01 448.45 215.74 C 455.03 217.71 461.47 220.26 467.43 223.70 C 468.26 224.64 469.10 225.56 469.97 226.48 C 470.02 258.65 469.85 290.82 469.99 322.99 C 463.66 322.99 457.32 323.04 451.01 322.56 C 434.30 322.50 417.58 322.38 400.89 322.98 C 402.08 318.78 402.03 314.34 403.37 310.18 C 407.16 297.57 415.08 286.51 424.57 277.54 C 425.58 276.46 426.89 275.79 428.23 275.20 C 418.88 275.54 409.83 278.47 400.93 281.15 C 392.30 283.63 384.34 287.91 375.76 290.53 C 382.37 272.41 398.76 260.37 414.83 251.03 C 421.93 246.48 430.42 245.52 438.25 242.88 C 425.97 237.76 412.78 235.57 399.89 232.57 C 392.38 230.74 384.68 230.04 377.04 228.99 C 373.03 228.44 368.68 228.69 365.13 226.44 C 369.10 222.98 374.08 221.04 378.92 219.15 M 374.75 224.94 C 378.55 225.37 382.35 225.87 386.17 226.20 C 396.81 227.15 407.06 230.30 417.51 232.34 C 427.98 234.32 437.73 238.82 447.92 241.81 C 451.32 242.77 455.10 242.67 458.16 244.67 C 446.06 244.58 434.14 247.50 422.86 251.74 C 413.59 255.04 405.72 261.15 398.02 267.11 C 392.77 271.92 387.32 276.76 383.72 283.00 C 388.02 281.59 392.27 279.99 396.66 278.89 C 408.94 275.72 420.93 271.22 433.60 269.73 C 438.11 269.34 441.98 266.72 446.38 265.89 C 441.50 271.02 434.57 273.55 429.48 278.48 C 421.41 284.97 415.37 293.54 410.46 302.58 C 407.66 308.36 406.06 314.65 405.38 321.02 C 426.42 321.24 447.48 320.53 468.50 321.55 C 468.68 316.03 467.90 310.54 468.01 305.03 C 468.14 287.33 467.85 269.63 468.17 251.93 C 469.11 244.43 467.24 236.88 468.51 229.41 C 454.94 219.34 437.48 216.73 421.01 215.95 C 405.22 216.06 389.35 218.81 374.75 224.94 Z"
         id="path55"
         style="fill:#000000" />
      <path
         fill="#ffffff"
         opacity="1.00"
         d=" M 210.80 260.93 C 217.19 257.10 222.86 251.88 229.92 249.27 C 235.89 250.99 235.48 258.00 234.49 262.86 C 237.26 260.85 240.09 258.91 242.94 257.03 C 244.99 257.03 247.04 257.03 249.10 257.04 C 250.49 260.22 252.41 263.17 253.56 266.45 C 254.90 273.18 254.98 280.86 250.66 286.59 C 247.00 292.49 240.01 296.10 233.08 295.42 C 228.04 294.68 223.26 292.36 219.57 288.86 C 223.64 289.91 227.25 292.27 231.44 292.93 C 239.01 291.45 247.52 287.38 249.56 279.24 C 250.71 272.73 250.79 264.83 245.39 260.08 C 239.44 264.66 231.63 268.73 223.98 266.71 C 226.07 264.66 228.53 262.98 230.35 260.67 C 231.68 258.44 230.42 255.97 229.90 253.73 C 223.65 256.40 218.11 262.00 210.80 260.93 Z"
         id="path57"
         style="fill:#000000" />
    </g>
  </g>
</svg>
