<?xml version="1.0" encoding="UTF-8" standalone="no"?>
<svg
   xmlns:dc="http://purl.org/dc/elements/1.1/"
   xmlns:cc="http://creativecommons.org/ns#"
   xmlns:rdf="http://www.w3.org/1999/02/22-rdf-syntax-ns#"
   xmlns:svg="http://www.w3.org/2000/svg"
   xmlns="http://www.w3.org/2000/svg"
   xmlns:sodipodi="http://sodipodi.sourceforge.net/DTD/sodipodi-0.dtd"
   xmlns:inkscape="http://www.inkscape.org/namespaces/inkscape"
   width="530pt"
   height="335pt"
   viewBox="0 0 530 335"
   version="1.1"
   id="svg62"
   sodipodi:docname="yellow-02.svg"
   inkscape:version="0.92.4 (5da689c313, 2019-01-14)">
  <metadata
     id="metadata68">
    <rdf:RDF>
      <cc:Work
         rdf:about="">
        <dc:format>image/svg+xml</dc:format>
        <dc:type
           rdf:resource="http://purl.org/dc/dcmitype/StillImage" />
        <dc:title />
      </cc:Work>
    </rdf:RDF>
  </metadata>
  <defs
     id="defs66" />
  <sodipodi:namedview
     pagecolor="#ffffff"
     bordercolor="#666666"
     borderopacity="1"
     objecttolerance="10"
     gridtolerance="10"
     guidetolerance="10"
     inkscape:pageopacity="0"
     inkscape:pageshadow="2"
     inkscape:window-width="1851"
     inkscape:window-height="1057"
     id="namedview64"
     showgrid="false"
     inkscape:zoom="0.40613208"
     inkscape:cx="387.55972"
     inkscape:cy="223.33333"
     inkscape:window-x="-8"
     inkscape:window-y="-8"
     inkscape:window-maximized="1"
     inkscape:current-layer="layer1" />
  <g
     inkscape:groupmode="layer"
     id="layer1"
     inkscape:label="bg">
    <rect
       style="opacity:1;fill:#ff2a2a;fill-opacity:1;stroke:#ff2a2a;stroke-width:78.12735748;stroke-linecap:butt;stroke-linejoin:round;stroke-miterlimit:4;stroke-dasharray:none;stroke-opacity:1"
       id="rect838"
       width="425.37259"
       height="240.12263"
       x="52.313705"
       y="47.438683" />
  </g>
  <g
     inkscape:groupmode="layer"
     id="layer2"
     inkscape:label="fg">
    <g
       id="#000000ff"
       style="fill:#000000">
      <path
         fill="#000000"
         opacity="1.00"
         d=" M 400.70 27.07 C 406.76 31.80 410.25 38.84 413.43 45.65 C 417.05 53.60 420.36 62.08 420.01 70.98 C 420.48 77.47 416.89 84.05 411.07 87.02 C 402.91 91.70 393.45 89.06 384.65 88.87 C 403.27 102.57 419.84 120.58 427.13 142.91 C 433.53 160.47 433.69 180.31 426.86 197.77 C 424.40 203.36 422.41 209.49 417.86 213.80 C 416.27 204.89 417.78 195.51 414.46 186.91 C 413.67 200.74 407.27 214.73 395.68 222.72 C 389.63 226.90 382.97 230.66 375.56 231.56 C 369.98 232.52 364.40 231.18 358.85 230.73 C 361.97 227.51 365.68 224.60 367.34 220.28 C 368.83 216.35 369.90 212.20 370.23 208.00 C 370.51 202.31 367.29 197.30 363.98 192.98 C 365.08 199.14 367.18 205.08 368.92 211.08 C 368.00 211.32 367.08 211.57 366.17 211.83 C 363.29 209.88 361.00 207.28 358.81 204.62 C 358.15 209.60 358.61 215.08 355.36 219.29 C 354.03 222.02 350.05 224.19 351.63 227.60 C 358.48 249.46 370.29 269.81 386.09 286.42 C 375.39 283.85 366.55 277.06 357.75 270.83 C 359.98 276.29 361.58 282.05 362.17 287.93 C 362.34 292.29 362.21 296.66 362.25 301.03 C 362.14 308.54 359.43 315.67 356.31 322.40 L 355.51 322.87 C 348.67 323.25 341.80 322.66 334.97 322.23 C 294.62 322.24 254.27 322.23 213.92 322.24 C 211.60 322.26 209.35 323.44 207.04 322.74 C 202.76 321.77 198.33 322.41 193.99 322.24 C 188.68 322.39 183.30 321.74 178.06 322.85 C 169.35 323.43 160.62 322.15 151.92 322.33 C 147.00 323.59 141.98 322.57 137.02 322.24 C 118.67 322.22 100.32 322.25 81.96 322.23 C 70.02 323.04 57.92 323.58 46.01 322.16 C 46.08 316.75 46.37 311.35 46.77 305.95 C 46.75 258.79 46.83 211.62 46.73 164.46 C 53.64 158.98 61.36 154.64 68.41 149.36 C 70.07 148.28 71.83 146.84 73.94 147.02 C 76.33 147.31 78.60 148.14 80.96 148.58 C 97.70 151.02 114.31 154.31 130.99 157.09 C 136.41 157.55 142.09 157.11 147.21 155.18 C 150.01 152.19 149.85 147.48 151.84 143.94 C 154.84 136.66 161.42 132.04 167.27 127.21 C 157.64 127.65 147.09 126.40 139.54 119.82 C 149.11 118.55 158.99 118.49 168.14 115.08 C 183.18 109.53 197.33 100.63 207.41 88.01 C 205.45 82.43 202.00 77.17 202.01 71.07 C 201.29 59.25 206.90 48.12 214.07 39.09 C 217.13 35.58 221.08 32.01 226.01 32.01 C 231.94 33.10 236.44 37.47 241.41 40.55 C 246.33 43.50 250.47 47.73 255.87 49.86 C 265.36 46.97 274.75 42.24 284.99 43.02 C 301.81 42.03 318.04 47.84 332.97 55.01 C 338.91 57.93 344.07 62.43 350.56 64.17 C 359.25 66.89 366.68 72.50 372.98 78.94 C 375.53 78.66 378.01 77.67 380.07 76.15 C 388.76 69.24 395.65 59.97 399.31 49.46 C 401.74 42.25 401.06 34.53 400.70 27.07 M 221.32 36.30 C 215.72 40.10 211.79 45.85 209.04 51.94 C 205.49 59.99 203.34 69.31 206.29 77.89 C 209.19 88.02 217.88 95.11 226.46 100.49 C 235.01 102.32 244.00 102.03 252.68 101.36 C 252.12 98.50 251.95 95.60 252.00 92.70 C 245.45 92.98 239.11 96.18 232.49 94.66 C 226.94 93.23 222.82 89.03 219.09 84.93 C 214.25 78.67 212.57 70.25 214.30 62.57 C 216.74 55.83 218.01 47.71 224.38 43.37 C 226.97 42.72 230.34 42.59 232.21 44.87 C 237.68 51.04 240.94 58.91 242.54 66.94 C 244.29 75.06 245.99 83.73 251.58 90.19 C 253.05 84.88 253.90 79.33 256.31 74.33 C 259.10 68.59 263.86 64.21 268.09 59.56 C 262.10 58.39 257.11 54.79 252.05 51.63 C 253.44 54.83 254.83 58.04 255.93 61.36 C 253.01 55.84 248.79 51.22 244.60 46.67 C 240.16 42.51 234.90 39.39 229.77 36.19 C 227.29 34.60 223.62 34.21 221.32 36.30 M 403.98 34.50 C 404.81 48.42 398.27 61.90 388.81 71.78 C 385.20 75.67 380.28 77.89 376.22 81.21 C 376.13 81.78 375.93 82.91 375.83 83.48 C 383.21 84.61 390.39 87.29 397.94 87.05 C 403.91 87.06 410.69 85.80 414.43 80.65 C 417.82 75.67 417.30 69.21 416.47 63.54 C 414.09 53.23 409.82 43.32 403.98 34.50 M 217.90 55.21 C 215.45 61.93 215.17 69.53 217.77 76.26 C 219.98 83.50 226.02 89.57 233.37 91.52 C 238.31 92.42 243.27 91.23 248.18 90.71 C 245.91 87.21 243.77 83.58 242.36 79.63 C 240.99 75.56 240.75 71.23 239.64 67.10 C 237.92 60.55 235.52 54.19 232.97 47.92 C 231.75 44.98 228.25 43.20 225.23 44.53 C 221.57 47.04 219.10 50.98 217.90 55.21 M 274.57 46.72 C 269.23 47.34 264.40 49.78 259.46 51.70 C 262.54 54.92 266.90 56.41 270.91 58.13 C 275.55 55.27 280.63 53.06 286.00 51.99 C 297.67 49.30 309.92 52.46 320.42 57.72 C 314.16 56.64 308.43 53.40 302.03 53.01 C 291.36 52.27 280.61 55.78 271.86 61.81 C 262.04 68.49 255.49 80.08 255.73 92.06 C 255.03 103.87 260.22 115.14 266.87 124.60 C 266.70 118.34 264.29 112.33 264.74 106.03 C 263.88 89.60 273.38 73.69 287.09 65.06 C 290.99 62.36 295.19 59.87 299.92 59.04 C 295.94 61.47 291.47 63.01 287.61 65.66 C 280.94 70.26 274.91 76.11 271.28 83.44 C 266.10 92.51 264.99 103.34 266.12 113.57 C 266.27 115.74 267.37 117.66 268.38 119.53 C 270.88 112.45 273.08 105.22 276.66 98.59 C 281.10 89.55 288.48 82.31 296.60 76.52 C 301.65 73.45 306.91 70.69 312.30 68.25 C 315.90 66.59 319.91 66.60 323.78 66.86 C 324.01 68.83 324.26 70.80 324.71 72.74 C 327.52 69.61 329.23 65.65 332.27 62.69 C 337.59 67.13 339.38 74.07 341.76 80.28 C 348.18 99.30 349.52 120.84 341.85 139.71 C 349.85 135.61 355.37 127.91 359.04 119.91 C 363.32 111.00 364.42 100.69 362.35 91.04 C 361.40 87.51 359.57 84.31 358.25 80.92 C 363.33 86.40 364.13 94.24 364.42 101.37 C 364.22 114.34 358.33 127.00 348.93 135.87 C 345.83 138.68 342.15 140.82 339.44 144.05 C 348.39 142.81 356.51 138.63 364.18 134.08 C 372.81 128.56 379.00 119.31 380.62 109.17 C 382.01 100.32 378.66 91.49 373.43 84.46 C 364.32 72.58 350.09 66.25 336.10 62.09 C 336.82 61.52 337.53 60.95 338.26 60.39 C 329.79 56.49 321.15 52.94 312.35 49.83 C 300.28 45.62 287.17 44.98 274.57 46.72 M 326.76 76.41 C 330.37 78.03 334.18 79.39 338.13 79.86 C 336.10 75.75 335.30 70.90 332.12 67.45 C 330.10 70.30 328.29 73.28 326.76 76.41 M 312.29 71.86 C 315.39 73.64 318.85 74.62 322.13 75.98 C 322.05 73.94 321.98 71.91 321.89 69.87 C 318.61 70.05 315.32 70.52 312.29 71.86 M 304.66 75.63 C 292.89 81.99 282.61 91.87 277.47 104.38 C 273.17 113.37 270.96 123.27 270.69 133.21 C 263.46 128.12 260.05 119.79 255.88 112.34 C 254.07 113.71 252.31 115.26 251.34 117.36 C 247.11 125.12 247.00 134.12 247.14 142.72 C 245.74 136.60 245.92 130.30 246.12 124.07 C 246.78 118.34 250.29 113.04 255.20 110.05 C 254.74 108.34 254.26 106.65 253.76 104.95 C 240.93 105.18 228.10 104.35 215.36 102.94 C 217.26 105.25 219.48 107.28 221.97 108.94 C 226.09 112.11 231.19 115.02 236.55 113.23 C 231.32 117.10 224.48 119.06 220.71 124.69 C 213.90 133.39 213.17 145.03 214.36 155.60 C 218.61 152.38 220.42 146.84 225.07 144.07 C 227.69 142.18 230.87 141.36 234.02 140.88 C 230.84 142.74 227.23 144.00 224.61 146.67 C 222.23 148.85 221.02 151.89 219.63 154.71 C 226.73 154.17 233.29 158.04 237.81 163.25 C 239.99 165.36 241.07 168.64 244.04 169.87 C 248.62 172.22 254.13 172.57 258.13 176.04 C 255.26 180.45 250.36 182.94 245.19 183.38 C 244.76 190.26 245.01 197.17 244.97 204.06 C 244.79 210.74 250.62 215.18 254.44 219.92 C 262.88 218.65 270.81 215.40 278.95 212.98 C 280.95 215.65 279.21 218.77 278.47 221.55 C 277.66 223.64 279.02 225.68 279.13 227.76 C 278.39 229.46 277.48 231.07 276.64 232.73 C 280.22 233.27 283.88 234.41 287.51 233.72 C 292.81 231.35 294.36 225.14 298.58 221.60 C 301.40 220.28 304.56 220.03 307.56 219.35 C 319.43 217.05 330.89 212.50 341.05 205.94 C 343.75 204.25 346.44 201.39 345.77 197.93 C 344.55 190.87 341.69 184.11 338.07 177.96 C 338.53 180.71 339.10 183.45 339.42 186.24 C 337.02 181.33 335.32 176.11 332.79 171.27 C 330.22 166.54 326.96 162.25 324.08 157.73 C 325.00 157.74 326.83 157.78 327.75 157.79 C 332.22 153.88 336.91 150.23 341.41 146.35 C 338.90 146.06 336.38 145.93 333.86 145.94 C 336.49 142.03 338.80 137.88 340.62 133.52 C 343.41 125.00 344.38 115.91 343.59 106.99 C 342.35 99.01 342.09 90.64 338.71 83.17 C 333.91 78.91 326.81 81.42 321.33 78.76 C 316.21 76.48 310.30 72.85 304.66 75.63 M 198.38 101.26 C 184.32 112.44 167.24 121.31 148.90 121.29 C 157.24 125.55 167.03 125.03 176.15 125.19 C 167.67 129.88 159.19 135.72 154.52 144.48 C 152.69 148.39 151.78 152.65 151.04 156.88 C 159.21 155.12 167.70 154.97 175.74 152.64 C 179.26 148.85 181.20 143.55 185.82 140.68 C 181.66 148.46 177.29 156.29 175.07 164.90 C 171.47 178.01 171.60 191.80 173.36 205.18 C 175.85 199.04 177.24 192.43 180.54 186.62 C 184.01 180.94 187.18 174.94 192.06 170.30 C 186.64 179.43 180.55 188.45 178.03 198.91 C 175.65 207.74 175.57 216.98 176.02 226.05 C 177.74 243.19 181.65 260.04 186.48 276.55 C 188.89 282.48 190.40 288.81 193.40 294.48 C 195.32 282.24 196.81 269.61 202.50 258.41 C 201.78 263.61 199.93 268.65 199.97 273.95 C 200.02 279.72 199.57 285.53 200.36 291.27 C 202.24 301.61 206.03 311.49 210.26 321.07 C 255.53 321.04 300.79 321.05 346.05 321.04 C 348.40 321.07 350.73 321.41 353.05 321.81 C 356.09 316.64 358.40 311.05 359.00 305.03 C 361.24 296.00 359.18 286.75 357.14 277.90 C 354.12 266.75 347.51 257.11 341.04 247.72 C 348.06 252.27 351.47 260.12 356.76 266.25 C 362.51 270.86 368.61 275.19 375.24 278.46 C 363.61 262.84 353.75 245.65 348.39 226.82 C 345.21 229.15 341.79 231.45 337.71 231.61 C 337.21 230.35 336.85 229.05 336.64 227.72 C 336.15 223.31 332.13 220.16 328.11 218.97 C 323.77 217.35 319.23 219.17 314.93 220.06 C 309.85 221.65 304.39 221.53 299.38 223.36 C 296.13 228.55 292.96 234.78 286.67 236.70 C 274.09 235.71 261.53 230.49 252.74 221.26 C 248.12 216.67 243.04 211.59 242.11 204.82 C 241.92 197.67 242.08 190.51 242.05 183.35 C 240.40 182.79 238.74 182.25 237.07 181.74 C 239.45 188.26 239.82 195.92 235.89 201.93 C 234.56 204.38 232.07 206.20 231.19 208.85 C 235.25 230.16 242.53 250.93 253.15 269.88 C 255.08 273.18 257.96 276.18 258.18 280.20 C 256.23 279.78 254.30 279.34 252.35 278.95 C 252.04 276.91 249.83 276.68 248.58 275.44 C 246.54 273.62 244.46 271.72 241.82 270.83 C 243.82 275.51 245.31 280.38 246.62 285.29 C 248.44 292.72 248.29 300.42 248.22 308.02 C 248.20 309.95 247.78 311.84 247.29 313.71 C 247.13 311.82 247.07 309.93 247.06 308.05 C 247.19 298.11 244.45 288.45 241.96 278.92 C 240.61 273.29 238.04 268.06 236.64 262.45 C 242.01 265.95 246.48 270.69 252.11 273.80 C 239.98 251.99 230.14 228.25 228.05 203.15 C 227.73 199.94 228.58 196.80 229.52 193.77 C 230.33 197.31 229.31 201.15 230.72 204.56 C 234.32 200.61 236.62 195.43 236.07 190.00 C 236.45 183.25 232.54 177.50 229.85 171.64 C 232.47 174.45 234.57 178.26 238.50 179.38 C 243.56 181.10 249.43 180.48 253.53 176.88 C 249.67 174.70 245.22 173.91 241.31 171.83 C 236.47 169.17 232.35 165.29 229.38 160.63 C 228.21 158.31 225.60 157.28 223.14 157.17 C 219.36 156.40 217.96 160.80 215.83 162.96 C 209.63 154.34 210.15 142.87 212.93 133.10 C 214.95 125.46 220.74 119.51 227.23 115.32 C 221.01 111.55 212.93 108.12 211.59 100.05 C 215.12 99.91 218.68 100.00 222.13 100.83 C 217.81 97.37 212.84 94.57 209.57 89.95 C 206.05 93.92 202.37 97.77 198.38 101.26 M 381.67 90.51 C 382.68 94.98 384.42 99.35 384.25 104.01 C 384.75 114.69 379.38 124.88 371.80 132.11 C 381.79 148.53 388.24 167.73 386.90 187.12 C 385.69 198.83 382.65 211.18 374.20 219.88 C 376.82 215.22 380.16 210.91 381.88 205.80 C 384.08 199.11 385.14 192.06 384.81 185.02 C 385.23 171.82 381.77 158.82 376.65 146.74 C 374.45 151.03 372.90 155.89 369.14 159.14 C 365.79 161.99 362.42 164.82 359.38 168.02 C 360.08 171.81 359.69 175.90 361.66 179.36 C 364.96 185.72 367.72 192.40 371.79 198.32 C 372.42 191.75 371.56 185.12 372.47 178.57 C 373.50 189.98 375.12 201.62 372.94 213.00 C 371.74 218.77 369.32 224.25 366.04 229.13 C 371.78 228.55 377.59 227.87 383.08 226.01 C 398.05 220.36 409.29 205.98 410.84 190.00 C 412.27 175.50 410.05 160.98 407.35 146.76 C 406.34 141.72 404.20 137.01 402.94 132.04 C 408.12 140.03 410.28 149.43 412.67 158.52 C 414.92 166.93 414.11 175.85 416.67 184.20 C 418.53 190.84 419.82 197.64 420.28 204.53 C 423.22 199.01 425.29 193.05 426.62 186.94 C 428.80 177.72 428.06 168.17 427.89 158.80 C 426.44 150.77 423.90 142.93 420.65 135.45 C 411.96 117.32 397.84 102.25 381.67 90.51 M 363.08 138.07 C 366.24 144.39 367.62 151.41 367.41 158.45 C 371.18 154.27 372.45 148.53 373.02 143.09 C 373.56 139.93 371.77 137.20 369.77 134.97 C 367.46 135.80 365.22 136.86 363.08 138.07 M 353.76 142.83 C 355.40 144.65 357.38 146.40 357.98 148.88 C 358.66 151.92 357.52 154.94 356.96 157.90 C 356.62 157.53 355.94 156.77 355.60 156.39 C 353.99 160.27 351.42 163.59 347.89 165.89 C 350.70 161.32 353.84 156.55 354.03 151.02 C 354.22 149.63 353.96 148.18 352.94 147.17 C 350.92 146.77 348.85 146.93 346.81 146.90 C 346.22 153.89 341.17 160.77 333.82 161.40 C 332.39 160.47 330.91 159.62 329.44 158.77 C 330.84 162.94 332.77 168.91 338.03 169.08 C 339.70 169.33 341.38 169.57 343.05 169.87 C 340.84 171.20 338.23 171.29 335.73 171.50 C 340.20 176.58 343.96 182.36 346.13 188.80 C 347.74 193.89 349.73 200.49 345.96 205.07 C 340.85 209.69 334.55 212.78 328.42 215.83 C 332.69 218.21 336.11 221.74 340.03 224.61 C 339.95 221.49 339.76 218.38 339.31 215.30 C 341.77 219.27 342.51 223.98 341.62 228.55 C 347.71 225.26 353.69 220.41 355.31 213.33 C 356.57 207.32 356.58 200.81 354.41 195.00 C 357.62 199.31 360.58 204.05 365.11 207.12 C 362.75 199.70 361.88 191.87 359.21 184.56 C 358.08 186.11 356.89 187.62 355.58 189.01 C 356.12 186.07 357.05 183.22 357.64 180.30 C 358.39 175.52 357.04 170.82 356.21 166.15 C 358.83 164.38 361.45 162.61 363.99 160.72 C 364.14 154.04 364.93 146.78 361.31 140.79 C 358.65 140.87 356.15 141.71 353.76 142.83 M 331.62 159.24 C 337.68 159.13 343.07 154.56 344.60 148.77 C 339.45 151.01 334.42 154.20 331.62 159.24 M 69.99 152.18 C 63.21 157.34 56.23 162.25 49.74 167.77 C 47.26 169.72 48.40 173.21 48.00 175.92 C 47.90 220.63 48.00 265.34 47.96 310.06 C 47.96 313.72 47.31 317.35 47.14 321.00 C 52.71 321.09 58.28 321.52 63.85 321.21 C 71.69 307.04 78.66 292.33 87.89 278.97 C 90.48 275.38 91.98 271.08 95.08 267.86 C 94.27 271.40 92.72 274.69 90.87 277.81 C 83.29 292.58 74.74 306.84 67.61 321.85 C 77.69 320.31 87.89 321.42 98.02 321.05 C 114.32 321.07 130.62 320.92 146.92 321.18 C 146.01 317.08 145.04 312.99 143.80 308.98 C 138.42 291.43 132.05 274.04 122.94 258.05 C 121.03 254.22 118.06 250.71 117.90 246.24 C 128.64 242.40 140.08 241.93 151.32 240.81 C 146.55 231.25 140.16 222.64 134.16 213.85 C 129.84 206.97 124.42 200.91 119.56 194.43 C 117.78 192.45 116.36 190.16 115.69 187.57 C 125.82 182.94 135.95 178.30 146.37 174.35 C 154.61 171.10 162.79 167.57 171.43 165.48 C 172.63 162.27 173.65 159.00 175.00 155.84 C 163.31 157.29 151.64 159.02 140.03 161.04 C 134.70 161.85 129.39 160.64 124.17 159.64 C 108.75 156.56 93.13 154.54 77.81 150.94 C 81.79 158.68 88.39 164.68 92.93 172.09 C 102.82 187.40 109.33 205.60 108.18 224.02 C 107.10 239.24 102.12 253.91 95.21 267.42 C 96.06 263.20 98.02 259.34 99.53 255.35 C 104.17 242.13 107.95 228.21 106.78 214.07 C 105.50 202.15 101.69 190.56 96.04 180.00 C 92.07 171.15 85.27 164.09 79.88 156.14 C 78.73 154.53 77.67 152.80 76.11 151.54 C 74.23 150.28 71.66 150.78 69.99 152.18 M 150.86 174.97 C 140.13 179.67 128.97 183.43 118.57 188.88 C 131.67 206.21 144.78 223.63 155.54 242.55 C 143.81 243.12 132.24 245.20 120.74 247.43 C 124.15 256.55 129.93 264.54 133.44 273.62 C 139.82 289.06 145.80 304.74 149.57 321.04 C 158.66 320.91 167.75 321.39 176.84 321.02 C 179.94 308.87 181.66 296.42 183.80 284.07 C 184.16 281.20 184.31 278.19 183.34 275.41 C 178.42 260.64 175.28 245.30 173.45 229.85 C 172.06 221.58 172.70 213.05 170.62 204.90 C 169.17 197.03 169.98 188.98 169.75 181.03 C 169.49 176.59 170.65 172.26 170.77 167.84 C 164.13 170.21 157.35 172.18 150.86 174.97 M 257.53 222.17 C 261.86 227.44 268.47 229.99 274.98 231.26 C 276.09 229.98 277.14 228.66 278.19 227.33 C 277.55 227.18 276.29 226.87 275.66 226.71 C 276.54 222.71 278.11 218.86 278.37 214.74 C 271.57 217.63 264.54 219.86 257.53 222.17 M 179.03 320.92 C 188.38 321.09 197.75 321.15 207.10 320.89 C 202.84 311.43 198.91 301.65 197.47 291.31 C 195.86 294.29 195.13 297.66 193.33 300.56 C 190.28 294.14 187.95 287.42 185.47 280.77 C 184.22 294.27 182.94 307.87 179.03 320.92 Z"
         id="path43"
         style="fill:#000000" />
      <path
         fill="#000000"
         opacity="1.00"
         d=" M 227.03 56.48 C 230.73 59.46 232.84 63.85 233.98 68.38 C 231.83 65.16 230.07 61.70 227.87 58.51 C 228.00 59.71 228.25 62.12 228.38 63.32 C 227.99 63.22 227.21 63.02 226.82 62.92 C 226.89 60.77 226.87 58.62 227.03 56.48 Z"
         id="path45"
         style="fill:#000000" />
      <path
         fill="#000000"
         opacity="1.00"
         d=" M 226.80 73.96 C 227.48 70.69 227.28 67.11 228.86 64.10 C 228.65 70.40 233.68 74.57 236.43 79.64 C 233.13 77.43 230.60 74.33 227.73 71.64 C 228.53 78.41 235.04 81.82 238.98 86.65 C 233.86 83.81 228.77 79.60 226.80 73.96 Z"
         id="path47"
         style="fill:#000000" />
      <path
         fill="#000000"
         opacity="1.00"
         d=" M 308.68 93.31 C 316.75 92.59 324.69 95.52 331.64 99.37 C 334.97 101.17 337.04 104.50 338.13 108.03 C 334.91 103.82 330.87 100.15 326.00 97.97 C 320.65 95.10 314.52 94.54 308.68 93.31 Z"
         id="path49"
         style="fill:#000000" />
      <path
         fill="#000000"
         opacity="1.00"
         d=" M 280.14 101.20 C 287.64 101.49 294.64 104.42 301.90 106.02 C 312.60 108.63 323.86 109.93 333.69 115.24 C 336.37 116.56 336.95 119.75 338.21 122.19 C 334.65 127.04 329.81 131.06 324.04 132.97 C 321.29 132.92 318.89 131.39 316.51 130.19 C 315.15 133.79 312.44 136.56 309.81 139.26 C 311.43 135.75 313.27 132.29 314.01 128.46 C 312.06 126.71 310.31 124.47 307.65 123.83 C 305.29 126.92 302.73 130.36 298.75 131.33 C 294.55 132.92 289.24 130.35 287.87 126.06 C 287.48 123.90 287.97 121.71 288.23 119.56 C 285.83 120.87 282.22 122.60 282.93 125.95 C 284.96 135.05 294.41 140.29 303.18 140.83 C 301.66 141.43 300.17 142.09 298.68 142.77 C 293.87 141.88 288.84 140.23 285.74 136.18 C 283.80 133.38 281.95 130.38 281.21 127.01 C 280.47 123.87 282.04 120.47 284.69 118.72 C 287.79 116.44 291.70 115.89 295.21 114.48 C 290.42 109.77 283.55 107.26 280.14 101.20 M 290.16 105.92 C 291.68 108.08 294.11 109.23 296.17 110.79 C 303.05 115.87 309.55 121.46 316.59 126.34 C 319.21 128.09 321.99 130.29 325.35 129.75 C 328.73 126.94 333.54 125.43 335.32 121.07 C 333.04 116.42 327.65 115.52 323.18 114.21 C 312.15 111.54 301.09 108.97 290.16 105.92 M 292.32 118.98 C 291.59 120.77 290.83 122.55 290.04 124.31 C 291.17 126.27 292.61 128.48 295.07 128.81 C 299.76 129.46 303.65 125.77 305.72 121.94 C 302.11 118.52 296.96 118.54 292.32 118.98 Z"
         id="path51"
         style="fill:#000000" />
      <path
         fill="#000000"
         opacity="1.00"
         d=" M 334.98 131.12 C 337.63 126.63 338.80 121.30 342.13 117.25 C 342.13 119.35 342.44 121.55 341.77 123.59 C 340.26 126.70 337.52 128.89 334.98 131.12 Z"
         id="path53"
         style="fill:#000000" />
      <path
         fill="#000000"
         opacity="1.00"
         d=" M 269.28 160.27 C 274.05 155.90 280.53 154.21 286.75 153.15 C 277.70 157.21 267.04 161.39 263.11 171.37 C 263.14 166.89 266.12 163.15 269.28 160.27 Z"
         id="path55"
         style="fill:#000000" />
      <path
         fill="#000000"
         opacity="1.00"
         d=" M 295.77 165.41 C 300.49 169.61 304.03 175.00 309.14 178.82 C 314.48 183.71 320.65 187.69 327.42 190.31 C 330.14 191.57 333.32 192.24 335.37 194.59 C 325.59 201.09 313.51 203.27 301.94 202.97 C 298.11 202.74 295.31 205.73 292.07 207.26 C 293.17 210.57 294.33 213.87 295.42 217.19 C 292.18 214.69 290.84 210.68 288.61 207.39 C 279.78 205.65 270.82 204.71 262.02 202.86 C 262.04 202.07 262.07 200.49 262.09 199.70 C 266.70 199.23 270.58 202.16 275.05 202.62 C 279.08 203.08 283.08 203.79 287.06 204.61 C 291.10 205.63 294.30 202.32 297.60 200.58 C 300.39 192.78 298.88 184.36 297.48 176.44 C 296.57 172.81 295.28 169.22 295.77 165.41 M 300.81 175.48 C 302.06 183.62 302.19 191.86 301.83 200.07 C 311.91 200.14 322.09 198.51 331.39 194.53 C 319.26 191.98 309.80 183.45 300.81 175.48 Z"
         id="path57"
         style="fill:#000000" />
      <path
         fill="#000000"
         opacity="1.00"
         d=" M 302.05 242.79 C 305.20 245.37 308.11 248.34 309.97 252.01 C 313.42 258.60 317.11 265.40 317.91 272.91 C 318.34 283.34 317.36 295.04 310.12 303.20 C 312.75 297.41 316.31 291.62 316.05 285.02 C 316.73 269.71 309.37 255.72 302.05 242.79 Z"
         id="path59"
         style="fill:#000000" />
    </g>
  </g>
</svg>
