
CUPL(WM)        5.0a  Serial# 60008009
Device          g16v8as  Library DLIB-h-40-2
Created         Thu Jun 27 22:18:36 2019
Name            address_decoder 
Partno          00 
Revision        02 
Date            27/06/2019 
Designer        Engineer 
Company         None 
Assembly        None 
Location        
*QP20 
*QF2194 
*QV17
*G0 
*F0 
*L00768 01010101100101010101010101010101
*L01024 01010101010101010101010101010101
*L02048 00011000001100000011000000100000
*L02112 00000000111001111111111111111111
*L02144 11111111111111111111111111111111
*L02176 111111111111111110
*C0E63
*P 1 2 3 4 5 6 7 8 9 10 11 12 13 14 15 16 17 18 19 20
*V0001 111011111N1111LH111N
*V0002 111111111N1111HL111N
*V0003 XXXX0XXXXNXXXXLLXXXN
*V0004 XXXXX0XXXNXXXXLLXXXN
*V0005 XXXXXX0XXNXXXXLLXXXN
*V0006 XXXXXXX0XNXXXXLLXXXN
*V0007 XXXXXXXX0NXXXXLLXXXN
*V0008 XX0XXXXXXNXXXXLLXXXN
*V0009 X0XXXXXXXNXXXXLLXXXN
*V0010 XXXXXXXXXNX0XXLLXXXN
*V0011 XXXXXXXXXNXX0XLLXXXN
*V0012 XXXXXXXXXNXXXXLL0XXN
*V0013 XXXXXXXXXNXXX0LLXXXN
*V0014 0XXXXXXXXNXXXXLLXXXN
*V0015 XXXXXXXXXN0XXXLLXXXN
*V0016 XXXXXXXXXNXXXXLLX0XN
*V0017 XXXXXXXXXNXXXXLLXX0N
*0E50