EESchema Schematic File Version 4
LIBS:serial-error-cache
EELAYER 29 0
EELAYER END
$Descr A4 11693 8268
encoding utf-8
Sheet 1 1
Title "Wire Noise"
Date "2020-04-09"
Rev "1.0"
Comp "heavydeck.net"
Comment1 "Error generator for serial lines."
Comment2 ""
Comment3 ""
Comment4 ""
$EndDescr
$Comp
L Connector:Conn_01x05_Female J2
U 1 1 5E7B2D3B
P 5500 1750
F 0 "J2" H 5528 1776 50  0000 L CNN
F 1 "Conn_01x05_Female" H 5528 1685 50  0000 L CNN
F 2 "Socket_Strip_Angled_1x05_Pitch2.54mm" H 5500 1750 50  0001 C CNN
F 3 "~" H 5500 1750 50  0001 C CNN
	1    5500 1750
	1    0    0    1   
$EndComp
$Comp
L Connector:Conn_01x05_Male J1
U 1 1 5E7B4B91
P 3400 1750
F 0 "J1" H 3508 2131 50  0000 C CNN
F 1 "Conn_01x05_Male" H 3508 2040 50  0000 C CNN
F 2 "Pin_Headers:Pin_Header_Angled_1x05_Pitch2.54mm" H 3400 1750 50  0001 C CNN
F 3 "~" H 3400 1750 50  0001 C CNN
	1    3400 1750
	1    0    0    1   
$EndComp
$Comp
L power:GND #PWR01
U 1 1 5E7B824C
P 4300 2200
F 0 "#PWR01" H 4300 1950 50  0001 C CNN
F 1 "GND" H 4305 2027 50  0000 C CNN
F 2 "" H 4300 2200 50  0001 C CNN
F 3 "" H 4300 2200 50  0001 C CNN
	1    4300 2200
	1    0    0    -1  
$EndComp
Wire Wire Line
	4300 2200 4300 1650
Connection ~ 4300 1650
$Comp
L power:+5V #PWR03
U 1 1 5E7B8432
P 4700 1400
F 0 "#PWR03" H 4700 1250 50  0001 C CNN
F 1 "+5V" H 4715 1573 50  0000 C CNN
F 2 "" H 4700 1400 50  0001 C CNN
F 3 "" H 4700 1400 50  0001 C CNN
	1    4700 1400
	1    0    0    -1  
$EndComp
$Comp
L power:+3.3V #PWR02
U 1 1 5E7B8B7E
P 4500 1450
F 0 "#PWR02" H 4500 1300 50  0001 C CNN
F 1 "+3.3V" H 4515 1623 50  0000 C CNN
F 2 "" H 4500 1450 50  0001 C CNN
F 3 "" H 4500 1450 50  0001 C CNN
	1    4500 1450
	1    0    0    -1  
$EndComp
Wire Wire Line
	4700 1400 4700 1550
Connection ~ 4700 1550
Wire Wire Line
	4500 1450 4500 1950
Connection ~ 4500 1950
Wire Wire Line
	3600 1550 4700 1550
Wire Wire Line
	3600 1650 4300 1650
Wire Wire Line
	3600 1950 4500 1950
Wire Wire Line
	4500 1950 5300 1950
Wire Wire Line
	4300 1650 5300 1650
Wire Wire Line
	4700 1550 5300 1550
Wire Wire Line
	5300 1750 4850 1750
Wire Wire Line
	5300 1850 5000 1850
Wire Wire Line
	3600 1850 3900 1850
Wire Wire Line
	3600 1750 4050 1750
Text Label 4850 2450 1    50   ~ 0
TX1
Text Label 5000 2450 1    50   ~ 0
RX1
Text Label 3900 2400 1    50   ~ 0
TX2
Text Label 4050 2400 1    50   ~ 0
RX2
$Comp
L Jumper:Jumper_3_Bridged12 JP1
U 1 1 5E7BEF01
P 6750 2200
F 0 "JP1" H 6750 2404 50  0000 C CNN
F 1 "Jumper_3_Bridged12" H 6750 2313 50  0000 C CNN
F 2 "Pin_Headers:Pin_Header_Straight_1x03_Pitch2.54mm" H 6750 2200 50  0001 C CNN
F 3 "~" H 6750 2200 50  0001 C CNN
	1    6750 2200
	1    0    0    -1  
$EndComp
$Comp
L power:+5V #PWR04
U 1 1 5E7C0258
P 6400 2200
F 0 "#PWR04" H 6400 2050 50  0001 C CNN
F 1 "+5V" V 6415 2328 50  0000 L CNN
F 2 "" H 6400 2200 50  0001 C CNN
F 3 "" H 6400 2200 50  0001 C CNN
	1    6400 2200
	0    -1   -1   0   
$EndComp
$Comp
L power:+3.3V #PWR08
U 1 1 5E7C0A98
P 7100 2200
F 0 "#PWR08" H 7100 2050 50  0001 C CNN
F 1 "+3.3V" V 7115 2328 50  0000 L CNN
F 2 "" H 7100 2200 50  0001 C CNN
F 3 "" H 7100 2200 50  0001 C CNN
	1    7100 2200
	0    1    1    0   
$EndComp
$Comp
L power:VCC #PWR07
U 1 1 5E7C0C85
P 6750 2450
F 0 "#PWR07" H 6750 2300 50  0001 C CNN
F 1 "VCC" H 6768 2623 50  0000 C CNN
F 2 "" H 6750 2450 50  0001 C CNN
F 3 "" H 6750 2450 50  0001 C CNN
	1    6750 2450
	-1   0    0    1   
$EndComp
Wire Wire Line
	6400 2200 6500 2200
Wire Wire Line
	6750 2350 6750 2450
Wire Wire Line
	7000 2200 7100 2200
$Comp
L power:VCC #PWR05
U 1 1 5E7C97CE
P 4450 4100
F 0 "#PWR05" H 4450 3950 50  0001 C CNN
F 1 "VCC" H 4467 4273 50  0000 C CNN
F 2 "" H 4450 4100 50  0001 C CNN
F 3 "" H 4450 4100 50  0001 C CNN
	1    4450 4100
	1    0    0    -1  
$EndComp
$Comp
L power:GND #PWR06
U 1 1 5E7C9F92
P 6350 4100
F 0 "#PWR06" H 6350 3850 50  0001 C CNN
F 1 "GND" H 6355 3927 50  0000 C CNN
F 2 "" H 6350 4100 50  0001 C CNN
F 3 "" H 6350 4100 50  0001 C CNN
	1    6350 4100
	-1   0    0    1   
$EndComp
$Comp
L PIC16:PIC16F15324 U1
U 1 1 5E8E445B
P 5400 5350
F 0 "U1" H 5400 6015 50  0000 C CNN
F 1 "PIC16F15324" H 5400 5924 50  0000 C CNN
F 2 "Housings_DIP:DIP-14_W7.62mm" H 5400 5350 50  0001 C CNN
F 3 "" H 5400 5350 50  0001 C CNN
	1    5400 5350
	1    0    0    -1  
$EndComp
$Comp
L Switch:SW_Push SW1
U 1 1 5E8E95D4
P 8750 5250
F 0 "SW1" H 8750 5535 50  0000 C CNN
F 1 "SW_Push" H 8750 5444 50  0000 C CNN
F 2 "SW_PUSH_6mm" H 8750 5450 50  0001 C CNN
F 3 "~" H 8750 5450 50  0001 C CNN
	1    8750 5250
	-1   0    0    -1  
$EndComp
$Comp
L pspice:C C1
U 1 1 5E8EA453
P 5400 4400
F 0 "C1" V 5085 4400 50  0000 C CNN
F 1 "100nF" V 5176 4400 50  0000 C CNN
F 2 "Capacitors_THT:C_Disc_D3.0mm_W1.6mm_P2.50mm" H 5400 4400 50  0001 C CNN
F 3 "~" H 5400 4400 50  0001 C CNN
	1    5400 4400
	0    1    1    0   
$EndComp
$Comp
L Device:R R1
U 1 1 5E8EAEE6
P 8400 4200
F 0 "R1" V 8193 4200 50  0000 C CNN
F 1 "1K" V 8284 4200 50  0000 C CNN
F 2 "Resistors_THT:R_Axial_DIN0204_L3.6mm_D1.6mm_P2.54mm_Vertical" V 8330 4200 50  0001 C CNN
F 3 "~" H 8400 4200 50  0001 C CNN
	1    8400 4200
	0    -1   1    0   
$EndComp
$Comp
L Device:LED D1
U 1 1 5E8EB816
P 8800 4200
F 0 "D1" H 8793 4416 50  0000 C CNN
F 1 "LED" H 8793 4325 50  0000 C CNN
F 2 "LEDs:LED_D5.0mm_FlatTop" H 8800 4200 50  0001 C CNN
F 3 "~" H 8800 4200 50  0001 C CNN
	1    8800 4200
	-1   0    0    -1  
$EndComp
Wire Wire Line
	8650 4200 8550 4200
$Comp
L power:GND #PWR09
U 1 1 5E8F2D67
P 9050 5400
F 0 "#PWR09" H 9050 5150 50  0001 C CNN
F 1 "GND" H 9055 5227 50  0000 C CNN
F 2 "" H 9050 5400 50  0001 C CNN
F 3 "" H 9050 5400 50  0001 C CNN
	1    9050 5400
	-1   0    0    -1  
$EndComp
Wire Wire Line
	9050 5400 9050 5250
Wire Wire Line
	9050 4200 8950 4200
Wire Wire Line
	8950 5250 9050 5250
Connection ~ 9050 5250
Wire Wire Line
	8550 5250 8450 5250
$Comp
L Connector_Generic:Conn_01x08 J3
U 1 1 5E8FF703
P 9050 3350
F 0 "J3" H 9130 3342 50  0000 L CNN
F 1 "ICSP" H 9130 3251 50  0000 L CNN
F 2 "SOICbite:SOIC_clip_01x08" H 9050 3350 50  0001 C CNN
F 3 "~" H 9050 3350 50  0001 C CNN
	1    9050 3350
	1    0    0    -1  
$EndComp
Wire Wire Line
	8450 5250 8450 5150
$Comp
L Device:R R2
U 1 1 5E8F1C59
P 8450 5000
F 0 "R2" H 8380 4954 50  0000 R CNN
F 1 "10K" H 8380 5045 50  0000 R CNN
F 2 "Resistors_THT:R_Axial_DIN0204_L3.6mm_D1.6mm_P2.54mm_Vertical" V 8380 5000 50  0001 C CNN
F 3 "~" H 8450 5000 50  0001 C CNN
	1    8450 5000
	1    0    0    1   
$EndComp
Wire Wire Line
	9050 4200 9050 5250
$Comp
L power:VCC #PWR0101
U 1 1 5E90A529
P 8450 4750
F 0 "#PWR0101" H 8450 4600 50  0001 C CNN
F 1 "VCC" H 8467 4923 50  0000 C CNN
F 2 "" H 8450 4750 50  0001 C CNN
F 3 "" H 8450 4750 50  0001 C CNN
	1    8450 4750
	-1   0    0    -1  
$EndComp
Wire Wire Line
	8450 4750 8450 4850
Connection ~ 8450 5250
Text Label 8100 4200 2    50   ~ 0
LED
Text Label 6450 5350 0    50   ~ 0
LED
Wire Wire Line
	8450 3250 8850 3250
Wire Wire Line
	8850 3650 8450 3650
Text Label 7850 3150 0    50   ~ 0
~MCLR
Text Label 7850 3450 0    50   ~ 0
PGD
Text Label 7850 3550 0    50   ~ 0
PGC
NoConn ~ 8450 3650
$Comp
L power:VCC #PWR0102
U 1 1 5E9201C6
P 8450 3250
F 0 "#PWR0102" H 8450 3100 50  0001 C CNN
F 1 "VCC" V 8468 3377 50  0000 L CNN
F 2 "" H 8450 3250 50  0001 C CNN
F 3 "" H 8450 3250 50  0001 C CNN
	1    8450 3250
	0    -1   -1   0   
$EndComp
$Comp
L power:GND #PWR0103
U 1 1 5E9207CC
P 8300 3350
F 0 "#PWR0103" H 8300 3100 50  0001 C CNN
F 1 "GND" V 8305 3222 50  0000 R CNN
F 2 "" H 8300 3350 50  0001 C CNN
F 3 "" H 8300 3350 50  0001 C CNN
	1    8300 3350
	0    1    1    0   
$EndComp
Wire Wire Line
	8300 3350 8850 3350
NoConn ~ 8850 3050
NoConn ~ 8850 3750
Text Label 4350 5350 0    50   ~ 0
~MCLR
Text Label 6250 5150 0    50   ~ 0
PGD
Text Label 6250 5250 0    50   ~ 0
PGC
Text Label 6800 5550 2    50   ~ 0
RX2
Text Label 4300 5550 2    50   ~ 0
TX2
Text Label 6800 5650 2    50   ~ 0
TX1
Text Label 4300 5650 2    50   ~ 0
RX1
Text Label 8150 5250 2    50   ~ 0
BTN
Text Label 6450 5450 0    50   ~ 0
BTN
NoConn ~ 4650 5450
NoConn ~ 4650 5250
NoConn ~ 4650 5150
Entry Wire Line
	7550 5650 7650 5750
Entry Wire Line
	7550 5550 7650 5650
Entry Wire Line
	7550 5450 7650 5550
Entry Wire Line
	7550 5350 7650 5450
Entry Wire Line
	7550 5250 7650 5350
Entry Wire Line
	7550 5150 7650 5250
Wire Wire Line
	6150 5150 7550 5150
Wire Wire Line
	6150 5250 7550 5250
Wire Wire Line
	6150 5350 7550 5350
Wire Wire Line
	6150 5450 7550 5450
Wire Wire Line
	6150 5550 7550 5550
Wire Wire Line
	6150 5650 7550 5650
Entry Wire Line
	3150 5550 3250 5650
Entry Wire Line
	3150 5450 3250 5550
Wire Wire Line
	3250 5550 4650 5550
Wire Wire Line
	3250 5650 4650 5650
Entry Wire Line
	3150 5250 3250 5350
Wire Wire Line
	3250 5350 4200 5350
Entry Wire Line
	7650 4100 7750 4200
Entry Wire Line
	7650 5150 7750 5250
Wire Wire Line
	7750 5250 8450 5250
Wire Wire Line
	7750 4200 8250 4200
Wire Wire Line
	7750 3550 8850 3550
Wire Wire Line
	7750 3450 8850 3450
Wire Wire Line
	7750 3150 8850 3150
Entry Wire Line
	7650 3050 7750 3150
Entry Wire Line
	7650 3350 7750 3450
Entry Wire Line
	7650 3450 7750 3550
Entry Wire Line
	3900 2750 4000 2850
Entry Wire Line
	4050 2750 4150 2850
Entry Wire Line
	4850 2750 4950 2850
Entry Wire Line
	5000 2750 5100 2850
Wire Wire Line
	3900 1850 3900 2750
Wire Wire Line
	4050 1750 4050 2750
Wire Wire Line
	4850 1750 4850 2750
Wire Wire Line
	5000 1850 5000 2750
$Comp
L Device:R R3
U 1 1 5E9476A1
P 4200 5000
F 0 "R3" H 4270 5046 50  0000 L CNN
F 1 "10K" H 4270 4955 50  0000 L CNN
F 2 "Resistors_THT:R_Axial_DIN0204_L3.6mm_D1.6mm_P2.54mm_Vertical" V 4130 5000 50  0001 C CNN
F 3 "~" H 4200 5000 50  0001 C CNN
	1    4200 5000
	1    0    0    -1  
$EndComp
Wire Wire Line
	4200 5150 4200 5350
Connection ~ 4200 5350
Wire Wire Line
	4200 5350 4650 5350
$Comp
L power:VCC #PWR010
U 1 1 5E9493C8
P 4200 4650
F 0 "#PWR010" H 4200 4500 50  0001 C CNN
F 1 "VCC" H 4217 4823 50  0000 C CNN
F 2 "" H 4200 4650 50  0001 C CNN
F 3 "" H 4200 4650 50  0001 C CNN
	1    4200 4650
	1    0    0    -1  
$EndComp
Wire Wire Line
	4200 4650 4200 4850
Wire Wire Line
	4650 5050 4450 5050
Wire Wire Line
	4450 5050 4450 4400
Wire Wire Line
	6150 5050 6350 5050
Wire Wire Line
	6350 5050 6350 4400
Wire Wire Line
	5150 4400 4450 4400
Connection ~ 4450 4400
Wire Wire Line
	4450 4400 4450 4100
Wire Wire Line
	5650 4400 6350 4400
Connection ~ 6350 4400
Wire Wire Line
	6350 4400 6350 4100
Wire Bus Line
	3150 2850 7650 2850
Wire Bus Line
	3150 2850 3150 5850
Wire Bus Line
	7650 2850 7650 5850
$EndSCHEMATC
