EESchema Schematic File Version 4
EELAYER 30 0
EELAYER END
$Descr A4 11693 8268
encoding utf-8
Sheet 1 1
Title "SEGA Master System flash cartridge (with SLOT1/2 mapper)"
Date "2020-10-13"
Rev "3.1"
Comp "heavydeck.net"
Comment1 "Note 3: Only C1/C2/C3 have footprint so far; Will add the remaining if they fit."
Comment2 "Note 2: UDx/Ux Are the exact same IC on a different package. Only assemble Ux or UDx."
Comment3 "can be used instead by cutting JP2 and shorting JP1."
Comment4 "Note 1: A15 and ~M0-7~ are equivalent signals, by default this PCB will use ~M0-7~ but A15 "
$EndDescr
$Comp
L Logic_Programmable:GAL16V8 U2
U 1 1 5F790442
P 5000 4600
F 0 "U2" H 5000 5481 50  0000 C CNN
F 1 "GAL16V8" H 5000 5390 50  0000 C CNN
F 2 "Package_SO:SOIC-20W_7.5x12.8mm_P1.27mm" H 5000 4600 50  0001 C CNN
F 3 "" H 5000 4600 50  0001 C CNN
	1    5000 4600
	1    0    0    -1  
$EndComp
$Comp
L 74xx:74LS573 U4
U 1 1 5F791D9B
P 9000 2500
F 0 "U4" H 9000 3481 50  0000 C CNN
F 1 "74HC573" H 9000 3390 50  0000 C CNN
F 2 "Package_SO:SOIC-20W_7.5x12.8mm_P1.27mm" H 9000 2500 50  0001 C CNN
F 3 "74xx/74hc573.pdf" H 9000 2500 50  0001 C CNN
	1    9000 2500
	1    0    0    -1  
$EndComp
$Comp
L 74xx:74LS573 U5
U 1 1 5F792ACB
P 9000 4900
F 0 "U5" H 9000 5881 50  0000 C CNN
F 1 "74HC573" H 9000 5790 50  0000 C CNN
F 2 "Package_SO:SOIC-20W_7.5x12.8mm_P1.27mm" H 9000 4900 50  0001 C CNN
F 3 "74xx/74hc573.pdf" H 9000 4900 50  0001 C CNN
	1    9000 4900
	1    0    0    -1  
$EndComp
$Comp
L Memory_Flash:SST39SF040 U1
U 1 1 5F79381D
P 3000 2950
F 0 "U1" H 3000 4431 50  0000 C CNN
F 1 "SST39SF040" H 3000 4340 50  0000 C CNN
F 2 "Package_LCC:PLCC-32_11.4x14.0mm_P1.27mm" H 3000 3250 50  0001 C CNN
F 3 "http://ww1.microchip.com/downloads/en/DeviceDoc/25022B.pdf" H 3000 3250 50  0001 C CNN
	1    3000 2950
	1    0    0    -1  
$EndComp
$Comp
L Device:C C2
U 1 1 5F7C467C
P 2000 4600
F 0 "C2" H 2115 4646 50  0000 L CNN
F 1 "10n" H 2115 4555 50  0000 L CNN
F 2 "Capacitor_SMD:C_0805_2012Metric_Pad1.18x1.45mm_HandSolder" H 2038 4450 50  0001 C CNN
F 3 "~" H 2000 4600 50  0001 C CNN
	1    2000 4600
	1    0    0    -1  
$EndComp
$Comp
L Device:C C4
U 1 1 5F7C551E
P 1650 5400
F 0 "C4" H 1765 5446 50  0000 L CNN
F 1 "10n" H 1765 5355 50  0000 L CNN
F 2 "" H 1688 5250 50  0001 C CNN
F 3 "~" H 1650 5400 50  0001 C CNN
	1    1650 5400
	1    0    0    -1  
$EndComp
$Comp
L Device:C C5
U 1 1 5F7C56B8
P 2000 5400
F 0 "C5" H 2115 5446 50  0000 L CNN
F 1 "10n" H 2115 5355 50  0000 L CNN
F 2 "" H 2038 5250 50  0001 C CNN
F 3 "~" H 2000 5400 50  0001 C CNN
	1    2000 5400
	1    0    0    -1  
$EndComp
$Comp
L Device:C C6
U 1 1 5F7C5F20
P 2350 5400
F 0 "C6" H 2465 5446 50  0000 L CNN
F 1 "10n" H 2465 5355 50  0000 L CNN
F 2 "" H 2388 5250 50  0001 C CNN
F 3 "~" H 2350 5400 50  0001 C CNN
	1    2350 5400
	1    0    0    -1  
$EndComp
$Comp
L Device:C C8
U 1 1 5F7C60DE
P 3050 5400
F 0 "C8" H 3165 5446 50  0000 L CNN
F 1 "10n" H 3165 5355 50  0000 L CNN
F 2 "" H 3088 5250 50  0001 C CNN
F 3 "~" H 3050 5400 50  0001 C CNN
	1    3050 5400
	1    0    0    -1  
$EndComp
$Comp
L Device:CP C1
U 1 1 5F7C6EBF
P 1650 4600
F 0 "C1" H 1768 4646 50  0000 L CNN
F 1 "1u" H 1768 4555 50  0000 L CNN
F 2 "Capacitor_SMD:C_0805_2012Metric_Pad1.18x1.45mm_HandSolder" H 1688 4450 50  0001 C CNN
F 3 "~" H 1650 4600 50  0001 C CNN
	1    1650 4600
	1    0    0    -1  
$EndComp
$Comp
L power:GND #PWR03
U 1 1 5F7C8308
P 1650 4900
F 0 "#PWR03" H 1650 4650 50  0001 C CNN
F 1 "GND" H 1655 4727 50  0000 C CNN
F 2 "" H 1650 4900 50  0001 C CNN
F 3 "" H 1650 4900 50  0001 C CNN
	1    1650 4900
	1    0    0    -1  
$EndComp
$Comp
L power:VCC #PWR08
U 1 1 5F7C92DC
P 3500 5150
F 0 "#PWR08" H 3500 5000 50  0001 C CNN
F 1 "VCC" H 3515 5323 50  0000 C CNN
F 2 "" H 3500 5150 50  0001 C CNN
F 3 "" H 3500 5150 50  0001 C CNN
	1    3500 5150
	1    0    0    -1  
$EndComp
Wire Wire Line
	1650 4450 1650 4350
Wire Wire Line
	1650 4350 2000 4350
Wire Wire Line
	2000 4750 2000 4850
Wire Wire Line
	1650 4750 1650 4850
Wire Wire Line
	1650 4850 2000 4850
Wire Wire Line
	2000 4450 2000 4350
$Comp
L Logic_Programmable:GAL16V8 UD2
U 1 1 5F83A0EE
P 5000 2400
F 0 "UD2" H 5000 3281 50  0000 C CNN
F 1 "GAL16V8" H 5000 3190 50  0000 C CNN
F 2 "Package_DIP:DIP-20_W7.62mm" H 5000 2400 50  0001 C CNN
F 3 "" H 5000 2400 50  0001 C CNN
	1    5000 2400
	1    0    0    -1  
$EndComp
Wire Bus Line
	4000 1000 6000 1000
$Comp
L power:VCC #PWR04
U 1 1 5F84C6B1
P 5000 1450
F 0 "#PWR04" H 5000 1300 50  0001 C CNN
F 1 "VCC" H 5015 1623 50  0000 C CNN
F 2 "" H 5000 1450 50  0001 C CNN
F 3 "" H 5000 1450 50  0001 C CNN
	1    5000 1450
	1    0    0    -1  
$EndComp
Wire Wire Line
	5000 1450 5000 1700
$Comp
L power:VCC #PWR06
U 1 1 5F84DA09
P 5000 3650
F 0 "#PWR06" H 5000 3500 50  0001 C CNN
F 1 "VCC" H 5015 3823 50  0000 C CNN
F 2 "" H 5000 3650 50  0001 C CNN
F 3 "" H 5000 3650 50  0001 C CNN
	1    5000 3650
	1    0    0    -1  
$EndComp
Wire Wire Line
	5000 3650 5000 3900
$Comp
L power:GND #PWR05
U 1 1 5F84E6E4
P 5000 3150
F 0 "#PWR05" H 5000 2900 50  0001 C CNN
F 1 "GND" H 5005 2977 50  0000 C CNN
F 2 "" H 5000 3150 50  0001 C CNN
F 3 "" H 5000 3150 50  0001 C CNN
	1    5000 3150
	1    0    0    -1  
$EndComp
Wire Wire Line
	5000 3150 5000 3100
$Comp
L power:GND #PWR07
U 1 1 5F84F36E
P 5000 5350
F 0 "#PWR07" H 5000 5100 50  0001 C CNN
F 1 "GND" H 5005 5177 50  0000 C CNN
F 2 "" H 5000 5350 50  0001 C CNN
F 3 "" H 5000 5350 50  0001 C CNN
	1    5000 5350
	1    0    0    -1  
$EndComp
Wire Wire Line
	5000 5350 5000 5300
$Comp
L Logic_Programmable:GAL16V8 UD3
U 1 1 5F852641
P 7000 2450
F 0 "UD3" H 7000 3331 50  0000 C CNN
F 1 "GAL16V8" H 7000 3240 50  0000 C CNN
F 2 "Package_DIP:DIP-20_W7.62mm" H 7000 2450 50  0001 C CNN
F 3 "" H 7000 2450 50  0001 C CNN
	1    7000 2450
	1    0    0    -1  
$EndComp
Wire Bus Line
	6000 1000 8000 1000
$Comp
L power:VCC #PWR09
U 1 1 5F85264E
P 7000 1500
F 0 "#PWR09" H 7000 1350 50  0001 C CNN
F 1 "VCC" H 7015 1673 50  0000 C CNN
F 2 "" H 7000 1500 50  0001 C CNN
F 3 "" H 7000 1500 50  0001 C CNN
	1    7000 1500
	1    0    0    -1  
$EndComp
Wire Wire Line
	7000 1500 7000 1750
$Comp
L power:VCC #PWR011
U 1 1 5F852659
P 7000 3700
F 0 "#PWR011" H 7000 3550 50  0001 C CNN
F 1 "VCC" H 7015 3873 50  0000 C CNN
F 2 "" H 7000 3700 50  0001 C CNN
F 3 "" H 7000 3700 50  0001 C CNN
	1    7000 3700
	1    0    0    -1  
$EndComp
Wire Wire Line
	7000 3700 7000 3950
$Comp
L power:GND #PWR010
U 1 1 5F852664
P 7000 3200
F 0 "#PWR010" H 7000 2950 50  0001 C CNN
F 1 "GND" H 7005 3027 50  0000 C CNN
F 2 "" H 7000 3200 50  0001 C CNN
F 3 "" H 7000 3200 50  0001 C CNN
	1    7000 3200
	1    0    0    -1  
$EndComp
Wire Wire Line
	7000 3200 7000 3150
$Comp
L power:GND #PWR012
U 1 1 5F85266F
P 7000 5400
F 0 "#PWR012" H 7000 5150 50  0001 C CNN
F 1 "GND" H 7005 5227 50  0000 C CNN
F 2 "" H 7000 5400 50  0001 C CNN
F 3 "" H 7000 5400 50  0001 C CNN
	1    7000 5400
	1    0    0    -1  
$EndComp
Wire Wire Line
	7000 5400 7000 5350
Connection ~ 6000 1000
Text Notes 6050 1200 0    50   ~ 0
MAPPER PLD\n(See Note 2)
Wire Bus Line
	8000 1000 11000 1000
Connection ~ 8000 1000
Text Notes 8050 1150 0    50   ~ 0
SLOT2 LATCH
Text Notes 8050 3700 0    50   ~ 0
SLOT1 LATCH
$Comp
L power:GND #PWR014
U 1 1 5F87F6CD
P 9000 3350
F 0 "#PWR014" H 9000 3100 50  0001 C CNN
F 1 "GND" H 9005 3177 50  0000 C CNN
F 2 "" H 9000 3350 50  0001 C CNN
F 3 "" H 9000 3350 50  0001 C CNN
	1    9000 3350
	1    0    0    -1  
$EndComp
$Comp
L power:GND #PWR016
U 1 1 5F87FD71
P 9000 5750
F 0 "#PWR016" H 9000 5500 50  0001 C CNN
F 1 "GND" H 9005 5577 50  0000 C CNN
F 2 "" H 9000 5750 50  0001 C CNN
F 3 "" H 9000 5750 50  0001 C CNN
	1    9000 5750
	1    0    0    -1  
$EndComp
$Comp
L power:VCC #PWR015
U 1 1 5F881955
P 9000 3850
F 0 "#PWR015" H 9000 3700 50  0001 C CNN
F 1 "VCC" H 9015 4023 50  0000 C CNN
F 2 "" H 9000 3850 50  0001 C CNN
F 3 "" H 9000 3850 50  0001 C CNN
	1    9000 3850
	1    0    0    -1  
$EndComp
$Comp
L power:VCC #PWR013
U 1 1 5F881FD8
P 9000 1450
F 0 "#PWR013" H 9000 1300 50  0001 C CNN
F 1 "VCC" H 9015 1623 50  0000 C CNN
F 2 "" H 9000 1450 50  0001 C CNN
F 3 "" H 9000 1450 50  0001 C CNN
	1    9000 1450
	1    0    0    -1  
$EndComp
Wire Wire Line
	9000 1450 9000 1700
Wire Wire Line
	9000 3300 9000 3350
Wire Wire Line
	9000 3850 9000 4100
Wire Wire Line
	9000 5700 9000 5750
Wire Bus Line
	4000 1000 1500 1000
Connection ~ 4000 1000
Text Notes 1550 1150 0    50   ~ 0
FLASH ROM
$Comp
L power:GND #PWR02
U 1 1 5F88DC9B
P 3000 4200
F 0 "#PWR02" H 3000 3950 50  0001 C CNN
F 1 "GND" H 3005 4027 50  0000 C CNN
F 2 "" H 3000 4200 50  0001 C CNN
F 3 "" H 3000 4200 50  0001 C CNN
	1    3000 4200
	1    0    0    -1  
$EndComp
Wire Wire Line
	3000 4200 3000 4150
$Comp
L power:VCC #PWR01
U 1 1 5F88F159
P 3000 1400
F 0 "#PWR01" H 3000 1250 50  0001 C CNN
F 1 "VCC" H 3015 1573 50  0000 C CNN
F 2 "" H 3000 1400 50  0001 C CNN
F 3 "" H 3000 1400 50  0001 C CNN
	1    3000 1400
	1    0    0    -1  
$EndComp
Wire Wire Line
	3000 1400 3000 1650
Entry Wire Line
	4000 4100 4100 4200
Entry Wire Line
	4000 4000 4100 4100
Entry Wire Line
	4000 4200 4100 4300
Entry Wire Line
	4000 4300 4100 4400
Entry Wire Line
	4000 4400 4100 4500
Entry Wire Line
	4000 4500 4100 4600
Entry Wire Line
	4000 4600 4100 4700
Entry Wire Line
	4000 4700 4100 4800
Entry Wire Line
	4000 4800 4100 4900
Entry Wire Line
	4000 4900 4100 5000
Entry Wire Line
	5900 4200 6000 4300
Entry Wire Line
	5900 4100 6000 4200
Entry Wire Line
	5900 4300 6000 4400
Entry Wire Line
	5900 4400 6000 4500
Entry Wire Line
	5900 4500 6000 4600
Entry Wire Line
	5900 4600 6000 4700
Entry Wire Line
	5900 4700 6000 4800
Entry Wire Line
	5900 4800 6000 4900
Wire Wire Line
	4100 4100 4500 4100
Wire Wire Line
	4500 4200 4100 4200
Wire Wire Line
	4100 4300 4500 4300
Wire Wire Line
	4500 4400 4100 4400
Wire Wire Line
	4100 4500 4500 4500
Wire Wire Line
	4500 4600 4100 4600
Wire Wire Line
	4100 4700 4500 4700
Wire Wire Line
	4500 4800 4100 4800
Wire Wire Line
	4100 4900 4500 4900
Wire Wire Line
	4500 5000 4100 5000
Text Label 4200 4100 0    50   ~ 0
A12
Text Label 4200 4200 0    50   ~ 0
A7
Text Label 4200 4300 0    50   ~ 0
A6
Text Label 4200 4400 0    50   ~ 0
A0
Text Label 4200 4500 0    50   ~ 0
A1
Text Label 4200 4600 0    50   ~ 0
A2
Text Label 4200 4700 0    50   ~ 0
A3
Text Label 4200 4800 0    50   ~ 0
A4
Text Label 4200 4900 0    50   ~ 0
A5
Text Label 4200 5000 0    50   ~ 0
A13
Wire Wire Line
	5500 4100 5900 4100
Wire Wire Line
	5900 4200 5500 4200
Wire Wire Line
	5500 4300 5900 4300
Wire Wire Line
	5900 4600 5500 4600
Wire Wire Line
	5500 4700 5900 4700
Wire Wire Line
	5900 4800 5500 4800
Text Label 5600 4100 0    50   ~ 0
~M0-7
Text Label 5600 4200 0    50   ~ 0
A14
Text Label 5600 4300 0    50   ~ 0
A10
Text Label 5600 4600 0    50   ~ 0
A11
Text Label 5600 4700 0    50   ~ 0
A9
Text Label 5600 4800 0    50   ~ 0
A8
Wire Wire Line
	5500 4400 5900 4400
Wire Wire Line
	5900 4500 5500 4500
Text Label 5550 4400 0    50   ~ 0
MASK0
Text Label 5550 4500 0    50   ~ 0
MASK1
Entry Wire Line
	4000 1900 4100 2000
Entry Wire Line
	4000 1800 4100 1900
Entry Wire Line
	4000 2000 4100 2100
Entry Wire Line
	4000 2100 4100 2200
Entry Wire Line
	4000 2200 4100 2300
Entry Wire Line
	4000 2300 4100 2400
Entry Wire Line
	4000 2400 4100 2500
Entry Wire Line
	4000 2500 4100 2600
Entry Wire Line
	4000 2600 4100 2700
Entry Wire Line
	4000 2700 4100 2800
Wire Wire Line
	4100 1900 4500 1900
Wire Wire Line
	4500 2000 4100 2000
Wire Wire Line
	4100 2100 4500 2100
Wire Wire Line
	4500 2200 4100 2200
Wire Wire Line
	4100 2300 4500 2300
Wire Wire Line
	4500 2400 4100 2400
Wire Wire Line
	4100 2500 4500 2500
Wire Wire Line
	4500 2600 4100 2600
Wire Wire Line
	4100 2700 4500 2700
Wire Wire Line
	4500 2800 4100 2800
Text Label 4200 1900 0    50   ~ 0
A12
Text Label 4200 2000 0    50   ~ 0
A7
Text Label 4200 2100 0    50   ~ 0
A6
Text Label 4200 2200 0    50   ~ 0
A0
Text Label 4200 2300 0    50   ~ 0
A1
Text Label 4200 2400 0    50   ~ 0
A2
Text Label 4200 2500 0    50   ~ 0
A3
Text Label 4200 2600 0    50   ~ 0
A4
Text Label 4200 2700 0    50   ~ 0
A5
Text Label 4200 2800 0    50   ~ 0
A13
Entry Wire Line
	5900 2000 6000 2100
Entry Wire Line
	5900 1900 6000 2000
Entry Wire Line
	5900 2100 6000 2200
Entry Wire Line
	5900 2200 6000 2300
Entry Wire Line
	5900 2300 6000 2400
Entry Wire Line
	5900 2400 6000 2500
Entry Wire Line
	5900 2500 6000 2600
Entry Wire Line
	5900 2600 6000 2700
Wire Wire Line
	5500 1900 5900 1900
Wire Wire Line
	5900 2000 5500 2000
Wire Wire Line
	5500 2100 5900 2100
Wire Wire Line
	5900 2400 5500 2400
Wire Wire Line
	5500 2500 5900 2500
Wire Wire Line
	5900 2600 5500 2600
Text Label 5600 1900 0    50   ~ 0
~M0-7
Text Label 5600 2000 0    50   ~ 0
A14
Text Label 5600 2100 0    50   ~ 0
A10
Text Label 5600 2400 0    50   ~ 0
A11
Text Label 5600 2500 0    50   ~ 0
A9
Text Label 5600 2600 0    50   ~ 0
A8
Wire Wire Line
	5500 2200 5900 2200
Wire Wire Line
	5900 2300 5500 2300
Text Label 5550 2200 0    50   ~ 0
MASK0
Text Label 5550 2300 0    50   ~ 0
MASK1
Entry Wire Line
	6000 4350 6100 4450
Entry Wire Line
	6000 4250 6100 4350
Entry Wire Line
	6000 4450 6100 4550
Entry Wire Line
	6000 4550 6100 4650
Entry Wire Line
	6000 4650 6100 4750
Entry Wire Line
	6000 4750 6100 4850
Entry Wire Line
	6000 4850 6100 4950
Entry Wire Line
	6000 4950 6100 5050
Wire Wire Line
	6100 4350 6450 4350
Wire Wire Line
	6500 4450 6100 4450
Wire Wire Line
	6100 4550 6500 4550
Wire Wire Line
	6500 4650 6100 4650
Wire Wire Line
	6100 4750 6500 4750
Wire Wire Line
	6500 4850 6100 4850
Wire Wire Line
	6100 4950 6500 4950
Wire Wire Line
	6500 5050 6100 5050
Entry Wire Line
	7900 4350 8000 4450
Entry Wire Line
	7900 4450 8000 4550
Entry Wire Line
	7900 4550 8000 4650
Entry Wire Line
	7900 4650 8000 4750
Entry Wire Line
	7900 4750 8000 4850
Wire Wire Line
	7500 4350 7900 4350
Wire Wire Line
	7900 4650 7500 4650
Wire Wire Line
	7500 4750 7900 4750
Wire Wire Line
	7500 4450 7900 4450
Wire Wire Line
	7900 4550 7500 4550
$Comp
L Logic_Programmable:GAL16V8 U3
U 1 1 5F85239D
P 7000 4650
F 0 "U3" H 7000 5531 50  0000 C CNN
F 1 "GAL16V8" H 7000 5440 50  0000 C CNN
F 2 "Package_SO:SOIC-20W_7.5x12.8mm_P1.27mm" H 7000 4650 50  0001 C CNN
F 3 "" H 7000 4650 50  0001 C CNN
	1    7000 4650
	1    0    0    -1  
$EndComp
NoConn ~ 7500 4150
NoConn ~ 7500 4250
NoConn ~ 7500 4850
Text Label 6150 4350 0    50   ~ 0
~M0-7
Text Label 6150 4450 0    50   ~ 0
A14
Text Label 6150 4550 0    50   ~ 0
MASK0
Text Label 6150 4750 0    50   ~ 0
MASK1
Text Label 6150 4650 0    50   ~ 0
~RD
Wire Wire Line
	6450 4350 6450 4250
Wire Wire Line
	6450 4150 6500 4150
Connection ~ 6450 4350
Wire Wire Line
	6450 4350 6500 4350
Wire Wire Line
	6500 4250 6450 4250
Connection ~ 6450 4250
Wire Wire Line
	6450 4250 6450 4150
Text Label 6150 4850 0    50   ~ 0
~CE
Text Label 6150 4950 0    50   ~ 0
~MREQ
Text Label 6150 5050 0    50   ~ 0
~WR
Entry Wire Line
	6000 2150 6100 2250
Entry Wire Line
	6000 2050 6100 2150
Entry Wire Line
	6000 2250 6100 2350
Entry Wire Line
	6000 2350 6100 2450
Entry Wire Line
	6000 2450 6100 2550
Entry Wire Line
	6000 2550 6100 2650
Entry Wire Line
	6000 2650 6100 2750
Entry Wire Line
	6000 2750 6100 2850
Wire Wire Line
	6100 2150 6450 2150
Wire Wire Line
	6500 2250 6100 2250
Wire Wire Line
	6100 2350 6500 2350
Wire Wire Line
	6500 2450 6100 2450
Wire Wire Line
	6100 2550 6500 2550
Wire Wire Line
	6500 2650 6100 2650
Wire Wire Line
	6100 2750 6500 2750
Wire Wire Line
	6500 2850 6100 2850
Text Label 6150 2150 0    50   ~ 0
~M0-7
Text Label 6150 2250 0    50   ~ 0
A14
Text Label 6150 2350 0    50   ~ 0
MASK0
Text Label 6150 2550 0    50   ~ 0
MASK1
Text Label 6150 2450 0    50   ~ 0
~RD
Wire Wire Line
	6450 2150 6450 2050
Wire Wire Line
	6450 1950 6500 1950
Connection ~ 6450 2150
Wire Wire Line
	6450 2150 6500 2150
Wire Wire Line
	6500 2050 6450 2050
Connection ~ 6450 2050
Wire Wire Line
	6450 2050 6450 1950
Text Label 6150 2650 0    50   ~ 0
~CE
Text Label 6150 2750 0    50   ~ 0
~MREQ
Text Label 6150 2850 0    50   ~ 0
~WR
Text Label 7550 4350 0    50   ~ 0
~ROM-CE
Text Label 7500 4450 0    50   ~ 0
SLOT2-LD
Text Label 7500 4550 0    50   ~ 0
~SLOT2-OE
Text Label 7500 4650 0    50   ~ 0
SLOT1-LD
Text Label 7500 4750 0    50   ~ 0
~SLOT1-OE
Entry Wire Line
	7900 2150 8000 2250
Entry Wire Line
	7900 2250 8000 2350
Entry Wire Line
	7900 2350 8000 2450
Entry Wire Line
	7900 2450 8000 2550
Entry Wire Line
	7900 2550 8000 2650
Wire Wire Line
	7500 2150 7900 2150
Wire Wire Line
	7900 2450 7500 2450
Wire Wire Line
	7500 2550 7900 2550
Wire Wire Line
	7500 2250 7900 2250
Wire Wire Line
	7900 2350 7500 2350
Text Label 7550 2150 0    50   ~ 0
~ROM-CE
Text Label 7500 2250 0    50   ~ 0
SLOT2-LD
Text Label 7500 2350 0    50   ~ 0
~SLOT2-OE
Text Label 7500 2450 0    50   ~ 0
SLOT1-LD
Text Label 7500 2550 0    50   ~ 0
~SLOT1-OE
NoConn ~ 7500 2650
NoConn ~ 7500 2050
NoConn ~ 7500 1950
NoConn ~ 9500 2700
NoConn ~ 9500 2600
NoConn ~ 9500 2500
NoConn ~ 9500 5100
NoConn ~ 9500 5000
NoConn ~ 9500 4900
Wire Wire Line
	8500 4400 8100 4400
Entry Wire Line
	8000 4300 8100 4400
Wire Wire Line
	8500 4500 8100 4500
Entry Wire Line
	8000 4400 8100 4500
Wire Wire Line
	8500 4600 8100 4600
Entry Wire Line
	8000 4500 8100 4600
Wire Wire Line
	8500 4700 8100 4700
Entry Wire Line
	8000 4600 8100 4700
Wire Wire Line
	8500 4800 8450 4800
Entry Wire Line
	8000 4700 8100 4800
Text Label 8150 4400 0    50   ~ 0
D0
Text Label 8150 4500 0    50   ~ 0
D1
Text Label 8150 4600 0    50   ~ 0
D2
Text Label 8150 4700 0    50   ~ 0
D3
Text Label 8150 4800 0    50   ~ 0
D4
Wire Wire Line
	8450 4800 8450 4900
Wire Wire Line
	8450 5100 8500 5100
Connection ~ 8450 4800
Wire Wire Line
	8450 4800 8100 4800
Wire Wire Line
	8500 5000 8450 5000
Connection ~ 8450 5000
Wire Wire Line
	8450 5000 8450 5100
Wire Wire Line
	8500 4900 8450 4900
Connection ~ 8450 4900
Wire Wire Line
	8450 4900 8450 5000
Wire Wire Line
	9500 4800 9850 4800
Wire Wire Line
	9500 4700 10150 4700
Wire Wire Line
	9500 4600 10450 4600
Wire Wire Line
	9500 4500 10750 4500
Wire Wire Line
	9500 4400 10200 4400
Text Label 9650 4400 0    50   ~ 0
ROM-A14
Text Label 9650 4500 0    50   ~ 0
ROM-A15
Text Label 9650 4600 0    50   ~ 0
ROM-A16
Text Label 9650 4700 0    50   ~ 0
ROM-A17
Text Label 9650 4800 0    50   ~ 0
ROM-A18
Entry Wire Line
	10900 4800 11000 4900
Entry Wire Line
	10900 4700 11000 4800
Entry Wire Line
	10900 4600 11000 4700
Entry Wire Line
	10900 4500 11000 4600
Entry Wire Line
	10900 4400 11000 4500
Wire Wire Line
	9500 2400 10900 2400
Wire Wire Line
	9500 2300 10900 2300
Wire Wire Line
	9500 2200 10900 2200
Wire Wire Line
	9500 2100 10900 2100
Wire Wire Line
	9500 2000 10900 2000
Text Label 9600 2000 0    50   ~ 0
ROM-A14
Text Label 9600 2100 0    50   ~ 0
ROM-A15
Text Label 9600 2200 0    50   ~ 0
ROM-A16
Text Label 9600 2300 0    50   ~ 0
ROM-A17
Text Label 9600 2400 0    50   ~ 0
ROM-A18
Entry Wire Line
	10900 2400 11000 2500
Entry Wire Line
	10900 2300 11000 2400
Entry Wire Line
	10900 2200 11000 2300
Entry Wire Line
	10900 2100 11000 2200
Entry Wire Line
	10900 2000 11000 2100
Wire Wire Line
	8500 2000 8100 2000
Entry Wire Line
	8000 1900 8100 2000
Wire Wire Line
	8500 2100 8100 2100
Entry Wire Line
	8000 2000 8100 2100
Wire Wire Line
	8500 2200 8100 2200
Entry Wire Line
	8000 2100 8100 2200
Wire Wire Line
	8500 2300 8100 2300
Entry Wire Line
	8000 2200 8100 2300
Wire Wire Line
	8500 2400 8450 2400
Entry Wire Line
	8000 2300 8100 2400
Text Label 8150 2000 0    50   ~ 0
D0
Text Label 8150 2100 0    50   ~ 0
D1
Text Label 8150 2200 0    50   ~ 0
D2
Text Label 8150 2300 0    50   ~ 0
D3
Text Label 8150 2400 0    50   ~ 0
D4
Wire Wire Line
	8450 2400 8450 2500
Wire Wire Line
	8450 2700 8500 2700
Connection ~ 8450 2400
Wire Wire Line
	8450 2400 8100 2400
Wire Wire Line
	8500 2600 8450 2600
Connection ~ 8450 2600
Wire Wire Line
	8450 2600 8450 2700
Wire Wire Line
	8500 2500 8450 2500
Connection ~ 8450 2500
Wire Wire Line
	8450 2500 8450 2600
Wire Wire Line
	8500 2900 8100 2900
Wire Wire Line
	8100 3000 8500 3000
Text Label 8100 2900 0    50   ~ 0
SLOT2-LD
Text Label 8100 3000 0    50   ~ 0
~SLOT2-OE
Entry Wire Line
	8000 2900 8100 3000
Entry Wire Line
	8000 2800 8100 2900
Wire Wire Line
	8500 5300 8100 5300
Wire Wire Line
	8100 5400 8500 5400
Text Label 8100 5300 0    50   ~ 0
SLOT1-LD
Text Label 8100 5400 0    50   ~ 0
~SLOT1-OE
Entry Wire Line
	8000 5300 8100 5400
Entry Wire Line
	8000 5200 8100 5300
$Comp
L Device:R R2
U 1 1 5F99C5BA
P 10150 5050
F 0 "R2" H 10220 5096 50  0000 L CNN
F 1 "10K" H 10220 5005 50  0000 L CNN
F 2 "Resistor_SMD:R_0603_1608Metric_Pad0.98x0.95mm_HandSolder" V 10080 5050 50  0001 C CNN
F 3 "~" H 10150 5050 50  0001 C CNN
	1    10150 5050
	1    0    0    -1  
$EndComp
$Comp
L Device:R R3
U 1 1 5F9A4378
P 10450 5050
F 0 "R3" H 10520 5096 50  0000 L CNN
F 1 "10K" H 10520 5005 50  0000 L CNN
F 2 "Resistor_SMD:R_0603_1608Metric_Pad0.98x0.95mm_HandSolder" V 10380 5050 50  0001 C CNN
F 3 "~" H 10450 5050 50  0001 C CNN
	1    10450 5050
	1    0    0    -1  
$EndComp
$Comp
L Device:R R4
U 1 1 5F9A4694
P 10750 5050
F 0 "R4" H 10820 5096 50  0000 L CNN
F 1 "10K" H 10820 5005 50  0000 L CNN
F 2 "Resistor_SMD:R_0603_1608Metric_Pad0.98x0.95mm_HandSolder" V 10680 5050 50  0001 C CNN
F 3 "~" H 10750 5050 50  0001 C CNN
	1    10750 5050
	1    0    0    -1  
$EndComp
$Comp
L Device:R R1
U 1 1 5F7B92BB
P 9850 5050
F 0 "R1" H 9920 5096 50  0000 L CNN
F 1 "10K" H 9920 5005 50  0000 L CNN
F 2 "Resistor_SMD:R_0603_1608Metric_Pad0.98x0.95mm_HandSolder" V 9780 5050 50  0001 C CNN
F 3 "~" H 9850 5050 50  0001 C CNN
	1    9850 5050
	1    0    0    -1  
$EndComp
$Comp
L Device:R R5
U 1 1 5F9E4BE2
P 10450 4200
F 0 "R5" V 10243 4200 50  0000 C CNN
F 1 "10K" V 10334 4200 50  0000 C CNN
F 2 "Resistor_SMD:R_0603_1608Metric_Pad0.98x0.95mm_HandSolder" V 10380 4200 50  0001 C CNN
F 3 "~" H 10450 4200 50  0001 C CNN
	1    10450 4200
	0    1    1    0   
$EndComp
Wire Wire Line
	10600 4200 10900 4200
Entry Wire Line
	10900 4200 11000 4300
Text Label 10700 4200 0    50   ~ 0
A14
Wire Wire Line
	10300 4200 10200 4200
Wire Wire Line
	10200 4200 10200 4400
Connection ~ 10200 4400
Wire Wire Line
	10200 4400 10900 4400
$Comp
L power:GND #PWR0101
U 1 1 5F9F605A
P 10750 5400
F 0 "#PWR0101" H 10750 5150 50  0001 C CNN
F 1 "GND" H 10755 5227 50  0000 C CNN
F 2 "" H 10750 5400 50  0001 C CNN
F 3 "" H 10750 5400 50  0001 C CNN
	1    10750 5400
	1    0    0    -1  
$EndComp
Wire Wire Line
	10750 5400 10750 5300
Wire Wire Line
	10750 5300 10450 5300
Wire Wire Line
	9850 5300 9850 5200
Wire Wire Line
	10150 5200 10150 5300
Connection ~ 10150 5300
Wire Wire Line
	10150 5300 9850 5300
Wire Wire Line
	10450 5200 10450 5300
Connection ~ 10450 5300
Wire Wire Line
	10450 5300 10150 5300
Wire Wire Line
	10750 5200 10750 5300
Connection ~ 10750 5300
Wire Wire Line
	9850 4900 9850 4800
Connection ~ 9850 4800
Wire Wire Line
	9850 4800 10900 4800
Wire Wire Line
	10150 4900 10150 4700
Connection ~ 10150 4700
Wire Wire Line
	10150 4700 10900 4700
Wire Wire Line
	10450 4900 10450 4600
Connection ~ 10450 4600
Wire Wire Line
	10450 4600 10900 4600
Wire Wire Line
	10750 4900 10750 4500
Connection ~ 10750 4500
Wire Wire Line
	10750 4500 10900 4500
Entry Wire Line
	3900 1750 4000 1850
Entry Wire Line
	3900 1850 4000 1950
Entry Wire Line
	3900 1950 4000 2050
Entry Wire Line
	3900 2050 4000 2150
Entry Wire Line
	3900 2150 4000 2250
Text Label 3700 1750 0    50   ~ 0
D0
Text Label 3700 1850 0    50   ~ 0
D1
Text Label 3700 1950 0    50   ~ 0
D2
Text Label 3700 2050 0    50   ~ 0
D3
Text Label 3700 2150 0    50   ~ 0
D4
Text Label 3700 2250 0    50   ~ 0
D5
Text Label 3700 2350 0    50   ~ 0
D6
Text Label 3700 2450 0    50   ~ 0
D7
Entry Wire Line
	3900 2250 4000 2350
Entry Wire Line
	3900 2350 4000 2450
Entry Wire Line
	3900 2450 4000 2550
Wire Wire Line
	3900 2450 3600 2450
Wire Wire Line
	3600 2350 3900 2350
Wire Wire Line
	3900 2250 3600 2250
Wire Wire Line
	3600 2150 3900 2150
Wire Wire Line
	3900 2050 3600 2050
Wire Wire Line
	3600 1950 3900 1950
Wire Wire Line
	3900 1850 3600 1850
Wire Wire Line
	3600 1750 3900 1750
Entry Wire Line
	1500 1750 1600 1850
Entry Wire Line
	1500 1650 1600 1750
Entry Wire Line
	1500 1850 1600 1950
Entry Wire Line
	1500 1950 1600 2050
Entry Wire Line
	1500 2050 1600 2150
Entry Wire Line
	1500 2150 1600 2250
Entry Wire Line
	1500 2250 1600 2350
Entry Wire Line
	1500 2350 1600 2450
Entry Wire Line
	1500 2450 1600 2550
Entry Wire Line
	1500 2550 1600 2650
Text Label 2100 2450 0    50   ~ 0
A7
Text Label 2100 2350 0    50   ~ 0
A6
Text Label 2100 1750 0    50   ~ 0
A0
Text Label 2100 1850 0    50   ~ 0
A1
Text Label 2100 1950 0    50   ~ 0
A2
Text Label 2100 2050 0    50   ~ 0
A3
Text Label 2100 2150 0    50   ~ 0
A4
Text Label 2100 2250 0    50   ~ 0
A5
Text Label 2100 2750 0    50   ~ 0
A10
Text Label 2100 2850 0    50   ~ 0
A11
Text Label 2100 2550 0    50   ~ 0
A8
Text Label 2100 2650 0    50   ~ 0
A9
Text Label 2100 2950 0    50   ~ 0
A12
Text Label 2100 3050 0    50   ~ 0
A13
Wire Wire Line
	1600 2650 2400 2650
Wire Wire Line
	1600 2550 2400 2550
Wire Wire Line
	1600 2450 2400 2450
Wire Wire Line
	1600 2350 2400 2350
Wire Wire Line
	1600 2250 2400 2250
Wire Wire Line
	1600 2150 2400 2150
Wire Wire Line
	1600 2050 2400 2050
Wire Wire Line
	1600 1950 2400 1950
Wire Wire Line
	1600 1850 2400 1850
Wire Wire Line
	1600 1750 2400 1750
Entry Wire Line
	1500 2650 1600 2750
Entry Wire Line
	1500 2750 1600 2850
Entry Wire Line
	1500 2850 1600 2950
Entry Wire Line
	1500 2950 1600 3050
Wire Wire Line
	1600 3050 2400 3050
Wire Wire Line
	1600 2950 2400 2950
Wire Wire Line
	1600 2850 2400 2850
Wire Wire Line
	1600 2750 2400 2750
Text Label 1750 3150 0    50   ~ 0
ROM-A14
Text Label 1750 3250 0    50   ~ 0
ROM-A15
Text Label 1750 3350 0    50   ~ 0
ROM-A16
Text Label 1750 3450 0    50   ~ 0
ROM-A17
Text Label 1750 3550 0    50   ~ 0
ROM-A18
Wire Wire Line
	2400 3150 1600 3150
Wire Wire Line
	1600 3250 2400 3250
Wire Wire Line
	2400 3350 1600 3350
Wire Wire Line
	1600 3450 2400 3450
Wire Wire Line
	2400 3550 1600 3550
Entry Wire Line
	1500 3050 1600 3150
Entry Wire Line
	1500 3150 1600 3250
Entry Wire Line
	1500 3250 1600 3350
Entry Wire Line
	1500 3350 1600 3450
Entry Wire Line
	1500 3450 1600 3550
Text Label 2050 3950 0    50   ~ 0
~ROM-CE
Text Label 2050 4050 0    50   ~ 0
~RD
Text Label 2050 3750 0    50   ~ 0
~WR
Wire Wire Line
	1600 3750 2400 3750
Wire Wire Line
	1600 3950 2400 3950
Wire Wire Line
	1600 4050 2400 4050
Entry Wire Line
	1500 3650 1600 3750
Entry Wire Line
	1500 3850 1600 3950
Entry Wire Line
	1500 3950 1600 4050
$Comp
L power:VCC #PWR0102
U 1 1 5FF05D88
P 2400 4300
F 0 "#PWR0102" H 2400 4150 50  0001 C CNN
F 1 "VCC" H 2415 4473 50  0000 C CNN
F 2 "" H 2400 4300 50  0001 C CNN
F 3 "" H 2400 4300 50  0001 C CNN
	1    2400 4300
	1    0    0    -1  
$EndComp
Wire Wire Line
	2400 4300 2400 4350
Connection ~ 2000 4350
Wire Wire Line
	1650 4900 1650 4850
Connection ~ 1650 4850
$Comp
L Device:C C7
U 1 1 5FF63DCE
P 2700 5400
F 0 "C7" H 2815 5446 50  0000 L CNN
F 1 "10n" H 2815 5355 50  0000 L CNN
F 2 "" H 2738 5250 50  0001 C CNN
F 3 "~" H 2700 5400 50  0001 C CNN
	1    2700 5400
	1    0    0    -1  
$EndComp
Wire Wire Line
	3050 5250 3050 5200
Wire Wire Line
	3500 5200 3500 5250
Wire Wire Line
	3500 5150 3500 5200
Connection ~ 3500 5200
Wire Wire Line
	3500 5600 3500 5550
Wire Wire Line
	3050 5600 3050 5550
Wire Wire Line
	2700 5600 2700 5550
Wire Wire Line
	2350 5600 2350 5550
$Comp
L power:GND #PWR0105
U 1 1 600149C9
P 1650 5650
F 0 "#PWR0105" H 1650 5400 50  0001 C CNN
F 1 "GND" H 1655 5477 50  0000 C CNN
F 2 "" H 1650 5650 50  0001 C CNN
F 3 "" H 1650 5650 50  0001 C CNN
	1    1650 5650
	1    0    0    -1  
$EndComp
Wire Wire Line
	1650 5650 1650 5600
Wire Wire Line
	1650 5600 2000 5600
Wire Wire Line
	2000 5600 2000 5550
Connection ~ 1650 5600
Wire Wire Line
	1650 5600 1650 5550
Wire Wire Line
	2350 5250 2350 5200
Wire Wire Line
	2700 5200 2700 5250
Wire Wire Line
	1650 5250 1650 5200
Wire Wire Line
	1650 5200 2000 5200
Wire Wire Line
	2000 5200 2000 5250
$Comp
L Connector_Generic:Conn_02x25_Odd_Even J1
U 1 1 601183F4
P 3500 6700
F 0 "J1" V 3550 5412 50  0000 R CNN
F 1 "Conn_02x25_Odd_Even" V 3595 5413 50  0001 R CNN
F 2 "sega-connector:EDGE-2x25" H 3500 6700 50  0001 C CNN
F 3 "~" H 3500 6700 50  0001 C CNN
	1    3500 6700
	0    1    1    0   
$EndComp
Connection ~ 1500 6000
Wire Bus Line
	1500 6000 1500 7500
Text Notes 2000 6150 2    50   ~ 0
CONNECTOR
Wire Wire Line
	2300 6500 2300 6100
Wire Wire Line
	2300 7400 2300 7000
Wire Wire Line
	2400 6500 2400 6100
Wire Wire Line
	2500 6500 2500 6100
Wire Wire Line
	2600 6500 2600 6100
Wire Wire Line
	2700 6500 2700 6100
Wire Wire Line
	2800 6500 2800 6100
Wire Wire Line
	2900 6500 2900 6100
Wire Wire Line
	3100 6500 3100 6100
Wire Wire Line
	3200 6500 3200 6100
Wire Wire Line
	3300 6500 3300 6100
Wire Wire Line
	3400 6500 3400 6100
Wire Wire Line
	3500 6500 3500 6100
Wire Wire Line
	3600 6500 3600 6100
Wire Wire Line
	3200 7400 3200 7000
Wire Wire Line
	3300 7400 3300 7000
Wire Wire Line
	3400 7400 3400 7000
Wire Wire Line
	3500 7400 3500 7000
Wire Wire Line
	3600 7400 3600 7000
Wire Wire Line
	3700 7400 3700 7000
Wire Wire Line
	3900 7400 3900 7000
Wire Wire Line
	4000 7400 4000 7000
Wire Wire Line
	4100 7400 4100 7000
Wire Wire Line
	4200 7400 4200 7000
Wire Wire Line
	4300 7400 4300 7000
Wire Wire Line
	4400 7400 4400 7000
Wire Wire Line
	4500 7400 4500 7000
Wire Wire Line
	4600 7400 4600 7000
Wire Wire Line
	4700 7400 4700 7000
Wire Wire Line
	3900 6500 3900 6100
Wire Wire Line
	4000 6500 4000 6100
Wire Wire Line
	4100 6500 4100 6100
Wire Wire Line
	4200 6500 4200 6150
Wire Wire Line
	4300 6500 4300 6100
Wire Wire Line
	4400 6500 4400 6100
Wire Wire Line
	4500 6500 4500 6100
Wire Wire Line
	4600 6500 4600 6100
Wire Wire Line
	2400 7400 2400 7000
Wire Wire Line
	2500 7400 2500 7000
Wire Wire Line
	2600 7400 2600 7000
Wire Wire Line
	2700 7400 2700 7000
Wire Wire Line
	2800 7400 2800 7000
Wire Wire Line
	2900 7400 2900 7000
Wire Wire Line
	3100 7400 3100 7000
Text Label 2300 6450 1    50   ~ 0
~MC-F
Text Label 2400 6450 1    50   ~ 0
~CLK
Text Label 2500 6450 1    50   ~ 0
~ACK
Text Label 2600 6450 1    50   ~ 0
JyDs
Text Label 2700 6450 1    50   ~ 0
~WAIT
Text Label 2800 6450 1    50   ~ 0
~RFSH
Text Label 2900 6450 1    50   ~ 0
~M1
Text Label 3100 6450 1    50   ~ 0
A12
Text Label 3200 6450 1    50   ~ 0
A6
Text Label 3300 6450 1    50   ~ 0
A4
Text Label 3400 6450 1    50   ~ 0
A2
Text Label 3500 6450 1    50   ~ 0
A0
Text Label 3600 6450 1    50   ~ 0
D1
Text Label 3900 6400 1    50   ~ 0
D4
Text Label 4000 6450 1    50   ~ 0
D6
Text Label 4100 6450 1    50   ~ 0
~CE
Text Label 4200 6450 1    50   ~ 0
~M0-7
Text Label 4300 6450 1    50   ~ 0
A9
Text Label 4400 6450 1    50   ~ 0
A13
Text Label 4500 6450 1    50   ~ 0
~M8-B
Text Label 4600 6450 1    50   ~ 0
~MREQ
$Comp
L power:VCC #PWR0108
U 1 1 601F5A46
P 3000 6450
F 0 "#PWR0108" H 3000 6300 50  0001 C CNN
F 1 "VCC" V 3015 6623 50  0000 C CNN
F 2 "" H 3000 6450 50  0001 C CNN
F 3 "" H 3000 6450 50  0001 C CNN
	1    3000 6450
	1    0    0    -1  
$EndComp
$Comp
L power:GND #PWR0109
U 1 1 6020A695
P 3700 6450
F 0 "#PWR0109" H 3700 6200 50  0001 C CNN
F 1 "GND" V 3705 6277 50  0000 C CNN
F 2 "" H 3700 6450 50  0001 C CNN
F 3 "" H 3700 6450 50  0001 C CNN
	1    3700 6450
	-1   0    0    1   
$EndComp
Wire Wire Line
	3700 6500 3700 6450
Wire Wire Line
	3800 6450 3800 6500
$Comp
L power:GND #PWR0110
U 1 1 60234CE7
P 3800 7150
F 0 "#PWR0110" H 3800 6900 50  0001 C CNN
F 1 "GND" V 3805 6977 50  0000 C CNN
F 2 "" H 3800 7150 50  0001 C CNN
F 3 "" H 3800 7150 50  0001 C CNN
	1    3800 7150
	1    0    0    -1  
$EndComp
Text Label 2300 7350 1    50   ~ 0
~NMI
Text Label 2400 7350 1    50   ~ 0
JRead
Text Label 2500 7350 1    50   ~ 0
~RST
Text Label 2600 7350 1    50   ~ 0
~BUSRQ
Text Label 2700 7350 1    50   ~ 0
~INT
Text Label 2800 7350 1    50   ~ 0
~HALT
Text Label 2900 7350 1    50   ~ 0
~IOREQ
Text Label 2100 7050 0    50   ~ 0
A15
Text Label 3100 7350 1    50   ~ 0
~CONT
Text Label 3200 7350 1    50   ~ 0
A7
Text Label 3300 7350 1    50   ~ 0
A5
Text Label 3400 7350 1    50   ~ 0
A3
Text Label 3500 7350 1    50   ~ 0
A1
Text Label 3600 7350 1    50   ~ 0
D0
Text Label 3700 7350 1    50   ~ 0
D2
Text Label 3900 7350 1    50   ~ 0
D3
Text Label 4000 7350 1    50   ~ 0
D5
Text Label 4100 7350 1    50   ~ 0
D7
Text Label 4200 7350 1    50   ~ 0
A10
Text Label 4300 7350 1    50   ~ 0
A11
Text Label 4400 7350 1    50   ~ 0
A8
Text Label 4500 7350 1    50   ~ 0
A14
Text Label 4600 7350 1    50   ~ 0
~RD
Text Label 4700 7350 1    50   ~ 0
~WR
NoConn ~ 2300 7400
NoConn ~ 2400 7400
NoConn ~ 2500 7400
NoConn ~ 2600 7400
NoConn ~ 2700 7400
NoConn ~ 2800 7400
NoConn ~ 2900 7400
NoConn ~ 3100 7400
NoConn ~ 2300 6100
NoConn ~ 2400 6100
NoConn ~ 2500 6100
NoConn ~ 2600 6100
NoConn ~ 2700 6100
NoConn ~ 2800 6100
NoConn ~ 2900 6100
NoConn ~ 4500 6100
Entry Wire Line
	3000 6000 3100 6100
Entry Wire Line
	3100 6000 3200 6100
Entry Wire Line
	3200 6000 3300 6100
Entry Wire Line
	3300 6000 3400 6100
Entry Wire Line
	3400 6000 3500 6100
Entry Wire Line
	3500 6000 3600 6100
Entry Wire Line
	3800 6000 3900 6100
Entry Wire Line
	3900 6000 4000 6100
Entry Wire Line
	4000 6000 4100 6100
Entry Wire Line
	4100 6000 4200 6100
Entry Wire Line
	4200 6000 4300 6100
Entry Wire Line
	4300 6000 4400 6100
Entry Wire Line
	4500 6000 4600 6100
Entry Wire Line
	3200 7400 3300 7500
Entry Wire Line
	3300 7400 3400 7500
Entry Wire Line
	3400 7400 3500 7500
Entry Wire Line
	3500 7400 3600 7500
Entry Wire Line
	3600 7400 3700 7500
Entry Wire Line
	3700 7400 3800 7500
Entry Wire Line
	3900 7400 4000 7500
Entry Wire Line
	4000 7400 4100 7500
Entry Wire Line
	4100 7400 4200 7500
Entry Wire Line
	4200 7400 4300 7500
Entry Wire Line
	4300 7400 4400 7500
Entry Wire Line
	4400 7400 4500 7500
Entry Wire Line
	4500 7400 4600 7500
Entry Wire Line
	4600 7400 4700 7500
Entry Wire Line
	4700 7400 4800 7500
Wire Wire Line
	3800 7000 3800 7150
$Comp
L power:VCC #PWR0111
U 1 1 5F88FB3D
P 4700 6450
F 0 "#PWR0111" H 4700 6300 50  0001 C CNN
F 1 "VCC" V 4715 6623 50  0000 C CNN
F 2 "" H 4700 6450 50  0001 C CNN
F 3 "" H 4700 6450 50  0001 C CNN
	1    4700 6450
	1    0    0    -1  
$EndComp
Wire Wire Line
	3000 7050 3000 7000
$Comp
L power:GND #PWR0112
U 1 1 5F9E36A4
P 3800 6450
F 0 "#PWR0112" H 3800 6200 50  0001 C CNN
F 1 "GND" V 3805 6277 50  0000 C CNN
F 2 "" H 3800 6450 50  0001 C CNN
F 3 "" H 3800 6450 50  0001 C CNN
	1    3800 6450
	-1   0    0    1   
$EndComp
Wire Wire Line
	3000 6450 3000 6500
Wire Wire Line
	4200 6150 2050 6150
Connection ~ 4200 6150
Wire Wire Line
	4200 6150 4200 6100
Wire Wire Line
	4700 6450 4700 6500
$Comp
L Connector:TestPoint_2Pole JP2
U 1 1 5FAF22EC
P 1850 6700
F 0 "JP2" V 1804 6758 50  0000 L CNN
F 1 "~M0-7~" V 1895 6758 50  0000 L CNN
F 2 "Jumper:SolderJumper-2_P1.3mm_Open_Pad1.0x1.5mm" H 1850 6700 50  0001 C CNN
F 3 "~" H 1850 6700 50  0001 C CNN
	1    1850 6700
	1    0    0    -1  
$EndComp
Wire Wire Line
	2050 7050 3000 7050
Wire Wire Line
	2050 6150 2050 6350
Wire Wire Line
	1650 6350 2050 6350
Text Notes 1650 6900 0    50   ~ 0
(See note 1)
Connection ~ 1650 6700
Wire Wire Line
	1650 6700 1650 6350
Wire Wire Line
	1650 6700 1650 7050
Wire Wire Line
	2050 6700 2050 6350
Connection ~ 2050 6350
Wire Wire Line
	2000 5600 2350 5600
Connection ~ 2000 5600
Connection ~ 2000 5200
$Comp
L Device:CP C3
U 1 1 5FBA5A5C
P 2400 4600
F 0 "C3" H 2518 4646 50  0000 L CNN
F 1 "1u" H 2518 4555 50  0000 L CNN
F 2 "Capacitor_SMD:C_0805_2012Metric_Pad1.18x1.45mm_HandSolder" H 2438 4450 50  0001 C CNN
F 3 "~" H 2400 4600 50  0001 C CNN
	1    2400 4600
	1    0    0    -1  
$EndComp
Wire Wire Line
	2000 4850 2400 4850
Wire Wire Line
	2400 4850 2400 4750
Connection ~ 2000 4850
Wire Wire Line
	2000 4350 2400 4350
Wire Wire Line
	2400 4350 2400 4450
Connection ~ 2350 5200
Wire Wire Line
	2350 5200 2000 5200
Connection ~ 2350 5600
Connection ~ 2700 5200
Connection ~ 2700 5600
Wire Wire Line
	2350 5600 2700 5600
Wire Wire Line
	2350 5200 2700 5200
Wire Wire Line
	2700 5600 3050 5600
Wire Wire Line
	2700 5200 3050 5200
Connection ~ 3050 5200
Connection ~ 3050 5600
Wire Wire Line
	3050 5200 3500 5200
Wire Wire Line
	3050 5600 3500 5600
$Comp
L Device:C C9
U 1 1 5FC92D84
P 3500 5400
F 0 "C9" H 3615 5446 50  0000 L CNN
F 1 "10n" H 3615 5355 50  0000 L CNN
F 2 "" H 3538 5250 50  0001 C CNN
F 3 "~" H 3500 5400 50  0001 C CNN
	1    3500 5400
	1    0    0    -1  
$EndComp
Connection ~ 2400 4350
Text Notes 4050 1200 0    50   ~ 0
ADDRESS DECODER\n(See Note 2)
Text Notes 2800 4650 0    50   ~ 0
BYPASS CAPS\n(See Note 3)
$Comp
L Connector:TestPoint_2Pole JP1
U 1 1 5F8E9A5B
P 1850 7050
F 0 "JP1" V 1896 6962 50  0000 R CNN
F 1 "A15 alt" V 1805 6962 50  0000 R CNN
F 2 "Jumper:SolderJumper-2_P1.3mm_Open_Pad1.0x1.5mm" H 1850 7050 50  0001 C CNN
F 3 "~" H 1850 7050 50  0001 C CNN
	1    1850 7050
	1    0    0    -1  
$EndComp
Wire Bus Line
	11000 1000 11000 5500
Wire Bus Line
	1500 6000 4500 6000
Wire Bus Line
	1500 7500 4800 7500
Wire Bus Line
	1500 1000 1500 6000
Wire Bus Line
	8000 1000 8000 5500
Wire Bus Line
	4000 1000 4000 5500
Wire Bus Line
	6000 1000 6000 5500
$EndSCHEMATC
