﻿"Data item name","Data item Description","Composite data item (1)","Composite data item - level (2)","Data Item Type","Data type","Cardinality","Default value","Values	Validation","Associated score","Allow multiple","Help text","Read only","Include item","Data item (SNOMED)","Is the data constraining?","SNOMED codes or subset ID","Is post-coordination allowed?","Care Record Element","Specific conditional behaviour","National data sets","Calculation","Annotation","Archetype Id","Section ID"
"other_context","","Yes: Structure","","Tree","n/a","[1..1]","","","","","","","","","","","","","","","","","openEHR-EHR-COMPOSITION.encounter.v1/context/other_context[at0001]","1"
"Confidentiality level","A term/number specifying the level of confidentiality of the Document. A number which can be mapped to the access control permissions","No","","Primary","COUNT","[1..1]",""," >= 0;  <= 10","","N","","N","","n/a","n/a","n/a","","","","","","","openEHR-EHR-CLUSTER.ehrn_metadata.v0/items[at0001]","2"
"Program details","","Yes: Cluster","","Label","Text","[0..1]","","","","","","","","","","","","","","","","","openEHR-EHR-CLUSTER.ehrn_metadata.v0/items[at0006]","2"
"Tenant name","Name of theplatform tenant through which the data has been recorded ","No","","Primary","TEXT","[0..1]","","Free or coded text","","N","","N","","n/a","Yes","n/a","","","","","","","openEHR-EHR-CLUSTER.ehrn_metadata.v0/items[at0006]/items[at0002]","2"
"Tenant ID"," ID of theplatform tenant through which the data has been recorded ","No","","Primary","TEXT","[0..1]","","Free or coded text","","N","","N","","n/a","Yes","n/a","","","","","","","openEHR-EHR-CLUSTER.ehrn_metadata.v0/items[at0006]/items[at0003]","2"
"Application name","Name of the application that created the composition","No","","Primary","TEXT","[0..1]","","Free or coded text","","N","","N","","n/a","Yes","n/a","","","","","","","openEHR-EHR-CLUSTER.ehrn_metadata.v0/items[at0006]/items[at0005]","2"
"Application ID","Registration id of the committing application","No","","Primary","TEXT","[0..1]","","Free or coded text","","N","","N","","n/a","Yes","n/a","","","","","","","openEHR-EHR-CLUSTER.ehrn_metadata.v0/items[at0006]/items[at0004]","2"
"Any event","Any timed measurement of height or body length.","Yes: Timing","","Composite","DateTime or Interval<DateTime>","[1..*]","","Offset = ","","","","","","","","","","","","","","","openEHR-EHR-OBSERVATION.height.v1/data[at0001]/events[at0002]","4"
"data","","Yes: Structure","","Tree","n/a","[1..1]","","","","","","","","","","","","","","","","","openEHR-EHR-OBSERVATION.height.v1/data[at0001]/events[at0002]/data[at0003]","4"
"Height/Length","The length of the body from crown of head to sole of foot.","No","","Primary","QUANTITY","[1..1]","","Property = LENGTH","","N","","N","","n/a","n/a","n/a","","","","","","","openEHR-EHR-OBSERVATION.height.v1/data[at0001]/events[at0002]/data[at0003]/items[at0004]","4"
"Comment","Comment about the measurement of body height/length.","No","","Primary","TEXT","[0..1]","","Free or coded text","","N","","N","","n/a","Yes","n/a","","","","","","","openEHR-EHR-OBSERVATION.height.v1/data[at0001]/events[at0002]/data[at0003]/items[at0018]","4"
"state","","Yes: Structure","","Tree","n/a","[1..1]","","","","","","","","","","","","","","","","","openEHR-EHR-OBSERVATION.height.v1/data[at0001]/events[at0002]/state[at0013]","4"
"Position","Position of individual when measured.","No","","Primary","CODED_TEXT","[0..1]","","Standing; Lying","","N","","N","","n/a","Yes","Standing (local::at0016)| Lying (local::at0020)","","","","","","","openEHR-EHR-OBSERVATION.height.v1/data[at0001]/events[at0002]/state[at0013]/items[at0014]","4"
"Confounding factors","Record any issues or factors that may impact on the measurement of body height/length eg noting of amputation.","No","","Primary","TEXT","[0..1]","","Free or coded text","","N","","N","","n/a","Yes","n/a","","","","","","","openEHR-EHR-OBSERVATION.height.v1/data[at0001]/events[at0002]/state[at0013]/items[at0019]","4"
"protocol","","Yes: Structure","","Tree","n/a","[1..1]","","","","","","","","","","","","","","","","","openEHR-EHR-OBSERVATION.height.v1/protocol[at0007]","4"
"Any event","Default, unspecified point in time or interval event which may be explicitly defined in a template or at run-time.","Yes: Timing","","Composite","DateTime or Interval<DateTime>","[0..*]","","Offset = ","","","","","","","","","","","","","","","openEHR-EHR-OBSERVATION.body_weight.v2/data[at0002]/events[at0003]","5"
"data","","Yes: Structure","","Tree","n/a","[1..1]","","","","","","","","","","","","","","","","","openEHR-EHR-OBSERVATION.body_weight.v2/data[at0002]/events[at0003]/data[at0001]","5"
"Weight","The weight of the individual.","No","","Primary","QUANTITY","[1..1]","","Property = MASS","","N","","N","","n/a","n/a","n/a","","","","","","","openEHR-EHR-OBSERVATION.body_weight.v2/data[at0002]/events[at0003]/data[at0001]/items[at0004]","5"
"Comment","Additional narrative about the measurement of Body weight, not captured in other fields.","No","","Primary","TEXT","[0..1]","","Free or coded text","","N","","N","","n/a","Yes","n/a","","","","","","","openEHR-EHR-OBSERVATION.body_weight.v2/data[at0002]/events[at0003]/data[at0001]/items[at0024]","5"
"state","","Yes: Structure","","Tree","n/a","[1..1]","","","","","","","","","","","","","","","","","openEHR-EHR-OBSERVATION.body_weight.v2/data[at0002]/events[at0003]/state[at0008]","5"
"State of dress","Description of the state of dress of the person at the time of weighing.","No","","Primary","CODED_TEXT","[0..1]","","Lightly clothed/underwear; Naked; Fully clothed, including shoes; Nappy/diaper","","N","","N","","n/a","Yes","Lightly clothed/underwear (local::at0011)| Naked (local::at0013)| Fully clothed, including shoes (local::at0010)| Nappy/diaper (local::at0017)","","","","","","","openEHR-EHR-OBSERVATION.body_weight.v2/data[at0002]/events[at0003]/state[at0008]/items[at0009]","5"
"Confounding factors","Record any issues or factors that may impact on the measurement of body weight eg timing in menstrual cycle, timing of recent bowel motion or noting of amputation.","No","","Primary","TEXT","[0..*]","","Free or coded text","","Y","","N","","n/a","Yes","n/a","","","","","","","openEHR-EHR-OBSERVATION.body_weight.v2/data[at0002]/events[at0003]/state[at0008]/items[at0025]","5"
"Birth","Usually the first weight, measured soon after birth. This event will only be used once per health record
.","Yes: Timing","","Composite","DateTime","[0..1]","","","","","","","","","","","","","","","","","openEHR-EHR-OBSERVATION.body_weight.v2/data[at0002]/events[at0026]","5"
"data","","Yes: Structure","","Tree","n/a","[1..1]","","","","","","","","","","","","","","","","","openEHR-EHR-OBSERVATION.body_weight.v2/data[at0002]/events[at0026]/data[at0001]","5"
"Weight","The weight of the individual.","No","","Primary","QUANTITY","[1..1]","","Property = MASS","","N","","N","","n/a","n/a","n/a","","","","","","","openEHR-EHR-OBSERVATION.body_weight.v2/data[at0002]/events[at0026]/data[at0001]/items[at0004]","5"
"Comment","Additional narrative about the measurement of Body weight, not captured in other fields.","No","","Primary","TEXT","[0..1]","","Free or coded text","","N","","N","","n/a","Yes","n/a","","","","","","","openEHR-EHR-OBSERVATION.body_weight.v2/data[at0002]/events[at0026]/data[at0001]/items[at0024]","5"
"state","","Yes: Structure","","Tree","n/a","[1..1]","","","","","","","","","","","","","","","","","openEHR-EHR-OBSERVATION.body_weight.v2/data[at0002]/events[at0026]/state[at0008]","5"
"State of dress","Description of the state of dress of the person at the time of weighing.","No","","Primary","CODED_TEXT","[0..1]","","Lightly clothed/underwear; Naked; Fully clothed, including shoes; Nappy/diaper","","N","","N","","n/a","Yes","Lightly clothed/underwear (local::at0011)| Naked (local::at0013)| Fully clothed, including shoes (local::at0010)| Nappy/diaper (local::at0017)","","","","","","","openEHR-EHR-OBSERVATION.body_weight.v2/data[at0002]/events[at0026]/state[at0008]/items[at0009]","5"
"Confounding factors","Record any issues or factors that may impact on the measurement of body weight eg timing in menstrual cycle, timing of recent bowel motion or noting of amputation.","No","","Primary","TEXT","[0..*]","","Free or coded text","","Y","","N","","n/a","Yes","n/a","","","","","","","openEHR-EHR-OBSERVATION.body_weight.v2/data[at0002]/events[at0026]/state[at0008]/items[at0025]","5"
"protocol","","Yes: Structure","","Tree","n/a","[1..1]","","","","","","","","","","","","","","","","","openEHR-EHR-OBSERVATION.body_weight.v2/protocol[at0015]","5"
"Any event","Any timed recording of Body Mass Index.","Yes: Timing","","Composite","DateTime or Interval<DateTime>","[1..*]","","Offset = ","","","","","","","","","","","","","","","openEHR-EHR-OBSERVATION.body_mass_index.v1/data[at0001]/events[at0002]","6"
"data","","Yes: Structure","","Tree","n/a","[1..1]","","","","","","","","","","","","","","","","","openEHR-EHR-OBSERVATION.body_mass_index.v1/data[at0001]/events[at0002]/data[at0003]","6"
"Body Mass Index","Index describing ratio of weight to height.","No","","Primary","QUANTITY","[1..1]","","Property = MASS PER AREA","","N","","N","","60621009","n/a","n/a","","","","","","","openEHR-EHR-OBSERVATION.body_mass_index.v1/data[at0001]/events[at0002]/data[at0003]/items[at0004]","6"
"protocol","","Yes: Structure","","Tree","n/a","[1..1]","","","","","","","","","","","","","","","","","openEHR-EHR-OBSERVATION.body_mass_index.v1/protocol[at0005]","6"
"Method","The method of entering the Body Mass Index.","No","","Primary","CODED_TEXT","[0..1]","","Automatic entry; Direct entry","","N","","N","","n/a","Yes","Automatic entry (local::at0007)| Direct entry (local::at0008)","","","","","","","openEHR-EHR-OBSERVATION.body_mass_index.v1/protocol[at0005]/items[at0006]","6"
"Formula","Formula used to derive the Body Mass Index.","No","","Primary","TEXT","[0..1]","","Free or coded text","","N","","N","","n/a","Yes","n/a","","","","","","","openEHR-EHR-OBSERVATION.body_mass_index.v1/protocol[at0005]/items[at0010]","6"
"Comment","Comment about the Body Mass Index measurement eg noting that the measurements used were adjusted weight/height.","No","","Primary","TEXT","[0..1]","","Free or coded text","","N","","N","","n/a","Yes","n/a","","","","","","","openEHR-EHR-OBSERVATION.body_mass_index.v1/protocol[at0005]/items[at0011]","6"
"data","","Yes: Structure","","Tree","n/a","[1..1]","","","","","","","","","","","","","","","","","openEHR-EHR-EVALUATION.clinical_synopsis.v1/data[at0001]","7"
"Synopsis","The summary, assessment, conclusions or evaluation of the clinical findings.","No","","Primary","TEXT","[1..1]","","Free or coded text","","N","","N","","n/a","Yes","n/a","","","","","","","openEHR-EHR-EVALUATION.clinical_synopsis.v1/data[at0001]/items[at0002]","7"
"protocol","","Yes: Structure","","Tree","n/a","[1..1]","","","","","","","","","","","","","","","","","openEHR-EHR-EVALUATION.clinical_synopsis.v1/protocol[at0003]","7"
