﻿"Data item name","Data item Description","Composite data item (1)","Composite data item - level (2)","Data Item Type","Data type","Cardinality","Default value","Values	Validation","Associated score","Allow multiple","Help text","Read only","Include item","Data item (SNOMED)","Is the data constraining?","SNOMED codes or subset ID","Is post-coordination allowed?","Care Record Element","Specific conditional behaviour","National data sets","Calculation","Annotation","Archetype Id","Section ID"
"other_context","","Yes: Structure","","Tree","n/a","[1..1]","","","","","","","","","","","","","","","","","openEHR-EHR-COMPOSITION.encounter.v1/context/other_context[at0001]","1"
"Confidentiality level","A term/number specifying the level of confidentiality of the Document. A number which can be mapped to the access control permissions","No","","Primary","COUNT","[1..1]",""," >= 0;  <= 10","","N","","N","","n/a","n/a","n/a","","","","","","","openEHR-EHR-CLUSTER.ehrn_metadata.v0/items[at0001]","2"
"Program details","","Yes: Cluster","","Label","Text","[0..1]","","","","","","","","","","","","","","","","","openEHR-EHR-CLUSTER.ehrn_metadata.v0/items[at0006]","2"
"Tenant name","Name of theplatform tenant through which the data has been recorded ","No","","Primary","TEXT","[0..1]","","Free or coded text","","N","","N","","n/a","Yes","n/a","","","","","","","openEHR-EHR-CLUSTER.ehrn_metadata.v0/items[at0006]/items[at0002]","2"
"Tenant ID"," ID of theplatform tenant through which the data has been recorded ","No","","Primary","TEXT","[0..1]","","Free or coded text","","N","","N","","n/a","Yes","n/a","","","","","","","openEHR-EHR-CLUSTER.ehrn_metadata.v0/items[at0006]/items[at0003]","2"
"Application name","Name of the application that created the composition","No","","Primary","TEXT","[0..1]","","Free or coded text","","N","","N","","n/a","Yes","n/a","","","","","","","openEHR-EHR-CLUSTER.ehrn_metadata.v0/items[at0006]/items[at0005]","2"
"Application ID","Registration id of the committing application","No","","Primary","TEXT","[0..1]","","Free or coded text","","N","","N","","n/a","Yes","n/a","","","","","","","openEHR-EHR-CLUSTER.ehrn_metadata.v0/items[at0006]/items[at0004]","2"
"data","","Yes: Structure","","Tree","n/a","[1..1]","","","","","","","","","","","","","","","","","openEHR-EHR-EVALUATION.dasha_vidha_pareeksha.v0/data[at0001]","3"
"Dooshyam","","Yes: Cluster","","Label","Text","[0..1]","","","","","","","","","","","","","","","","","openEHR-EHR-EVALUATION.dasha_vidha_pareeksha.v0/data[at0001]/items[at0003]","3"
"Rasa","","No","","Primary","BOOLEAN","[0..1]","","True, False","","N","","N","","n/a","n/a","n/a","","","","","","","openEHR-EHR-EVALUATION.dasha_vidha_pareeksha.v0/data[at0001]/items[at0003]/items[at0004]","3"
"Rakta","","No","","Primary","BOOLEAN","[0..1]","","True, False","","N","","N","","n/a","n/a","n/a","","","","","","","openEHR-EHR-EVALUATION.dasha_vidha_pareeksha.v0/data[at0001]/items[at0003]/items[at0005]","3"
"Mamsa","","No","","Primary","BOOLEAN","[0..1]","","True, False","","N","","N","","n/a","n/a","n/a","","","","","","","openEHR-EHR-EVALUATION.dasha_vidha_pareeksha.v0/data[at0001]/items[at0003]/items[at0006]","3"
"Meda","","No","","Primary","BOOLEAN","[0..1]","","True, False","","N","","N","","n/a","n/a","n/a","","","","","","","openEHR-EHR-EVALUATION.dasha_vidha_pareeksha.v0/data[at0001]/items[at0003]/items[at0007]","3"
"Asthi","","No","","Primary","BOOLEAN","[0..1]","","True, False","","N","","N","","n/a","n/a","n/a","","","","","","","openEHR-EHR-EVALUATION.dasha_vidha_pareeksha.v0/data[at0001]/items[at0003]/items[at0008]","3"
"Majja","","No","","Primary","BOOLEAN","[0..1]","","True, False","","N","","N","","n/a","n/a","n/a","","","","","","","openEHR-EHR-EVALUATION.dasha_vidha_pareeksha.v0/data[at0001]/items[at0003]/items[at0009]","3"
"Shukra","","No","","Primary","BOOLEAN","[0..1]","","True, False","","N","","N","","n/a","n/a","n/a","","","","","","","openEHR-EHR-EVALUATION.dasha_vidha_pareeksha.v0/data[at0001]/items[at0003]/items[at0010]","3"
"Desham","","No","","Primary","TEXT","[0..1]","","Free or coded text","","N","","N","","n/a","Yes","n/a","","","","","","","openEHR-EHR-EVALUATION.dasha_vidha_pareeksha.v0/data[at0001]/items[at0011]","3"
"Balam","","No","","Primary","TEXT","[0..1]","","Free or coded text","","N","","N","","n/a","Yes","n/a","","","","","","","openEHR-EHR-EVALUATION.dasha_vidha_pareeksha.v0/data[at0001]/items[at0012]","3"
"Kalam","","No","","Primary","TEXT","[0..1]","","Free or coded text","","N","","N","","n/a","Yes","n/a","","","","","","","openEHR-EHR-EVALUATION.dasha_vidha_pareeksha.v0/data[at0001]/items[at0013]","3"
"Analam","","No","","Primary","TEXT","[0..1]","","Free or coded text","","N","","N","","n/a","Yes","n/a","","","","","","","openEHR-EHR-EVALUATION.dasha_vidha_pareeksha.v0/data[at0001]/items[at0014]","3"
"Prakruthi","","No","","Primary","TEXT","[0..1]","","Free or coded text","","N","","N","","n/a","Yes","n/a","","","","","","","openEHR-EHR-EVALUATION.dasha_vidha_pareeksha.v0/data[at0001]/items[at0015]","3"
"Vayas","","No","","Primary","TEXT","[0..1]","","Free or coded text","","N","","N","","n/a","Yes","n/a","","","","","","","openEHR-EHR-EVALUATION.dasha_vidha_pareeksha.v0/data[at0001]/items[at0016]","3"
"Satvam","","No","","Primary","TEXT","[0..1]","","Free or coded text","","N","","N","","n/a","Yes","n/a","","","","","","","openEHR-EHR-EVALUATION.dasha_vidha_pareeksha.v0/data[at0001]/items[at0017]","3"
"Satmyam","","No","","Primary","TEXT","[0..1]","","Free or coded text","","N","","N","","n/a","Yes","n/a","","","","","","","openEHR-EHR-EVALUATION.dasha_vidha_pareeksha.v0/data[at0001]/items[at0018]","3"
"Aharam","","No","","Primary","TEXT","[0..1]","","Free or coded text","","N","","N","","n/a","Yes","n/a","","","","","","","openEHR-EHR-EVALUATION.dasha_vidha_pareeksha.v0/data[at0001]/items[at0019]","3"
"Clinical synopsis","Overall evaluation ","No","","Primary","TEXT","[0..1]","","Free or coded text","","N","","N","","n/a","Yes","n/a","","","","","","","openEHR-EHR-EVALUATION.dasha_vidha_pareeksha.v0/data[at0001]/items[at0020]","3"
"protocol","","Yes: Structure","","Tree","n/a","[1..1]","","","","","","","","","","","","","","","","","openEHR-EHR-EVALUATION.dasha_vidha_pareeksha.v0/protocol[at0021]","3"
"Prakruti analysis details","Link to the detailed composition about prakruthi analysis ","No","","Primary","EHR_URI","[0..1]","","DV_EHR_URItruetruefalsefalse11","","N","","N","","n/a","n/a","n/a","","","","","","","openEHR-EHR-EVALUATION.dasha_vidha_pareeksha.v0/protocol[at0021]/items[at0022]","3"
