{
    "name": "T_MCOaaSUP_BPHNC",
    "title": "Fich sup BP HN etb demandeur",
    "produit": "PMSI MCO",
    "history": {
        "dateCreated": "2010",
        "dateDeleted": "",
        "dateMissing": []
    },
    "missingValues": [
        ""
    ],
    "fields": [
        {
            "name": "MNT_PHN_ETB_EXDG",
            "description": "Montant total de PHN payés à un établissement de santé - ex-DG ou ex-OQN - (en centimes d'euro)",
            "type": "number",
            "length": "10,2",
            "dateCreated": "2010",
            "dateDeleted": "2016",
            "nomenclature": "-",
            "dateMissing": [],
            "format": "default",
            "observation": "",
            "regle_gestion": "",
            "type_oracle": "number",
            "constraints": {
                "minimum": 0,
                "maximum": 9999999999,
                "decimals": 2
            }
        },
        {
            "name": "MNT_PHN_LAB_PRI",
            "description": "Montant total de PHN payés à un laboratoire privé ou un cabinet (en centimes d'euro)",
            "type": "number",
            "length": "10,2",
            "dateCreated": "2010",
            "dateDeleted": "2016",
            "nomenclature": "-",
            "dateMissing": [],
            "format": "default",
            "observation": "",
            "regle_gestion": "",
            "type_oracle": "number",
            "constraints": {
                "minimum": 0,
                "maximum": 9999999999,
                "decimals": 2
            }
        },
        {
            "name": "ETA_NUM",
            "description": "N° FINESS",
            "type": "string",
            "length": "9",
            "dateCreated": "2010",
            "dateDeleted": "",
            "nomenclature": "FINESS:ej_finess",
            "dateMissing": [],
            "format": "default",
            "observation": "",
            "regle_gestion": "",
            "type_oracle": "string",
            "constraints": {
                "maxLength": 9
            }
        },
        {
            "name": "MNT_LC_ETB_EXDG",
            "description": "Montant total d’actes de la LC dont la facture a été reçue  à un établissement de santé - ex-DG ou ex-OQN - (en centimes d'euro)",
            "type": "number",
            "length": "10,2",
            "dateCreated": "2016",
            "dateDeleted": "",
            "nomenclature": "-",
            "dateMissing": [],
            "format": "default",
            "observation": "",
            "regle_gestion": "",
            "type_oracle": "number",
            "constraints": {
                "minimum": 0,
                "maximum": 9999999999,
                "decimals": 2
            }
        },
        {
            "name": "MNT_LC_LAB_PRI",
            "description": "Montant total d’actes de la LC dont la facture a été reçue  à un laboratoire privé ou un cabinet (en centimes d'euro)",
            "type": "number",
            "length": "10,2",
            "dateCreated": "2016",
            "dateDeleted": "",
            "nomenclature": "-",
            "dateMissing": [],
            "format": "default",
            "observation": "",
            "regle_gestion": "",
            "type_oracle": "number",
            "constraints": {
                "minimum": 0,
                "maximum": 9999999999,
                "decimals": 2
            }
        },
        {
            "name": "MNT_RIHN_ETB_EXDG",
            "description": "Montant total d’actes du RIHN dont la facture a été reçue à un établissement de santé - ex-DG ou ex-OQN - (en centimes d'euro)",
            "type": "number",
            "length": "10,2",
            "dateCreated": "2016",
            "dateDeleted": "",
            "nomenclature": "-",
            "dateMissing": [],
            "format": "default",
            "observation": "",
            "regle_gestion": "",
            "type_oracle": "number",
            "constraints": {
                "minimum": 0,
                "maximum": 9999999999,
                "decimals": 2
            }
        },
        {
            "name": "MNT_BHN_LAB_PRI",
            "description": "Montant total de BHN payés à un laboratoire privé ou un cabinet (en centimes d'euro)",
            "type": "number",
            "length": "10,2",
            "dateCreated": "2010",
            "dateDeleted": "2016",
            "nomenclature": "-",
            "dateMissing": [],
            "format": "default",
            "observation": "",
            "regle_gestion": "",
            "type_oracle": "number",
            "constraints": {
                "minimum": 0,
                "maximum": 9999999999,
                "decimals": 2
            }
        },
        {
            "name": "MNT_RIHN_LAB_PRI",
            "description": "Montant total d’actes du RIHN dont la facture a été reçue à un laboratoire privé ou un cabinet (en centimes d'euro)",
            "type": "number",
            "length": "10,2",
            "dateCreated": "2016",
            "dateDeleted": "",
            "nomenclature": "-",
            "dateMissing": [],
            "format": "default",
            "observation": "",
            "regle_gestion": "",
            "type_oracle": "number",
            "constraints": {
                "minimum": 0,
                "maximum": 9999999999,
                "decimals": 2
            }
        },
        {
            "name": "FIC_TYP",
            "description": "Type de fichier",
            "type": "string",
            "length": "3",
            "dateCreated": "2010",
            "dateDeleted": "",
            "nomenclature": "-",
            "dateMissing": [],
            "format": "default",
            "observation": "",
            "regle_gestion": "",
            "type_oracle": "string",
            "constraints": {
                "maxLength": 3
            }
        },
        {
            "name": "MNT_BHN_ETB_EXDG",
            "description": "Montant total de BHN payés à un établissement de santé - ex-DG ou ex-OQN - (en centimes d'euro)",
            "type": "number",
            "length": "10,2",
            "dateCreated": "2010",
            "dateDeleted": "2016",
            "nomenclature": "-",
            "dateMissing": [],
            "format": "default",
            "observation": "",
            "regle_gestion": "",
            "type_oracle": "number",
            "constraints": {
                "minimum": 0,
                "maximum": 9999999999,
                "decimals": 2
            }
        },
        {
            "name": "ANN_MOI",
            "description": "Année+Mois",
            "type": "yearmonth",
            "length": "6",
            "dateCreated": "2010",
            "dateDeleted": "",
            "nomenclature": "-",
            "dateMissing": [],
            "format": "default",
            "observation": "",
            "regle_gestion": "",
            "type_oracle": "string"
        }
    ],
    "champ": "Public",
    "observation": "Chgt de nom en 2015 ajout du préfixe SUP_",
    "foreignKeys": [
        {
            "fields": [
                "ETA_NUM"
            ],
            "reference": {
                "resource": "T_MCOaaE",
                "fields": [
                    "ETA_NUM"
                ]
            }
        }
    ]
}