{
    "fields": [
        {
            "name": "ETA_NUM_EPMSI",
            "description": "N° FINESS e-PMSI",
            "type": "string",
            "nomenclature": "FINESS:ej_finess",
            "length": "9",
            "format": "default",
            "dateCreated": "2007",
            "dateDeleted": "",
            "dateMissing": [],
            "observation": "",
            "regle_gestion": "",
            "type_oracle": "string",
            "constraints": {
                "maxLength": 9
            }
        },
        {
            "name": "FOR_NUM",
            "description": "N° format",
            "type": "string",
            "nomenclature": "-",
            "length": "3",
            "format": "default",
            "dateCreated": "2007",
            "dateDeleted": "",
            "dateMissing": [],
            "observation": "",
            "regle_gestion": "",
            "type_oracle": "string",
            "constraints": {
                "maxLength": 3
            }
        },
        {
            "name": "FOR_NUM_ORI",
            "description": "N° format RIM d'orgine",
            "type": "string",
            "nomenclature": "-",
            "length": "3",
            "format": "default",
            "dateCreated": "2007",
            "dateDeleted": "",
            "dateMissing": [],
            "observation": "",
            "regle_gestion": "",
            "type_oracle": "string",
            "constraints": {
                "maxLength": 3
            }
        },
        {
            "name": "ETA_NUM_TWO",
            "description": "Second n° FINESS",
            "type": "string",
            "nomenclature": "FINESS:et_finess",
            "length": "9",
            "format": "default",
            "dateCreated": "2007",
            "dateDeleted": "",
            "dateMissing": [],
            "observation": "",
            "regle_gestion": "",
            "type_oracle": "string",
            "constraints": {
                "maxLength": 9
            }
        },
        {
            "name": "IPP_IRR_CRY",
            "description": "Cryptage irreversible de l'IPP",
            "type": "string",
            "nomenclature": "-",
            "length": "16",
            "format": "default",
            "dateCreated": "2007",
            "dateDeleted": "",
            "dateMissing": [],
            "observation": "",
            "regle_gestion": "",
            "type_oracle": "string",
            "constraints": {
                "maxLength": 16
            }
        },
        {
            "name": "SEJ_IDT",
            "description": "Identifiant de séjour",
            "type": "string",
            "nomenclature": "-",
            "length": "5",
            "format": "default",
            "dateCreated": "2007",
            "dateDeleted": "",
            "dateMissing": [],
            "observation": "",
            "regle_gestion": "",
            "type_oracle": "string",
            "constraints": {
                "maxLength": 5
            }
        },
        {
            "name": "AGE_ANN",
            "description": "Age du patient en années",
            "type": "number",
            "nomenclature": "-",
            "length": null,
            "format": "default",
            "dateCreated": "2007",
            "dateDeleted": "",
            "dateMissing": [],
            "observation": "",
            "regle_gestion": "",
            "type_oracle": "number"
        },
        {
            "name": "AGE_JOU",
            "description": "Age du patient en jours pour les enfants de moins d'un an",
            "type": "number",
            "nomenclature": "-",
            "length": null,
            "format": "default",
            "dateCreated": "2007",
            "dateDeleted": "",
            "dateMissing": [],
            "observation": "",
            "regle_gestion": "",
            "type_oracle": "number"
        },
        {
            "name": "COD_SEX",
            "description": "Sexe du patient",
            "type": "string",
            "nomenclature": "IR_SEX_V:SEX_COD",
            "length": "1",
            "format": "default",
            "dateCreated": "2007",
            "dateDeleted": "",
            "dateMissing": [],
            "observation": "",
            "regle_gestion": "",
            "type_oracle": "string",
            "constraints": {
                "maxLength": 1
            }
        },
        {
            "name": "BDI_COD",
            "description": "Code géographique de résidence",
            "type": "string",
            "nomenclature": "-",
            "length": "5",
            "format": "default",
            "dateCreated": "2007",
            "dateDeleted": "",
            "dateMissing": [],
            "observation": "",
            "regle_gestion": "",
            "type_oracle": "string",
            "constraints": {
                "maxLength": 5
            }
        },
        {
            "name": "BDI_DEP",
            "description": "Code département de résidence",
            "type": "string",
            "nomenclature": "-",
            "length": "2",
            "format": "default",
            "dateCreated": "2007",
            "dateDeleted": "",
            "dateMissing": [],
            "observation": "",
            "regle_gestion": "",
            "type_oracle": "string",
            "constraints": {
                "maxLength": 2
            }
        },
        {
            "name": "FOR_ACT",
            "description": "Forme d'activité",
            "type": "string",
            "nomenclature": "-",
            "length": "2",
            "format": "default",
            "dateCreated": "2012",
            "dateDeleted": "",
            "dateMissing": [],
            "observation": "",
            "regle_gestion": "",
            "type_oracle": "string",
            "constraints": {
                "maxLength": 2
            }
        },
        {
            "name": "RIP_NUM",
            "description": "N° séquentiel de séjour",
            "type": "string",
            "nomenclature": "-",
            "length": "6",
            "format": "default",
            "dateCreated": "2007",
            "dateDeleted": "",
            "dateMissing": [],
            "observation": "",
            "regle_gestion": "",
            "type_oracle": "string",
            "constraints": {
                "maxLength": 6
            }
        },
        {
            "name": "ENT_MOD",
            "description": "Mode d'entrée de séjour",
            "type": "string",
            "nomenclature": "MS_SOR_V",
            "length": "1",
            "format": "default",
            "dateCreated": "2007",
            "dateDeleted": "",
            "dateMissing": [],
            "observation": "",
            "regle_gestion": "",
            "type_oracle": "string",
            "constraints": {
                "maxLength": 1
            }
        },
        {
            "name": "ENT_PRV",
            "description": "Provenance",
            "type": "string",
            "nomenclature": "MS_PRV_V",
            "length": "1",
            "format": "default",
            "dateCreated": "2007",
            "dateDeleted": "",
            "dateMissing": [],
            "observation": "",
            "regle_gestion": "",
            "type_oracle": "string",
            "constraints": {
                "maxLength": 1
            }
        },
        {
            "name": "SOR_MOD",
            "description": "Mode de sortie de séjour",
            "type": "string",
            "nomenclature": "MS_SOR_V",
            "length": "1",
            "format": "default",
            "dateCreated": "2007",
            "dateDeleted": "",
            "dateMissing": [],
            "observation": "",
            "regle_gestion": "",
            "type_oracle": "string",
            "constraints": {
                "maxLength": 1
            }
        },
        {
            "name": "SOR_DES",
            "description": "Destination",
            "type": "string",
            "nomenclature": "MS_PRV_V",
            "length": "1",
            "format": "default",
            "dateCreated": "2007",
            "dateDeleted": "",
            "dateMissing": [],
            "observation": "",
            "regle_gestion": "",
            "type_oracle": "string",
            "constraints": {
                "maxLength": 1
            }
        },
        {
            "name": "SEC_NUM",
            "description": "N°de secteur ou de dispositif intersectoriel",
            "type": "string",
            "nomenclature": "-",
            "length": "5",
            "format": "default",
            "dateCreated": "2007",
            "dateDeleted": "",
            "dateMissing": [],
            "observation": "",
            "regle_gestion": "",
            "type_oracle": "string",
            "constraints": {
                "maxLength": 5
            }
        },
        {
            "name": "MOD_SOI",
            "description": "Mode légal de soins",
            "type": "string",
            "nomenclature": "-",
            "length": "1",
            "format": "default",
            "dateCreated": "2012",
            "dateDeleted": "",
            "dateMissing": [],
            "observation": "",
            "regle_gestion": "",
            "type_oracle": "string",
            "constraints": {
                "maxLength": 1
            }
        },
        {
            "name": "SEQ_IND",
            "description": "Indicateur de séquence correspondant à une sortie d’essai",
            "type": "string",
            "nomenclature": "-",
            "length": "1",
            "format": "default",
            "dateCreated": "2007",
            "dateDeleted": "",
            "dateMissing": [],
            "observation": "",
            "regle_gestion": "",
            "type_oracle": "string",
            "constraints": {
                "maxLength": 1
            }
        },
        {
            "name": "SEQ_SEQ_NUM",
            "description": "N° séquentiel de séquence au sein du séjour",
            "type": "string",
            "nomenclature": "-",
            "length": "3",
            "format": "default",
            "dateCreated": "2007",
            "dateDeleted": "",
            "dateMissing": [],
            "observation": "",
            "regle_gestion": "",
            "type_oracle": "string",
            "constraints": {
                "maxLength": 3
            }
        },
        {
            "name": "DEL_DAT",
            "description": "Délai entre la date de début de la séquence et la date d'entrée du séjour",
            "type": "number",
            "nomenclature": "-",
            "length": null,
            "format": "default",
            "dateCreated": "2007",
            "dateDeleted": "",
            "dateMissing": [],
            "observation": "",
            "regle_gestion": "",
            "type_oracle": "number"
        },
        {
            "name": "SEQ_PRE_IND",
            "description": "Indicateur de première séquence du séjour",
            "type": "string",
            "nomenclature": "-",
            "length": "1",
            "format": "default",
            "dateCreated": "2007",
            "dateDeleted": "",
            "dateMissing": [],
            "observation": "",
            "regle_gestion": "",
            "type_oracle": "string",
            "constraints": {
                "maxLength": 1
            }
        },
        {
            "name": "SEQ_DER_IND",
            "description": "Indicateur de dernière séquence du séjour",
            "type": "string",
            "nomenclature": "-",
            "length": "1",
            "format": "default",
            "dateCreated": "2007",
            "dateDeleted": "",
            "dateMissing": [],
            "observation": "",
            "regle_gestion": "",
            "type_oracle": "string",
            "constraints": {
                "maxLength": 1
            }
        },
        {
            "name": "SEQ_FIN_MOI",
            "description": "Mois de la date de fin de séquence",
            "type": "date",
            "nomenclature": "-",
            "length": "2",
            "format": "%m",
            "dateCreated": "2007",
            "dateDeleted": "",
            "dateMissing": [],
            "observation": "",
            "regle_gestion": "",
            "type_oracle": "string"
        },
        {
            "name": "SEQ_FIN_ANN",
            "description": "Année de la date de fin de séquence",
            "type": "year",
            "nomenclature": "-",
            "length": "4",
            "format": "default",
            "dateCreated": "2007",
            "dateDeleted": "",
            "dateMissing": [],
            "observation": "",
            "regle_gestion": "",
            "type_oracle": "string"
        },
        {
            "name": "SEQ_COU_NBJ",
            "description": "Nombre de jours couverts par la séquence",
            "type": "integer",
            "nomenclature": "-",
            "length": null,
            "format": "default",
            "dateCreated": "2007",
            "dateDeleted": "",
            "dateMissing": [],
            "observation": "",
            "regle_gestion": "",
            "type_oracle": "number"
        },
        {
            "name": "PRE_JOU_NBJ",
            "description": "Nombre de jours de présence",
            "type": "integer",
            "nomenclature": "-",
            "length": null,
            "format": "default",
            "dateCreated": "2007",
            "dateDeleted": "",
            "dateMissing": [],
            "observation": "",
            "regle_gestion": "",
            "type_oracle": "number"
        },
        {
            "name": "PRE_DEM_JOU_NBJ",
            "description": "Nombre de demi-journées de présence",
            "type": "integer",
            "nomenclature": "-",
            "length": null,
            "format": "default",
            "dateCreated": "2007",
            "dateDeleted": "",
            "dateMissing": [],
            "observation": "",
            "regle_gestion": "",
            "type_oracle": "number"
        },
        {
            "name": "THE_ISO_NBJ",
            "description": "Nombre de jours d’isolement thérapeutique",
            "type": "integer",
            "nomenclature": "-",
            "length": null,
            "format": "default",
            "dateCreated": "2007",
            "dateDeleted": "",
            "dateMissing": [],
            "observation": "",
            "regle_gestion": "",
            "type_oracle": "number"
        },
        {
            "name": "SCO_DEP_HAB",
            "description": "Score pour la dépendance pour l’habillage (AVQ)",
            "type": "string",
            "nomenclature": "-",
            "length": "1",
            "format": "default",
            "dateCreated": "2007",
            "dateDeleted": "",
            "dateMissing": [],
            "observation": "",
            "regle_gestion": "",
            "type_oracle": "string",
            "constraints": {
                "maxLength": 1
            }
        },
        {
            "name": "SCO_DEP_DPL",
            "description": "Score pour la dépendance pour le déplacement/Locomotion (AVQ)",
            "type": "string",
            "nomenclature": "-",
            "length": "1",
            "format": "default",
            "dateCreated": "2007",
            "dateDeleted": "",
            "dateMissing": [],
            "observation": "",
            "regle_gestion": "",
            "type_oracle": "string",
            "constraints": {
                "maxLength": 1
            }
        },
        {
            "name": "SCO_DEP_ALI",
            "description": "Score pour la dépendance pour l’alimentation (AVQ)",
            "type": "string",
            "nomenclature": "-",
            "length": "1",
            "format": "default",
            "dateCreated": "2007",
            "dateDeleted": "",
            "dateMissing": [],
            "observation": "",
            "regle_gestion": "",
            "type_oracle": "string",
            "constraints": {
                "maxLength": 1
            }
        },
        {
            "name": "SCO_DEP_CON",
            "description": "Score pour la dépendance pour la continence (AVQ)",
            "type": "string",
            "nomenclature": "-",
            "length": "1",
            "format": "default",
            "dateCreated": "2007",
            "dateDeleted": "",
            "dateMissing": [],
            "observation": "",
            "regle_gestion": "",
            "type_oracle": "string",
            "constraints": {
                "maxLength": 1
            }
        },
        {
            "name": "SCO_DEP_CPT",
            "description": "Score pour la dépendance pour le comportement (AVQ)",
            "type": "string",
            "nomenclature": "-",
            "length": "1",
            "format": "default",
            "dateCreated": "2007",
            "dateDeleted": "",
            "dateMissing": [],
            "observation": "",
            "regle_gestion": "",
            "type_oracle": "string",
            "constraints": {
                "maxLength": 1
            }
        },
        {
            "name": "SCO_DEP_COM",
            "description": "Score dépendance communication (AVQ)",
            "type": "string",
            "nomenclature": "-",
            "length": "1",
            "format": "default",
            "dateCreated": "2012",
            "dateDeleted": "",
            "dateMissing": [],
            "observation": "",
            "regle_gestion": "",
            "type_oracle": "string",
            "constraints": {
                "maxLength": 1
            }
        },
        {
            "name": "THE_MS_IND",
            "description": "Indicateur d’accompagnement thérapeutique en milieu scolaire",
            "type": "string",
            "nomenclature": "-",
            "length": "1",
            "format": "default",
            "dateCreated": "2007",
            "dateDeleted": "",
            "dateMissing": [],
            "observation": "",
            "regle_gestion": "",
            "type_oracle": "string",
            "constraints": {
                "maxLength": 1
            }
        },
        {
            "name": "ANO_IND",
            "description": "Indicateur d'anomalie",
            "type": "string",
            "nomenclature": "-",
            "length": "1",
            "format": "default",
            "dateCreated": "2012",
            "dateDeleted": "",
            "dateMissing": [],
            "observation": "",
            "regle_gestion": "",
            "type_oracle": "string",
            "constraints": {
                "maxLength": 1
            }
        },
        {
            "name": "ETB_SAN_AUTOR",
            "description": "Indicateur FINESS géographique sans autorisation",
            "type": "string",
            "nomenclature": "-",
            "length": null,
            "format": "default",
            "dateCreated": "2017",
            "dateDeleted": "2017",
            "dateMissing": [],
            "observation": "",
            "regle_gestion": "",
            "type_oracle": "string"
        },
        {
            "name": "TYP_GEN_RSA",
            "description": "Type de génération automatique du RPSA",
            "type": "string",
            "nomenclature": "-",
            "length": "1",
            "format": "default",
            "dateCreated": "2015",
            "dateDeleted": "",
            "dateMissing": [],
            "observation": "",
            "regle_gestion": "",
            "type_oracle": "string",
            "constraints": {
                "maxLength": 1
            }
        },
        {
            "name": "DGN_PAL",
            "description": "Diagnostic principal ou motif de prise en charge principale",
            "type": "string",
            "nomenclature": "MS_CIM_V",
            "length": "6",
            "format": "default",
            "dateCreated": "2007",
            "dateDeleted": "",
            "dateMissing": [],
            "observation": "",
            "regle_gestion": "",
            "type_oracle": "string",
            "constraints": {
                "maxLength": 6
            }
        },
        {
            "name": "NBR_DGN",
            "description": "Nombre de diagnostics et facteurs associés",
            "type": "number",
            "nomenclature": "-",
            "length": null,
            "format": "default",
            "dateCreated": "2007",
            "dateDeleted": "",
            "dateMissing": [],
            "observation": "",
            "regle_gestion": "",
            "type_oracle": "number"
        },
        {
            "name": "NBR_CCAM",
            "description": "Nombre d'actes CCAM",
            "type": "integer",
            "nomenclature": "-",
            "length": "5",
            "format": "default",
            "dateCreated": "2017",
            "dateDeleted": "2017",
            "dateMissing": [],
            "observation": "",
            "regle_gestion": "",
            "type_oracle": "number",
            "constraints": {
                "minimum": 0,
                "maximum": 99999
            }
        },
        {
            "name": "SEJ_LEG",
            "description": "Mode légal de séjour",
            "type": "string",
            "length": "1",
            "dateCreated": "2007",
            "dateDeleted": "2012",
            "nomenclature": "-",
            "dateMissing": [],
            "format": "default",
            "observation": "",
            "regle_gestion": "",
            "type_oracle": "string",
            "constraints": {
                "maxLength": 1
            }
        },
        {
            "name": "SCO_DEP_REL",
            "description": "Score pour la dépendance pour la relation (AVQ)",
            "type": "string",
            "length": "1",
            "dateCreated": "2007",
            "dateDeleted": "2012",
            "nomenclature": "-",
            "dateMissing": [],
            "format": "default",
            "observation": "",
            "regle_gestion": "",
            "type_oracle": "string",
            "constraints": {
                "maxLength": 1
            }
        },
        {
            "name": "NAT_PEC",
            "description": "Nature de prise en charge",
            "type": "string",
            "length": "2",
            "dateCreated": "2007",
            "dateDeleted": "2012",
            "nomenclature": "-",
            "dateMissing": [],
            "format": "default",
            "observation": "",
            "regle_gestion": "",
            "type_oracle": "string",
            "constraints": {
                "maxLength": 2
            }
        }
    ],
    "name": "T_RIPaaRSA",
    "title": "Résumé par séquence",
    "produit": "PMSI RIM-P",
    "missingValues": [
        ""
    ],
    "foreignKeys": [
        {
            "fields": [
                "ETA_NUM_EPMSI",
                "RIP_NUM"
            ],
            "reference": {
                "resource": "T_RIPaaFB",
                "fields": [
                    "ETA_NUM_EPMSI",
                    "RIP_NUM"
                ]
            }
        },
        {
            "fields": [
                "IPP_IRR_CRY"
            ],
            "reference": {
                "resource": "T_RIPaaR3A",
                "fields": [
                    "IPP_IRR_CRY"
                ]
            }
        },
        {
            "fields": [
                "ENT_MOD"
            ],
            "reference": {
                "resource": "MS_SOR_V",
                "fields": [
                    "SOR_MOD_COD"
                ]
            },
            "description": "Nomenclature"
        },
        {
            "fields": [
                "ENT_PRV"
            ],
            "reference": {
                "resource": "MS_PRV_V",
                "fields": [
                    "PRV_COD"
                ]
            },
            "description": "Nomenclature"
        },
        {
            "fields": [
                "SOR_MOD"
            ],
            "reference": {
                "resource": "MS_SOR_V",
                "fields": [
                    "SOR_MOD_COD"
                ]
            },
            "description": "Nomenclature"
        },
        {
            "fields": [
                "SOR_DES"
            ],
            "reference": {
                "resource": "MS_PRV_V",
                "fields": [
                    "PRV_COD"
                ]
            },
            "description": "Nomenclature"
        },
        {
            "fields": [
                "DGN_PAL"
            ],
            "reference": {
                "resource": "MS_CIM_V",
                "fields": [
                    "CIM_COD"
                ]
            },
            "description": "Nomenclature"
        }
    ],
    "history": {
        "dateCreated": "2007",
        "dateDeleted": "",
        "dateMissing": []
    },
    "champ": "Public et Privé",
    "observation": ""
}