{
    "fields": [
        {
            "name": "ETA_NUM",
            "description": "N° FINESS",
            "type": "string",
            "nomenclature": "FINESS:ej_finess",
            "length": "9",
            "format": "default",
            "dateCreated": "2005",
            "dateDeleted": "",
            "dateMissing": [],
            "observation": "",
            "regle_gestion": "",
            "type_oracle": "string",
            "constraints": {
                "maxLength": 9
            }
        },
        {
            "name": "MOI_LUN_1S",
            "description": "Mois du lundi de la première semaine du séjour dans l'année (SSR)",
            "type": "date",
            "nomenclature": "-",
            "length": "2",
            "format": "%m",
            "dateCreated": "2009",
            "dateDeleted": "",
            "dateMissing": [],
            "observation": "",
            "regle_gestion": "",
            "type_oracle": "string"
        },
        {
            "name": "ANN_LUN_1S",
            "description": "Année du lundi de la première semaine du séjour dans l'année (SSR)",
            "type": "year",
            "nomenclature": "-",
            "length": "4",
            "format": "default",
            "dateCreated": "2009",
            "dateDeleted": "",
            "dateMissing": [],
            "observation": "",
            "regle_gestion": "",
            "type_oracle": "string"
        },
        {
            "name": "NIR_RET",
            "description": "Code retour contrôle \" n° sécurité sociale \"",
            "type": "boolean",
            "nomenclature": "-",
            "length": "1",
            "format": "default",
            "dateCreated": "2005",
            "dateDeleted": "",
            "dateMissing": [],
            "observation": "",
            "regle_gestion": "",
            "type_oracle": "string"
        },
        {
            "name": "NAI_RET",
            "description": "Code retour contrôle \" date de naissance \"",
            "type": "boolean",
            "nomenclature": "-",
            "length": "1",
            "format": "default",
            "dateCreated": "2005",
            "dateDeleted": "",
            "dateMissing": [],
            "observation": "",
            "regle_gestion": "",
            "type_oracle": "string"
        },
        {
            "name": "SEX_RET",
            "description": "Code retour contrôle \" sexe \"",
            "type": "boolean",
            "nomenclature": "-",
            "length": "1",
            "format": "default",
            "dateCreated": "2005",
            "dateDeleted": "",
            "dateMissing": [],
            "observation": "",
            "regle_gestion": "",
            "type_oracle": "string"
        },
        {
            "name": "SEJ_RET",
            "description": "Code retour contrôle \" n° d’identification administratif de séjour \"",
            "type": "boolean",
            "nomenclature": "-",
            "length": "1",
            "format": "default",
            "dateCreated": "2005",
            "dateDeleted": "",
            "dateMissing": [],
            "observation": "",
            "regle_gestion": "",
            "type_oracle": "string"
        },
        {
            "name": "FHO_RET",
            "description": "Code retour \"fusion ANO_HOSP et HOSP-PMSI\"",
            "type": "boolean",
            "nomenclature": "-",
            "length": "1",
            "format": "default",
            "dateCreated": "2005",
            "dateDeleted": "",
            "dateMissing": [],
            "observation": "",
            "regle_gestion": "",
            "type_oracle": "string"
        },
        {
            "name": "PMS_RET",
            "description": "Code retour \"fusion ANO-PMSI et fichier PMSI \"",
            "type": "boolean",
            "nomenclature": "-",
            "length": "1",
            "format": "default",
            "dateCreated": "2005",
            "dateDeleted": "",
            "dateMissing": [],
            "observation": "",
            "regle_gestion": "",
            "type_oracle": "string"
        },
        {
            "name": "DAT_RET",
            "description": "Code retour contrôle « date de référence» (date d’entrée)",
            "type": "boolean",
            "nomenclature": "-",
            "length": "1",
            "format": "default",
            "dateCreated": "2006",
            "dateDeleted": "",
            "dateMissing": [],
            "observation": "",
            "regle_gestion": "",
            "type_oracle": "string"
        },
        {
            "name": "COH_NAI_RET",
            "description": "Code retour contrôle « Cohérence date naissance »",
            "type": "boolean",
            "nomenclature": "-",
            "length": "1",
            "format": "default",
            "dateCreated": "2013",
            "dateDeleted": "",
            "dateMissing": [],
            "observation": "",
            "regle_gestion": "",
            "type_oracle": "string"
        },
        {
            "name": "COH_SEX_RET",
            "description": "Code retour contrôle « Cohérence sexe »",
            "type": "boolean",
            "nomenclature": "-",
            "length": "1",
            "format": "default",
            "dateCreated": "2013",
            "dateDeleted": "",
            "dateMissing": [],
            "observation": "",
            "regle_gestion": "",
            "type_oracle": "string"
        },
        {
            "name": "NIR_ANO_17",
            "description": "N° anonyme",
            "type": "string",
            "nomenclature": "-",
            "length": "17",
            "format": "default",
            "dateCreated": "2005",
            "dateDeleted": "",
            "dateMissing": [],
            "observation": "",
            "regle_gestion": "",
            "type_oracle": "string",
            "constraints": {
                "maxLength": 17
            }
        },
        {
            "name": "SEJ_NUM",
            "description": "N° de séjour",
            "type": "string",
            "nomenclature": "-",
            "length": "5",
            "format": "default",
            "dateCreated": "2005",
            "dateDeleted": "",
            "dateMissing": [],
            "observation": "",
            "regle_gestion": "",
            "type_oracle": "string",
            "constraints": {
                "maxLength": 5
            }
        },
        {
            "name": "RHA_NUM",
            "description": "N° Séquentiel du séjour",
            "type": "string",
            "nomenclature": "-",
            "length": "7",
            "format": "default",
            "dateCreated": "2005",
            "dateDeleted": "",
            "dateMissing": [],
            "observation": "",
            "regle_gestion": "",
            "type_oracle": "string",
            "constraints": {
                "maxLength": 7
            }
        },
        {
            "name": "ENT_DAT",
            "description": "Date d'entrée",
            "type": "date",
            "nomenclature": "-",
            "length": "8",
            "format": "%d%m%Y",
            "dateCreated": "2009",
            "dateDeleted": "",
            "dateMissing": [],
            "observation": "",
            "regle_gestion": "",
            "type_oracle": "string"
        },
        {
            "name": "SOR_DAT",
            "description": "Date de sortie",
            "type": "date",
            "nomenclature": "-",
            "length": "8",
            "format": "%d%m%Y",
            "dateCreated": "2009",
            "dateDeleted": "",
            "dateMissing": [],
            "observation": "",
            "regle_gestion": "",
            "type_oracle": "string"
        },
        {
            "name": "EXE_SOI_AMD",
            "description": "Date d'entrée au format année + mois",
            "type": "yearmonth",
            "nomenclature": "-",
            "length": "6",
            "format": "default",
            "dateCreated": "2009",
            "dateDeleted": "",
            "dateMissing": [],
            "observation": "",
            "regle_gestion": "",
            "type_oracle": "string"
        },
        {
            "name": "EXE_SOI_AMF",
            "description": "Date de sortie au format année + mois",
            "type": "string",
            "nomenclature": "-",
            "length": "6",
            "format": "default",
            "dateCreated": "2009",
            "dateDeleted": "",
            "dateMissing": [],
            "observation": "",
            "regle_gestion": "",
            "type_oracle": "string",
            "constraints": {
                "maxLength": 6
            }
        },
        {
            "name": "EXE_SOI_DTD",
            "description": "date d'entrée",
            "type": "date",
            "nomenclature": "-",
            "length": null,
            "format": "default",
            "dateCreated": "2009",
            "dateDeleted": "",
            "dateMissing": [],
            "observation": "",
            "regle_gestion": "",
            "type_oracle": "date"
        },
        {
            "name": "EXE_SOI_DTF",
            "description": "date de sortie",
            "type": "date",
            "nomenclature": "-",
            "length": null,
            "format": "default",
            "dateCreated": "2009",
            "dateDeleted": "",
            "dateMissing": [],
            "observation": "",
            "regle_gestion": "",
            "type_oracle": "date"
        },
        {
            "name": "NUM_DAT_AT_RET",
            "description": "Code retour contrôle \" Numéro accident du travail ou date d’accident de droit commun\"",
            "type": "boolean",
            "nomenclature": "-",
            "length": "1",
            "format": "default",
            "dateCreated": "2015",
            "dateDeleted": "",
            "dateMissing": [],
            "observation": "",
            "regle_gestion": "",
            "type_oracle": "string"
        },
        {
            "name": "ORG_CPL_NUM_RET",
            "description": "Code retour contrôle \" N° d’organisme complémentaire\"",
            "type": "boolean",
            "nomenclature": "-",
            "length": "1",
            "format": "default",
            "dateCreated": "2015",
            "dateDeleted": "",
            "dateMissing": [],
            "observation": "",
            "regle_gestion": "",
            "type_oracle": "string"
        },
        {
            "name": "NUM_DAT_AT",
            "description": "Numéro accident du travail ou date d’accident de droit commun",
            "type": "string",
            "nomenclature": "-",
            "length": "9",
            "format": "default",
            "dateCreated": "2015",
            "dateDeleted": "",
            "dateMissing": [],
            "observation": "",
            "regle_gestion": "",
            "type_oracle": "string",
            "constraints": {
                "maxLength": 9
            }
        },
        {
            "name": "ORG_CPL_NUM",
            "description": "N° d’organisme complémentaire",
            "type": "string",
            "nomenclature": "-",
            "length": "10",
            "format": "default",
            "dateCreated": "2015",
            "dateDeleted": "",
            "dateMissing": [],
            "observation": "",
            "regle_gestion": "",
            "type_oracle": "string",
            "constraints": {
                "maxLength": 10
            }
        },
        {
            "name": "ETA_NUM_RET",
            "description": "Code retour contrôle «N° FINESS d’inscription e-PMSI«",
            "type": "boolean",
            "nomenclature": "-",
            "length": "1",
            "format": "default",
            "dateCreated": "2017",
            "dateDeleted": "2017",
            "dateMissing": [],
            "observation": "",
            "regle_gestion": "",
            "type_oracle": "string"
        },
        {
            "name": "ENT_AM",
            "description": "Date d'entrée au format année + mois",
            "type": "date",
            "length": "6",
            "dateCreated": "2009",
            "dateDeleted": "2011",
            "nomenclature": "-",
            "dateMissing": [],
            "format": "default",
            "observation": "",
            "regle_gestion": "",
            "type_oracle": "date"
        },
        {
            "name": "SOR_MOI",
            "description": "Mois de sortie",
            "type": "date",
            "length": "2",
            "dateCreated": "2005",
            "dateDeleted": "2009",
            "nomenclature": "-",
            "dateMissing": [],
            "format": "%m",
            "observation": "",
            "regle_gestion": "",
            "type_oracle": "string"
        },
        {
            "name": "SOR_AM",
            "description": "Date de sortie au format année + mois",
            "type": "date",
            "length": "6",
            "dateCreated": "2009",
            "dateDeleted": "2011",
            "nomenclature": "-",
            "dateMissing": [],
            "format": "default",
            "observation": "",
            "regle_gestion": "",
            "type_oracle": "date"
        },
        {
            "name": "SOR_ANN",
            "description": "Année de sortie",
            "type": "year",
            "length": "4",
            "dateCreated": "2005",
            "dateDeleted": "2009",
            "nomenclature": "-",
            "dateMissing": [],
            "format": "default",
            "observation": "",
            "regle_gestion": "",
            "type_oracle": "string"
        }
    ],
    "name": "T_SSRaaC",
    "title": "NIR patient et Dates de soin",
    "produit": "PMSI SSR",
    "missingValues": [
        ""
    ],
    "primaryKey": [
        "ETA_NUM",
        "RHA_NUM"
    ],
    "foreignKeys": [
        {
            "fields": [
                "ETA_NUM",
                "RHA_NUM"
            ],
            "reference": {
                "resource": "T_SSRaaB",
                "fields": [
                    "ETA_NUM",
                    "RHA_NUM"
                ]
            },
            "description": "Bidirectionnel"
        },
        {
            "fields": "NIR_ANO_17",
            "reference": {
                "resource": "IR_BEN_R",
                "fields": "BEN_NIR_PSA"
            }
        }
    ],
    "history": {
        "dateCreated": "2005",
        "dateDeleted": "",
        "dateMissing": []
    },
    "champ": "Public et Privé",
    "observation": ""
}