{
    "fields": [
        {
            "name": "ETA_NUM_EPMSI",
            "description": "N° FINESS e-PMSI",
            "type": "string",
            "nomenclature": "FINESS:ej_finess",
            "length": "9",
            "format": "default",
            "dateCreated": "2007",
            "dateDeleted": "",
            "dateMissing": [],
            "observation": "",
            "regle_gestion": "",
            "type_oracle": "string",
            "constraints": {
                "maxLength": 9
            }
        },
        {
            "name": "ETA_NUM_TWO",
            "description": "Second n° FINESS",
            "type": "string",
            "nomenclature": "FINESS:et_finess",
            "length": "9",
            "format": "default",
            "dateCreated": "2007",
            "dateDeleted": "",
            "dateMissing": [],
            "observation": "",
            "regle_gestion": "",
            "type_oracle": "string",
            "constraints": {
                "maxLength": 9
            }
        },
        {
            "name": "SEJ_IDT",
            "description": "Identifiant de séjour",
            "type": "string",
            "nomenclature": "-",
            "length": "5",
            "format": "default",
            "dateCreated": "2011",
            "dateDeleted": "",
            "dateMissing": [],
            "observation": "",
            "regle_gestion": "",
            "type_oracle": "string",
            "constraints": {
                "maxLength": 5
            }
        },
        {
            "name": "IPP_IRR_CRY",
            "description": "Cryptage irreversible de l'IPP",
            "type": "string",
            "nomenclature": "-",
            "length": "16",
            "format": "default",
            "dateCreated": "2007",
            "dateDeleted": "",
            "dateMissing": [],
            "observation": "",
            "regle_gestion": "",
            "type_oracle": "string",
            "constraints": {
                "maxLength": 16
            }
        },
        {
            "name": "ORD_NUM",
            "description": "N° d'ordre",
            "type": "string",
            "nomenclature": "-",
            "length": "8",
            "format": "default",
            "dateCreated": "2007",
            "dateDeleted": "",
            "dateMissing": [],
            "observation": "",
            "regle_gestion": "",
            "type_oracle": "string",
            "constraints": {
                "maxLength": 8
            }
        },
        {
            "name": "ASS_DGN",
            "description": "Diagnostics et facteurs associés",
            "type": "string",
            "nomenclature": "MS_CIM_V",
            "length": "6",
            "format": "default",
            "dateCreated": "2007",
            "dateDeleted": "",
            "dateMissing": [],
            "observation": "",
            "regle_gestion": "",
            "type_oracle": "string",
            "constraints": {
                "maxLength": 6
            }
        }
    ],
    "name": "T_RIPaaR3AD",
    "title": "Diagnostic associé à l'acte",
    "produit": "PMSI RIM-P",
    "missingValues": [
        ""
    ],
    "primaryKey": [
        "ETA_NUM_EPMSI",
        "ORD_NUM",
        "SEJ_IDT"
    ],
    "foreignKeys": [
        {
            "fields": [
                "ETA_NUM_EPMSI",
                "ORD_NUM",
                "SEJ_IDT"
            ],
            "reference": {
                "resource": "T_RIPaaR3A",
                "fields": [
                    "ETA_NUM_EPMSI",
                    "ORD_NUM",
                    "SEJ_IDT"
                ]
            }
        },
        {
            "fields": [
                "ASS_DGN"
            ],
            "reference": {
                "resource": "MS_CIM_V",
                "fields": [
                    "CIM_COD"
                ]
            },
            "description": "Nomenclature"
        }
    ],
    "history": {
        "dateCreated": "2007",
        "dateDeleted": "",
        "dateMissing": []
    },
    "champ": "Public (et qq privé)",
    "observation": "Certaines lignes concernent des établissements privés"
}