{
    "fields": [
        {
            "name": "BEN_NIR_PSA",
            "description": "Identifiant anonyme du patient dans le SNIIRAM",
            "type": "string",
            "nomenclature": "-",
            "length": "17",
            "format": "default",
            "constraints": {
                "minLength": 17,
                "unique": true,
                "description": "Unicité fausse sans le rang gémellaire. Contrainte nécessaire pour les clés étrangère du PMSI, qui n'a pas le rang gémellaire",
                "maxLength": 17
            },
            "dateCreated": "",
            "dateDeleted": "",
            "dateMissing": [],
            "observation": "",
            "regle_gestion": "",
            "type_oracle": "string"
        },
        {
            "name": "BEN_RNG_GEM",
            "description": "rang de naissance du bénéficiaire",
            "type": "integer",
            "nomenclature": "IR_BER_V:BEN_RNG_GEM",
            "length": "2",
            "format": "default",
            "dateCreated": "",
            "dateDeleted": "",
            "dateMissing": [],
            "observation": "",
            "regle_gestion": "La règle de calcul du rang du bénéficiaire dans le SNIIRAM est la suivante :\n- le rang de louvreur de droits est toujours égal à 1,\n- si un ayant droit a la même date de naissance que louvreur de droits, son rang est égal à 2,\n- un enfant né dune naissance unique a un rang égal à 1,\n- lorsquil y a des naissances multiples, chaque enfant est différencié par son rang (1 pour le 1er, 2 pour le second,).",
            "type_oracle": "number",
            "constraints": {
                "minimum": 0,
                "maximum": 99
            }
        },
        {
            "name": "BEN_NIR_ANO",
            "description": "NIR pseudonymisé du bénéficiaire",
            "type": "string",
            "nomenclature": "-",
            "length": "17",
            "format": "default",
            "constraints": {
                "minLength": 17,
                "maxLength": 17
            },
            "dateCreated": "",
            "dateDeleted": "",
            "dateMissing": [],
            "observation": "",
            "regle_gestion": "",
            "type_oracle": "string"
        },
        {
            "name": "BEN_IDT_ANO",
            "description": "Identifiant bénéficiaire anonymisé",
            "type": "string",
            "nomenclature": "-",
            "length": "17",
            "format": "default",
            "constraints": {
                "unique": true,
                "minLength": 17,
                "maxLength": 17
            },
            "dateCreated": "",
            "dateDeleted": "",
            "dateMissing": [],
            "observation": "",
            "regle_gestion": "",
            "type_oracle": "string"
        },
        {
            "name": "BEN_IDT_TOP",
            "description": "Top identifiant bénéficiaire Anonymisé",
            "type": "boolean",
            "nomenclature": "-",
            "length": "1",
            "format": "default",
            "dateCreated": "",
            "dateDeleted": "",
            "dateMissing": [],
            "observation": "",
            "regle_gestion": "",
            "type_oracle": "number"
        },
        {
            "name": "ASS_NIR_ANO",
            "description": "Matricule anonymisé de l'ouvreur de droits",
            "type": "string",
            "nomenclature": "-",
            "length": "17",
            "format": "default",
            "constraints": {
                "minLength": 17,
                "maxLength": 17
            },
            "dateCreated": "",
            "dateDeleted": "",
            "dateMissing": [],
            "observation": "",
            "regle_gestion": "",
            "type_oracle": "string"
        },
        {
            "name": "BEN_IDT_MAJ",
            "description": "Date d'alimentation du NIR BEN_NIR_NAO",
            "type": "date",
            "nomenclature": "-",
            "length": null,
            "format": "default",
            "dateCreated": "",
            "dateDeleted": "",
            "dateMissing": [],
            "observation": "",
            "regle_gestion": "",
            "type_oracle": "date"
        },
        {
            "name": "BEN_CDI_NIR",
            "description": "Code d'identification du NIR",
            "type": "string",
            "nomenclature": "IR_NIR_V:BEN_NIR_COD",
            "length": "2",
            "format": "default",
            "dateCreated": "",
            "dateDeleted": "",
            "dateMissing": [],
            "observation": "",
            "regle_gestion": "",
            "type_oracle": "string",
            "constraints": {
                "maxLength": 2
            }
        },
        {
            "name": "BEN_NAI_ANN",
            "description": "Année de naissance du bénéficiaire",
            "type": "year",
            "nomenclature": "-",
            "length": "4",
            "format": "default",
            "dateCreated": "",
            "dateDeleted": "",
            "dateMissing": [],
            "observation": "",
            "regle_gestion": "",
            "type_oracle": "string"
        },
        {
            "name": "BEN_NAI_MOI",
            "description": "Mois de naissance du bénéficiaire",
            "type": "date",
            "nomenclature": "-",
            "length": "2",
            "format": "%m",
            "dateCreated": "",
            "dateDeleted": "",
            "dateMissing": [],
            "observation": "",
            "regle_gestion": "",
            "type_oracle": "string"
        },
        {
            "name": "BEN_SEX_COD",
            "description": "Code sexe du bénéficiaire",
            "type": "integer",
            "nomenclature": "IR_SEX_V:SEX_COD",
            "length": "1",
            "format": "default",
            "dateCreated": "",
            "dateDeleted": "",
            "dateMissing": [],
            "observation": "",
            "regle_gestion": "",
            "type_oracle": "number",
            "constraints": {
                "minimum": 0,
                "maximum": 9
            }
        },
        {
            "name": "BEN_DCD_DTE",
            "description": "Date de décès du bénéficiaire",
            "type": "date",
            "nomenclature": "IR_DTE_V:DTE_DTE",
            "length": "8",
            "format": "default",
            "dateCreated": "",
            "dateDeleted": "",
            "dateMissing": [],
            "observation": "",
            "regle_gestion": "",
            "type_oracle": "date"
        },
        {
            "name": "BEN_DCD_AME",
            "description": "Année et mois de décès du bénéficiaire",
            "type": "yearmonth",
            "nomenclature": "-",
            "length": "6",
            "format": "default",
            "dateCreated": "",
            "dateDeleted": "",
            "dateMissing": [],
            "observation": "",
            "regle_gestion": "",
            "type_oracle": "string"
        },
        {
            "name": "ORG_AFF_BEN",
            "description": "Code de l'organisme d'affiliation",
            "type": "string",
            "nomenclature": "IR_ORG_V:ORG_NUM",
            "length": "9",
            "format": "default",
            "dateCreated": "",
            "dateDeleted": "",
            "dateMissing": [],
            "observation": "",
            "regle_gestion": "",
            "type_oracle": "string",
            "constraints": {
                "maxLength": 9
            }
        },
        {
            "name": "BEN_RES_DPT",
            "description": "Département de résidence du bénéficiaire",
            "type": "string",
            "nomenclature": "IR_GEO_V:GEO_DPT_COD",
            "length": "3",
            "format": "default",
            "dateCreated": "",
            "dateDeleted": "",
            "dateMissing": [],
            "observation": "",
            "regle_gestion": "",
            "type_oracle": "string",
            "constraints": {
                "maxLength": 3
            }
        },
        {
            "name": "BEN_RES_COM",
            "description": "commune de résidence du destinataire du règlement",
            "type": "string",
            "nomenclature": "IR_GEO_V:GEO_COM_COD",
            "length": "3",
            "format": "default",
            "dateCreated": "",
            "dateDeleted": "",
            "dateMissing": [],
            "observation": "",
            "regle_gestion": "",
            "type_oracle": "string",
            "constraints": {
                "maxLength": 3
            }
        },
        {
            "name": "BEN_TOP_CNS",
            "description": "top consommant - non consommant",
            "type": "boolean",
            "nomenclature": "-",
            "length": "1",
            "format": "default",
            "dateCreated": "",
            "dateDeleted": "",
            "dateMissing": [],
            "observation": "",
            "regle_gestion": "",
            "type_oracle": "number"
        },
        {
            "name": "MAX_TRT_DTD",
            "description": "Date maximale de traitement d'une Prestations",
            "type": "date",
            "nomenclature": "-",
            "length": null,
            "format": "default",
            "dateCreated": "",
            "dateDeleted": "",
            "dateMissing": [],
            "observation": "",
            "regle_gestion": "",
            "type_oracle": "date"
        },
        {
            "name": "ORG_CLE_NEW",
            "description": "Code de l'organisme de liquidation",
            "type": "string",
            "nomenclature": "IR_ORG_V:ORG_NUM",
            "length": "9",
            "format": "default",
            "dateCreated": "",
            "dateDeleted": "",
            "dateMissing": [],
            "observation": "",
            "regle_gestion": "",
            "type_oracle": "string",
            "constraints": {
                "maxLength": 9
            }
        },
        {
            "name": "BEN_DTE_INS",
            "description": "Date d'insertion dans le référentiel",
            "type": "date",
            "nomenclature": "IR_DTE_V:DTE_DTE",
            "length": "8",
            "format": "default",
            "dateCreated": "",
            "dateDeleted": "",
            "dateMissing": [],
            "observation": "",
            "regle_gestion": "",
            "type_oracle": "date"
        },
        {
            "name": "BEN_DTE_MAJ",
            "description": "Date de mise à jour",
            "type": "date",
            "nomenclature": "IR_DTE_V:DTE_DTE",
            "length": "8",
            "format": "default",
            "dateCreated": "",
            "dateDeleted": "",
            "dateMissing": [],
            "observation": "",
            "regle_gestion": "",
            "type_oracle": "date"
        }
    ],
    "name": "IR_BEN_R",
    "title": "Référentiel des bénéficiaires du SNIIRAM-SNDS",
    "produit": "BENEFICIAIRE",
    "missingValues": [
        ""
    ],
    "primaryKey": [
        "BEN_NIR_PSA",
        "BEN_RNG_GEM"
    ],
    "history": {
        "dateCreated": "",
        "dateDeleted": "",
        "dateMissing": []
    },
    "champ": "",
    "observation": "",
    "foreignKeys": [
        {
            "fields": [
                "BEN_RNG_GEM"
            ],
            "reference": {
                "resource": "IR_BER_V",
                "fields": [
                    "BEN_RNG_GEM"
                ]
            },
            "description": "Nomenclature"
        },
        {
            "fields": [
                "BEN_CDI_NIR"
            ],
            "reference": {
                "resource": "IR_NIR_V",
                "fields": [
                    "BEN_NIR_COD"
                ]
            },
            "description": "Nomenclature"
        },
        {
            "fields": [
                "BEN_SEX_COD"
            ],
            "reference": {
                "resource": "IR_SEX_V",
                "fields": [
                    "SEX_COD"
                ]
            },
            "description": "Nomenclature"
        },
        {
            "fields": [
                "ORG_AFF_BEN"
            ],
            "reference": {
                "resource": "IR_ORG_V",
                "fields": [
                    "ORG_NUM"
                ]
            },
            "description": "Nomenclature"
        },
        {
            "fields": [
                "BEN_RES_DPT"
            ],
            "reference": {
                "resource": "IR_DPT_V",
                "fields": [
                    "GEO_DPT_COD"
                ]
            },
            "description": "Nomenclature"
        },
        {
            "fields": [
                "BEN_RES_COM"
            ],
            "reference": {
                "resource": "IR_GEO_V",
                "fields": [
                    "GEO_COM_COD"
                ]
            },
            "description": "Nomenclature"
        },
        {
            "fields": [
                "ORG_CLE_NEW"
            ],
            "reference": {
                "resource": "IR_ORG_V",
                "fields": [
                    "ORG_NUM"
                ]
            },
            "description": "Nomenclature"
        }
    ]
}
