{
    "name": "T_HADaaGJ",
    "title": "Table de passage de Finess",
    "produit": "PMSI HAD",
    "history": {
        "dateCreated": "2006",
        "dateDeleted": "2007",
        "dateMissing": []
    },
    "missingValues": [
        ""
    ],
    "fields": [
        {
            "name": "ETA_NUM_GEO",
            "description": "N° FINESS de l’entité juridique",
            "type": "string",
            "length": "9",
            "dateCreated": "2006",
            "dateDeleted": "2007",
            "nomenclature": "FINESS:et_finess",
            "dateMissing": [],
            "format": "default",
            "observation": "",
            "regle_gestion": "",
            "type_oracle": "string",
            "constraints": {
                "maxLength": 9
            }
        },
        {
            "name": "ETA_NUM_EPMSI",
            "description": "N° FINESS e-PMSI",
            "type": "string",
            "length": null,
            "dateCreated": "2006",
            "dateDeleted": "2007",
            "nomenclature": "FINESS:ej_finess",
            "dateMissing": [],
            "format": "default",
            "observation": "",
            "regle_gestion": "",
            "type_oracle": "string"
        },
        {
            "name": "ETA_NUM_JUR",
            "description": "N° FINESS de l’établissement (code géographique)",
            "type": "string",
            "length": null,
            "dateCreated": "2006",
            "dateDeleted": "2007",
            "nomenclature": "FINESS:ej_finess",
            "dateMissing": [],
            "format": "default",
            "observation": "",
            "regle_gestion": "",
            "type_oracle": "string"
        }
    ],
    "foreignKeys": [
        {
            "fields": "ETA_NUM_EPMSI",
            "reference": {
                "resource": "T_HADaaE",
                "fields": "ETA_NUM"
            }
        }
    ],
    "champ": "Privé",
    "observation": ""
}