Var,Factor_2012,Factor_13,Factor_14,Factor_15,Factor_16,Factor_17,Factor_18,Factor_19,Factor_20,Factor_21,Factor_Total
DGN_COD/I10,0.0,0.0,0.14393503596583904,0.0,0.17243076564869908,0.96,0.17670408569290905,0.0,0.0,0.0,1.453069887307447
DGN_COD/D509,0.576081027589009,0.0,0.0,0.0,0.8131575808135001,0.0,0.0,0.0,0.0,0.0,1.389238608402509
DGN_COD/Z7580,0.8432640522597457,0.0,0.0,0.0,0.0,0.0,0.0,0.1227208595021965,0.0,0.0,0.9659849117619421
DGN_COD/Z741,0.0,0.0,0.0,0.0,0.0,0.0,0.0,0.7778842735105411,0.0,0.18321968306885722,0.9611039565793984
DGN_COD/E6603,,0.0,0.0,0.0,0.0,0.0,0.3383703159455962,0.0,0.61096268570315,0.0,0.9493330016487462
DGN_COD/B181,0.0,0.0,0.02999945979068681,9.019837793795935e-05,0.0,0.0,0.4648502536089158,0.0,0.38799636547586497,0.0,0.8829362772534055
DGN_COD/G20,,0.0,0.2240912453633933,0.0,0.0,0.0,0.0,0.6271832041404372,0.0,0.0,0.8512744495038305
DGN_COD/E039,0.8273014611854212,0.0,0.0,0.0,0.0,0.0,0.0,0.0,0.0,0.0,0.8273014611854212
DGN_COD/N185,0.0,0.0,0.0,0.0,0.8105766006273518,0.0,0.0,0.0,0.0,0.0,0.8105766006273518
DGN_COD/Z967,0.0,0.0,0.0,0.0,0.0,0.0,0.0,0.0,0.0,0.742866882507836,0.742866882507836
DGN_COD/G473,0.01603186983057736,0.7151418945059468,0.0,0.0,0.0,0.0,0.0,0.0,0.0,0.0,0.7311737643365241
DGN_COD/S3210,,0.0,,0.7279776704989636,,,0.0,,,,0.7279776704989636
DGN_COD/F412,0.0,0.0,0.0,0.014775114742557357,0.7007759694089178,0.0,0.0,0.0,0.0,0.0,0.7155510841514752
DGN_COD/C443,,,0.0,0.6799791133553672,,,,,,0.0,0.6799791133553672
DGN_COD/Z6020,,,,0.0,0.0,0.0,0.6484612744506163,0.0,0.015633746881609355,0.0,0.6640950213322256
DGN_COD/F17202,0.0,0.0,0.0,0.0,0.0,0.0,0.0,0.0,,0.6528632007848681,0.6528632007848681
DGN_COD/I872,0.0,0.0,0.0,0.0,0.0,0.0,0.6451012494077096,0.0,0.0,,0.6451012494077096
DGN_COD/B169,0.0,0.0,0.4199923554764857,,0.0,0.0,0.0,0.0,0.0,0.22059658808614713,0.6405889435626329
DGN_COD/E038,0.6287910927067639,0.0,0.0,0.0,0.0,0.0,0.0,0.0,0.0,0.0,0.6287910927067639
DGN_COD/Z565,,,,0.0,,,,0.0,0.6109868905584,0.0,0.6109868905584
DGN_COD/Z955,0.0,0.6052900801572557,0.0,0.0,0.0,0.0,0.0,0.0,0.0,0.0,0.6052900801572557
DGN_COD/E780,0.0,0.00028231776582658425,0.0,0.5765807964418762,0.0,0.0,0.0,0.0,0.0,0.0,0.5768631142077028
DGN_COD/C220,0.0,0.0,0.0,0.30923655559941826,0.0,0.0,0.0,0.2363371660388077,0.0,0.0,0.5455737216382259
DGN_COD/I802,,0.5338619370485854,,0.0,0.0,0.0,0.0,0.0,0.0,,0.5338619370485854
DGN_COD/D291,,,,,0.0,0.0,0.0,0.0,,0.5244361597888241,0.5244361597888241
DGN_COD/G9788,,,,,,,,,,0.5240855712935493,0.5240855712935493
DGN_COD/E1198,0.0,0.431455294515054,0.03196550898586153,0.0,0.0,0.0,0.0,0.0,0.03736297409447565,0.0,0.5007837775953912
DGN_COD/F1021,0.17564569346750517,0.0,0.3100079946866237,0.0,0.0,0.0,0.0,0.0,0.0,0.0,0.4856536881541289
DGN_COD/Z480,0.0,0.09059103179683586,0.32607411604062575,0.0,0.06876043634041258,0.0,0.0,0.0,0.0,0.0,0.4854255841778742
DGN_COD/E6695,,,,,,,0.0,,0.0,0.4712101858965105,0.4712101858965105
