Var,Factor_2012,Factor_13,Factor_14,Factor_15,Factor_16,Factor_17,Factor_18,Factor_19,Factor_20,Factor_21,Factor_Total
FP_PEC/Z500,0.3306293697812972,0.09169910016263921,0.0,0.2671544376183599,0.0,0.0,0.46325108847390933,0.04663120846111315,0.22958332998033604,0.0,1.428948534477655
FP_PEC/Z501,0.4084434889870019,0.44496633875485014,0.08118375101523198,0.13282150492164174,0.01859418638633598,0.014989334951321211,0.0,0.030003365549410063,0.0,0.04016368409204487,1.171165654657838
FP_PEC/Z508,0.1649500350130823,0.0,0.0,0.0,0.9217333894272005,0.0,0.07945710172188679,0.0,0.0,0.0,1.1661405261621696
FP_PEC/Z5188,0.0,0.0,0.0,0.0,0.0,0.0,0.0,0.0,0.39873485096941835,0.7237332897696861,1.1224681407391044
FP_PEC/Z502,0.021859699871644916,0.0,0.054937692801999664,0.0,0.0,0.8247523188200111,0.1689079231230198,0.0,0.0,0.01814205722541256,1.088599691842088
MOR_PRP/R18,0.0,0.0,0.0,0.0,0.0,0.8247542093700476,0.2023270845962885,,0.0,0.0,1.027081293966336
MOR_PRP/Z951,0.0,0.0,0.08542794191400513,0.0,0.0,0.0,0.18058341760648738,0.7193645751747902,0.0,0.0,0.9853759346952827
MOR_PRP/G258,,,,,0.0,0.5302179532327858,0.4201000483019002,0.0,,,0.9503180015346859
FP_PEC/ZAIGU,0.7187626081188548,0.0,0.19009221587091932,0.0,0.0,0.0,0.0,,,,0.9088548239897741
MOR_PRP/R418,0.17867839353434797,0.5633148058338657,0.1027686496864333,0.0,0.0,0.0,0.0,0.0,,0.0,0.844761849054647
MOR_PRP/Z966,0.14312047063248048,0.0,0.2765017090139286,0.0,0.0,0.0,0.0,0.0,0.0,0.42339346146675894,0.8430156411131681
ETL_AFF/I693,,,,0.5474731748162314,0.0,0.0,0.0,0.0,0.2954141942788106,,0.842887369095042
ETL_AFF/S460,0.0,0.0,0.0,0.0,0.0,0.0,0.0,0.03359569096953713,,0.8039016520442824,0.8374973430138195
MOR_PRP/Z988,0.0,0.05494056392111785,0.0035135815720610183,0.0,0.0,0.0,0.0,0.7624035661781863,0.0,0.0,0.8208577116713651
ETL_AFF/M171,0.2484138691202025,0.0,0.0,0.5602946761794206,0.0,0.0,0.0,0.0,0.0,0.0,0.8087085452996231
MOR_PRP/G811,0.0,0.47201504193539523,0.0,0.0,0.0,0.0,0.30054999052346304,0.0,0.015011416496785227,0.0,0.7875764489556435
MOR_PRP/G801,,,,,,0.7697383468675854,,,,,0.7697383468675854
MOR_PRP/F412,0.0,0.0,0.0,0.0,0.0,0.0,,0.7659956247333872,0.0,0.0,0.7659956247333872
FP_PEC/Z480,0.0,0.0,0.0,0.3337368040161701,0.4145454545454545,0.0,0.0,0.0,0.0,0.0,0.7482822585616247
MOR_PRP/U0710,,,,,,,,,0.0,0.6399999675448826,0.6399999675448826
MOR_PRP/M5465,,,,,0.0,,,,0.6324728958721637,,0.6324728958721637
ETL_AFF/S860,,,0.0,0.5602946619603125,,,,,,,0.5602946619603125
MOR_PRP/F069,,,,,0.0,,0.0,,0.54849486168096,,0.54849486168096
MOR_PRP/F10200,0.5319539291189274,0.0,0.0,0.0,0.0,0.0,0.0,0.0,0.0,0.0,0.5319539291189274
ETL_AFF/T840,0.0,0.0,0.0,0.0,0.0,0.0,0.530549900975312,0.0,0.0,0.0,0.530549900975312
MOR_PRP/M750,0.0,0.0,,0.0,,0.0,0.5305478094345821,,0.0,0.0,0.5305478094345821
MOR_PRP/E43,0.0,,0.0,0.0,0.0,,0.5305445354742417,0.0,0.0,0.0,0.5305445354742417
MOR_PRP/E1198,,0.0,0.0,0.0,0.0,0.0,0.5305437452115008,,,,0.5305437452115008
FP_PEC/Z540,0.0,0.5277715689445999,0.0,0.0,0.0,0.0,0.0,0.0,,0.0,0.5277715689445999
MOR_PRP/R53+0,0.0,0.0,0.16672048998271088,0.0,0.0,0.0,0.0,,0.31036600242842266,0.0,0.47708649241113354
