Var,Factor_2012,Factor_13,Factor_14,Factor_15,Factor_16,Factor_17,Factor_18,Factor_19,Factor_20,Factor_21,Factor_Total
CCAM_ACT/EQRP001,,0.29557785499009537,0.0,0.0,0.0,0.2052949790282805,0.5012078607305326,0.09166362034877448,0.4415668259858181,0.5179298251837338,2.053240966267235
CCAM_ACT/GLQP012,0.11067522124209941,0.1491925874793628,0.0,0.0,0.2514233723281582,0.22445128232682277,0.0,0.21952117454609293,0.0,0.1107690203171845,1.0660326582397206
CCAM_ACT/ZBQK002,0.16211111452451604,0.07339996793869345,0.13098559455936848,0.2940807613707407,0.0,0.0,0.2138613242469676,0.0,0.0,0.14148901791434262,1.015927780554629
CCAM_ACT/PCLB003,0.02433319732901373,0.0,0.0,,0.1107482576060575,0.0,0.18893894216312493,0.1101599838301565,0.43611464634793173,0.12530201235250119,0.9955970396287855
CCAM_ACT/GLHF001,0.04045468749671845,0.40868205044675604,0.3369884513242349,0.08576446784432981,0.0,0.011635047706347695,0.0,0.0,0.0,0.0,0.8835247048183869
CCAM_ACT/DEQP003,0.14488353265724216,0.0,0.0,0.0,0.0,0.021753892589508366,0.31672410442173254,0.016544770925653752,0.23813764008395116,0.13127534704158378,0.8693192877196718
CCAM_ACT/LFQK001,0.2090003336566688,5.782411586589356e-17,0.31627310514666584,0.0,0.2739258793786651,0.0,0.0,0.0,0.0,0.0,0.7991993181819997
CCAM_ACT/DEQP005,0.0,0.0,0.22712692165956128,0.039221652517963654,0.5072671897960264,0.0,0.0,0.0,0.0,0.0,0.7736157639735513
CCAM_ACT/NAQK015,0.10523381069737472,0.0,0.0,0.39708157880622513,0.0,0.0,0.0,0.219520001813717,0.0,0.0,0.7218353913173169
CCAM_ACT/EJQM003,0.17440938524635136,0.0455780699372699,0.025943875323247403,0.0,0.0,0.0,0.0,0.2652974438569836,0.0,0.1582530933263187,0.669481867690171
CCAM_ACT/DKRP004,0.0,0.0622543388613924,0.0,0.0,0.18619963930050512,0.0,0.11989231860836425,0.06724110072922174,0.14203437703890387,0.0036059888709171566,0.5812277634093045
CCAM_ACT/GAQE001,,,,,0.20376078814838058,,0.0,0.0,0.3170463343611354,0.016920281587697716,0.5377274040972138
CCAM_ACT/EQRP002,0.0,0.0,0.0,0.0,0.3398521681694772,0.0,0.0,0.0,0.0,0.16165355869116496,0.5015057268606422
CCAM_ACT/DZQM006,0.0,0.0,0.04729603321013512,0.0,0.0,0.11410065668630519,0.0,0.05413475680524903,0.2780061965600831,0.0,0.4935376432617724
CCAM_ACT/NKQP003,,,,,0.0,,0.46015034851823855,,,,0.46015034851823855
CCAM_ACT/GLQP01200,,,,0.45864102008957086,,,,,,,0.45864102008957086
CCAM_ACT/EQBP001,0.13550018793187216,0.17197157185127201,0.13963076139692449,0.0,0.0,,,,0.0,,0.44710252118006866
CCAM_ACT/PCQM001,,0.0,0.40910172498646047,0.0,0.0,0.0,0.0,0.0,0.0,0.009456755649245484,0.41855848063570594
CCAM_ACT/NFQK001,0.3387096994145408,0.0,0.0,0.0,0.07796972033253653,0.0,0.0,0.0,0.0,0.0,0.41667941974707734
CCAM_ACT/GLQP002,0.12611706001331083,0.0,0.0,0.0,0.0,0.1445045017599977,0.14342725834941183,0.0,0.0,0.0,0.4140488201227204
CCAM_ACT/NFQK003,0.34396141970994876,0.0,0.05627328839427327,,0.0,0.0,0.0,0.0,0.0,0.0,0.400234708104222
CCAM_ACT/JDQM001,0.0,0.0,0.0,0.0,0.0,0.0,0.0,0.0,0.3751837474682558,0.0,0.3751837474682558
CCAM_ACT/PBQM002,,,,,,,,0.0,0.3751836873321629,,0.3751836873321629
CCAM_ACT/GLLD017,,,,,,0.0,0.21657253140132474,0.0,0.14295381412832334,0.0,0.3595263455296481
CCAM_ACT/ECQH010,,0.3368557596021954,,0.0,0.0,0.0,,0.0,0.0,0.0,0.3368557596021954
CCAM_ACT/GLQP005,0.0,0.0,0.0,0.0,0.0,0.0,0.0,0.0,0.0,0.3364081247477168,0.3364081247477168
CCAM_ACT/QEQM001,,0.3322843676774347,,,0.0,0.0,,,0.0,0.0,0.3322843676774347
CCAM_ACT/ZZQH033,,,0.0,0.0,0.0,0.3284872711885753,0.0,0.0,0.0,0.0,0.3284872711885753
CCAM_ACT/DEQP00500,,,,0.3284705535457826,,,,,,,0.3284705535457826
CCAM_ACT/JAQM004,0.0,0.0,0.0,,0.0,0.0,0.3274990656142963,0.0,0.0,0.0,0.3274990656142963
