Var,Factor_2012,Factor_13,Factor_14,Factor_15,Factor_16,Factor_17,Factor_18,Factor_19,Factor_20,Factor_21,Factor_Total
ASS_DGN/K766,0.01271642416939147,0.00435775204018857,0.0,0.008488212962295677,0.0,0.0,0.0,0.0,3.398547489669551e-05,0.0,0.025596374646772415
ASS_DGN/N185,0.008835502090719947,0.0005990243130545852,0.0,0.0,0.0,0.0005077463654411073,3.6433772720208236e-05,0.0013122617315045602,0.00039410913966514085,0.0018329946304751034,0.013518072043580654
ASS_DGN/K703,0.0,0.0,0.0,0.005218415796777734,0.0,0.0,0.0,0.0,0.00815167649505812,0.0,0.013370092291835854
ASS_DGN/Z940,0.0,0.0,0.0,0.0,0.0,0.0,0.0,0.001962122725499461,0.0037649580794002204,0.0028869282947461853,0.008614009099645867
ASS_DGN/Z992+0,0.001524103607783137,0.0014770507028393747,0.0002759427831542625,0.0,0.0,0.0,0.0008180693542032152,0.0,0.001277344577590318,0.0007119183993521778,0.006084429424922485
ASS_DGN/E1190,0.0,0.0,0.0,0.0,0.0,0.0,0.005369081650060713,0.0,0.0,0.0,0.005369081650060713
ASS_DGN/Z955,0.0,0.0,0.0,0.0,0.0,0.0,0.0,0.0051944988476741415,0.0,0.0,0.0051944988476741415
ASS_DGN/C795,0.0,0.0,0.0,0.0,0.0,0.0,0.004788880269508071,0.0,0.0,0.0,0.004788880269508071
ASS_DGN/E440,0.0,0.0,0.0,0.0,0.0,0.0,0.0009577245793322188,0.0031038621365533153,0.0,0.0,0.004061586715885534
ASS_DGN/F172,0.0,0.0,0.0030957104603437243,0.0,0.0,0.0,0.0,0.0,0.0,0.0,0.0030957104603437243
ASS_DGN/I7020,,0.0,0.0020186970738966543,0.0009475218431488753,0.0,0.0,0.0,0.0,0.0,0.0,0.0029662189170455294
ASS_DGN/D891,0.0013116808906945315,0.0,0.0016273848781805066,0.0,0.0,0.0,0.0,0.0,0.0,0.0,0.002939065768875038
ASS_DGN/D570,0.0,0.0,0.0,0.0,0.002544081649360162,0.0,0.0,0.0,0.0,0.0,0.002544081649360162
ASS_DGN/D638,0.0,0.001514372537106707,0.00038924403268843883,0.0,0.00037427767246930264,0.0,0.0,0.0,0.0,0.0,0.0022778942422644484
ASS_DGN/I120,0.0,0.0,0.0,0.0,0.0020782304332274495,0.0,0.0,0.0,0.0,0.0,0.0020782304332274495
ASS_DGN/I489,,,0.0,0.0,0.0,0.0,0.002043159490397216,0.0,0.0,0.0,0.002043159490397216
ASS_DGN/D571,0.0,0.0,0.0,0.0,0.0,0.001818643778065087,0.0,0.0,0.0,0.0,0.001818643778065087
ASS_DGN/Z740,0.0,0.0,0.0,0.0,0.0,0.0015921823613097986,0.0,0.0,0.0,0.0,0.0015921823613097986
ASS_DGN/Z922,0.0,0.0,0.0,0.0,0.0,0.0,0.0,0.0015536868936959372,0.0,0.0,0.0015536868936959372
ASS_DGN/B180,0.0,0.0,0.0,0.0,0.0,0.0014154198471494754,0.0,0.0,0.0,0.0,0.0014154198471494754
ASS_DGN/I270,0.0,0.0,0.0,0.0,0.0,0.001326872121057948,0.0,0.0,0.0,0.0,0.001326872121057948
ASS_DGN/T828,0.001212923395629549,0.0,0.0,0.0,0.0,0.0,0.0,0.0,0.0,0.0,0.001212923395629549
ASS_DGN/I482,,,0.0,0.0,0.0,0.0,0.0,0.0,0.0,0.0011481176694386073,0.0011481176694386073
ASS_DGN/F331,,,0.0,0.0,0.0,0.0010933628397331856,0.0,,,0.0,0.0010933628397331856
ASS_DGN/I702,0.0010353472992381083,0.0,,,,,,,,,0.0010353472992381083
ASS_DGN/Z7580,0.0,0.0,0.0,0.0,0.0010346370892861697,0.0,0.0,0.0,0.0,0.0,0.0010346370892861697
ASS_DGN/T861,0.0,0.0,0.0,0.0,0.0,0.0,0.0006419626024737015,0.0,0.0,0.0,0.0006419626024737015
ASS_DGN/H360,0.0,0.0,0.0,0.00034792444219571933,0.0,0.0,0.0,0.0,0.0,0.0,0.00034792444219571933
ASS_DGN/G919,,,0.0,0.0,,0.0,0.0,0.0,,0.0,0.0
ASS_DGN/I2148,,,0.0,,0.0,0.0,,0.0,0.0,0.0,0.0
