Var,Factor_2012,Factor_13,Factor_14,Factor_15,Factor_16,Factor_17,Factor_18,Factor_19,Factor_20,Factor_21,Factor_22,Factor_Total
ARO_PRS_NAT/3331,0.0,0.0,0.0,0.026548345703174426,0.007997431051345058,0.02965002432750808,0.0,0.0,0.007773091190500976,0.001654346429358569,0.0,0.0736232387018871
ARO_PRS_NAT/1110,,,,,,0.007879230967716158,0.008416913387772486,0.022603984146338917,0.012537670454093684,0.011992587401407467,0.0036080047420477693,0.06703839109937647
ARO_PRS_NAT/1324,0.009454223254799398,0.0,0.002435344528621363,0.021259969453691883,0.007866902093190185,0.0034506371751210053,0.012458089581337721,0.0,0.009538600091805773,0.0,0.0,0.06646376617856734
ARO_PRS_NAT/1111,0.00966881681128204,0.011469252633905113,0.011167515477367272,0.004175312771519571,0.018815461884582604,0.0037781281113089507,0.0,0.0,0.0,0.0,0.0,0.05907448768996555
ARO_PRS_NAT/1109,,,,,,0.0,0.015285836044387019,0.018088645123507354,0.004277862087486903,0.0,0.006499441478658375,0.04415178473403965
ARO_PRS_NAT/1351,0.0,0.0,0.0,0.0,0.0,0.0,0.006753801070917873,0.007573070976117064,0.0,0.0,0.016287783474050854,0.03061465552108579
ARO_PRS_NAT/1352,0.0,0.005870095165171206,0.010712358984233535,0.0017779913576739456,0.004314630637998688,0.0,0.0,0.0,0.002917721174213701,0.00021105721423176195,0.0,0.025803854533522838
ARO_PRS_NAT/3125,0.0013166069381479206,0.0017456040429763846,0.00363168985620449,0.0,0.002287286153924093,0.0032409306333945516,0.0018671996084503454,0.0029396427928094046,0.0005016590803138584,0.0041098237179604605,0.0037107896846066335,0.025351232508788145
ARO_PRS_NAT/1112,0.007034141512888665,0.0,0.0,0.010993450668996608,0.004559649560751992,0.0,0.0,0.0,0.0,0.0,0.0,0.022587241742637265
ARO_PRS_NAT/3312,0.004245269781296294,0.0,0.0012168026526794074,0.0,0.0,0.0,0.0,0.0,0.0,0.005188223853978646,0.011633829295101242,0.022284125583055592
ARO_PRS_NAT/3341,0.0,0.011520993077969275,0.004400037792931704,0.0,0.0,0.0,0.0017938340983825274,0.0,0.0015653448407024263,0.0,0.0,0.019280209809985936
ARO_PRS_NAT/3211,0.0,0.0018922332240923583,0.0,0.00019198262993824452,0.0018157743445335053,0.0031706909439020445,0.002717200904678358,0.0014209067089325747,0.0017884590215856127,0.0009661566807644946,0.001525003961791899,0.01548840842021909
ARO_PRS_NAT/1842,0.0,0.0,0.0,0.004824282637916201,0.0,0.0,0.0,0.007071975749521869,0.0,0.0,0.0018247206004009797,0.01372097898783905
ARO_PRS_NAT/3313,0.000578090109468282,0.0,0.00046124335949575116,0.0,0.0,0.001126397324419719,0.0014766402809769732,0.0011464663781766932,0.0026845251701378427,0.0027341972493427264,0.0013306942767366881,0.011538254148754675
ARO_PRS_NAT/3384,,,,0.002696446813561915,0.0,0.008168174052036197,0.0,0.0,0.0,0.0,0.0,0.010864620865598112
ARO_PRS_NAT/3111,0.00019706884551886673,0.003193440040996236,0.0,0.001396063814430199,0.0,0.0,0.0,0.0023567400859995395,0.0,0.0,0.0,0.007143312786944841
ARO_PRS_NAT/1433,0.0,0.006159080305159989,0.0,0.0,0.0,,,,,,,0.006159080305159989
ARO_PRS_NAT/1126,0.0,0.005994622647313236,0.0,0.0,0.0,0.0,0.0,0.0,0.0,0.0,0.0,0.005994622647313236
ARO_PRS_NAT/3366,,,,,,,,0.0056213534798647494,0.0,0.0,0.0,0.0056213534798647494
ARO_PRS_NAT/3116,0.0,0.0,0.003418316640346245,0.0,0.0,0.0,0.0,0.0,0.0,0.0018634112431034375,0.0,0.005281727883449682
ARO_PRS_NAT/2334,,,,0.0015733134197893485,0.0009662003604210908,0.0,0.0,0.0012624415073061797,0.0,0.0,,0.003801955287516619
ARO_PRS_NAT/2135,0.0,0.0,,,0.002579599791739123,0.0,,,,,,0.002579599791739123
ARO_PRS_NAT/2237,0.0,0.001122142257134985,0.0009322078573181767,0.0,0.0,0.0,0.0,0.0,0.0,0.0,0.0,0.0020543501144531617
ARO_PRS_NAT/9151,0.001995643552931853,,,,,,,,,,,0.001995643552931853
ARO_PRS_NAT/3365,,,,,,,,0.0,0.0,0.0019200880856004843,0.0,0.0019200880856004843
ARO_PRS_NAT/3112,0.0,0.0,0.0,0.0,0.0,0.0,0.0,0.0,0.0012129847184620263,0.0,0.0,0.0012129847184620263
ARO_PRS_NAT/3327,0.0,0.0,0.0,0.0,0.0007345904154778611,0.0,0.0,0.0,0.0,0.0,,0.0007345904154778611
ARO_PRS_NAT/3385,,,,2.7234401219091412e-05,0.0005237550695069647,0.0,0.0,0.0,0.0,0.0,0.0,0.0005509894707260561
ARO_PRS_NAT/3122,0.0,0.0,0.0,0.0,0.00037731322264495184,0.0,0.0,0.0,0.0,0.0,0.0,0.00037731322264495184
ARO_PRS_NAT/1108,,,,,,0.0,0.0,0.0,0.0,0.0,0.0,0.0
