Var,Factor_2012,Factor_13,Factor_14,Factor_15,Factor_16,Factor_17,Factor_18,Factor_19,Factor_20,Factor_21,Factor_Total
GRG_GHM/07M12,0.030293189851121165,0.006076587449918574,0.0,0.02771700406317323,0.05638350786609177,0.0,0.13549667940813803,0.0,0.0,0.02116485246582663,0.27713182110426937
GRG_GHM/16M11,0.1109252114239398,0.0,0.022859057296399306,0.0,0.0,0.03136457140928436,0.004922290272693863,0.060706327404207304,0.0,0.04550583783808385,0.2762832956446085
GRG_GHM/07M14,0.004136876359568139,0.012812634264293136,0.03280427151175898,0.03394234548927633,0.03265839916188268,0.039610844352634574,0.02525122658439597,0.009746316535605476,0.02137300313589741,0.051626376629880275,0.26396229402519295
GRG_GHM/07M07,0.07978827227620544,0.04007900777497536,0.0,0.0,0.0,0.0,0.00986874027762342,0.02172697000984352,0.04230213800212055,0.0,0.19376512834076828
GRG_GHM/27C02,0.0,0.0,0.028748977008009144,0.0227629719279818,0.0,0.11080446673187154,0.0,0.0,0.0,0.0,0.16231641566786248
GRG_GHM/28Z11,0.0,0.009196743120941597,0.013133889133775523,0.0,0.016988329119645318,0.016040534782073852,0.0,0.025767148212457337,0.04094315406274893,0.012909076057691616,0.13497887448933416
GRG_GHM/23Z02,0.0,0.0,0.0,0.03183047381131193,0.008913531844883887,0.0,0.0,0.06096228112878424,0.0,0.024829502710506404,0.12653578949548647
GRG_GHM/07M02,0.0,0.0,0.0,0.0,0.0,0.03135046769684908,0.006564393456052725,0.03981774442010053,0.0,0.0,0.07773260557300234
GRG_GHM/28Z07,0.022296640950440434,0.020150997323914573,0.008796888891407586,0.004429275162390303,0.0,0.0055274525377409876,0.0,0.0023758670731969154,0.0008320870094839738,0.005002001737470409,0.0694112106860452
GRG_GHM/23M14,0.0,0.0,0.0,0.014789884060283212,0.0,0.0,0.0,0.010093963571101188,0.026624857288842688,0.014192271971007798,0.06570097689123489
GRG_GHM/20Z04,0.011707917075133979,0.0235955751829164,0.0015352464900153034,0.005920176217895065,0.007079282723930072,0.0,0.009659632206283832,0.005490251177681599,0.0,0.0,0.06498808107385624
GRG_GHM/02C05,0.0,0.0,0.0,0.0,0.020307533963111798,0.0014714524198706498,0.0,0.017219052540562885,0.020160308059759328,0.0,0.05915834698330466
GRG_GHM/11M17,0.04167703510018906,0.0,0.01735473045289031,0.0,0.0,0.0,0.0,0.0,0.0,0.0,0.059031765553079374
GRG_GHM/05K10,0.0,0.0,0.0,0.0,0.0,0.01277392963663616,0.0,0.04072239609925681,0.0,0.0,0.05349632573589297
GRG_GHM/28Z17,0.0024111804009709615,0.0,0.0,0.004756150307266545,0.006486366843566763,0.007593653368841767,0.009322893520444438,0.012909078556291599,0.0,0.0,0.043479322997382074
GRG_GHM/28Z03,0.0,0.0,0.0,0.00464534996925748,0.0,0.006048048471587932,0.0,0.009967232539875397,0.0208315057698222,0.0,0.04149213675054301
GRG_GHM/05M09,0.0,0.0,0.0,0.0,0.0,0.0,0.0,0.02574104101339671,0.014229362533281149,0.0,0.03997040354667786
GRG_GHM/28Z16,0.011709904699943133,0.012382157317271028,0.0,0.0,0.0,0.0007040392020901952,0.00035636445572675664,0.00016306140906647553,0.0070644583156742775,0.007147805121007292,0.03952779052077916
GRG_GHM/28Z14,0.001566961618445346,0.00041425586399649293,0.0,0.0,0.0,0.0025741981713598133,0.0018132759148828614,0.013337903042737386,0.008321580157152658,0.006824071106724302,0.03485224587529886
GRG_GHM/23M06,0.0,0.005465059892863228,0.0,0.0,0.0,0.0,0.0,0.02171810297117532,0.0,0.0,0.02718316286403855
GRG_GHM/17M06,0.0,0.0,0.0,0.0,0.012889678258499175,0.011172173060315026,0.0,0.0,0.0008794410257777675,0.0,0.024941292344591966
GRG_GHM/28Z23,0.0009056388989670879,0.006482109425183719,0.0,0.0,0.012910794011356816,0.0,0.0010509971661005577,0.001948015965033751,0.0,0.0,0.023297555466641934
GRG_GHM/07C09,0.0,0.0,0.0,0.0,0.0,0.0,0.0,0.0,0.020096218731870927,0.0,0.020096218731870927
GRG_GHM/28Z24,0.0,0.006854118546880673,0.0012612822321595573,0.0,0.005662487795486075,0.0,0.0,0.0,,0.003482190182675701,0.017260078757202008
GRG_GHM/28Z15,0.0,0.0,0.005846795093577063,0.0,0.0,0.004702636295312766,0.004233307559481776,0.0010815753559044307,0.0,,0.015864314304276036
GRG_GHM/10M02,0.0,0.011949048599410563,0.0,0.0,0.0,0.0,0.0,0.0,0.0,0.0,0.011949048599410563
GRG_GHM/28Z18,0.002998203928534009,0.001955297143825422,0.0,0.001069838683981355,0.001565475816120651,0.0,0.0011182304809340194,0.0,0.0003864645577766225,1.6381072282851963e-05,0.009109891683454932
GRG_GHM/07M09,0.0,0.009036157180895045,0.0,0.0,0.0,0.0,0.0,0.0,0.0,0.0,0.009036157180895045
GRG_GHM/04M17,0.0,0.0,0.0,0.0,0.0,0.006986800752517259,0.0,0.0004914675127998183,0.0,0.0,0.007478268265317077
GRG_GHM/28Z04,0.0011222850111046773,0.0006521714148750941,0.0007231947574605422,0.00042604041669523434,0.0004871834929156198,0.0013690138173138601,0.0004937418743895229,0.0011633758742852238,1.3944848307088807e-05,0.000463342481067594,0.006914293988414457
