Var,Factor_2012,Factor_13,Factor_14,Factor_15,Factor_16,Factor_17,Factor_18,Factor_19,Factor_20,Factor_21,Factor_Total
ASS_DGN/B180,0.0,0.03195427558681194,0.0201728463646233,0.0,0.007844407181467035,0.018408012604735693,0.0,0.0,0.0,0.0,0.07837954173763796
ASS_DGN/K703,0.0,0.0,0.020560531939084418,0.0,0.0027930158948322485,0.010264554193152458,0.006984205211211052,0.012411564466116385,0.023576220187934677,0.0009686495469261391,0.07755874143925738
ASS_DGN/K766,0.01367837418470792,0.02034910797532814,0.0,0.0,0.0,0.0021587120577611666,0.020083911219546533,0.0,0.0,0.0,0.05627010543734376
ASS_DGN/C220,0.0,0.0,0.0,0.005522004597123539,0.0,0.0,0.0,0.0061354779108685415,0.0,0.03443319326311252,0.046090675771104594
ASS_DGN/Z940,0.001789681263467906,0.0024214338237651873,0.0,0.0,0.0,0.0,0.0,0.008819170459069433,0.006200639458607241,0.0,0.019230925004909766
ASS_DGN/Z944,0.0,0.0,0.0,0.0,0.0,0.0,0.005567537341111621,0.011805393684693015,0.0,0.0,0.017372931025804637
ASS_DGN/Z992+0,0.00022948940924340862,0.002475954569963047,0.0031955923515850624,4.6996342653297435e-05,2.871681349908322e-05,0.0007114124972679435,0.0008578212450989876,0.0012645513319956352,0.002146002456945431,0.0011923289786921491,0.012148865996944045
ASS_DGN/Z8712,0.0,0.0,0.0,0.0,0.0,0.0,0.0,0.010958627873814715,0.0,0.0,0.010958627873814715
ASS_DGN/N185,0.0,0.003458204602925054,0.0,0.0,0.0,0.0,0.0021967007275856456,0.0034375961156094784,0.0,0.0,0.009092501446120178
ASS_DGN/D638,0.001399638604305571,0.0,0.0018337088342689847,0.0,0.00019271899181919915,0.0,0.0,0.004153141386027514,0.001309620447064707,0.0,0.008888828263485976
ASS_DGN/E1190,0.0,0.0,0.0,0.0,0.0,0.0,0.005174042856178068,0.00281150196132922,0.0,0.0,0.007985544817507288
ASS_DGN/F172,0.0,0.0,0.001296130851936862,0.0,0.0040586007836429724,0.0,0.0,0.0,0.0,0.0,0.005354731635579834
ASS_DGN/E440,0.0,0.0,0.0,0.0,0.0,0.0,0.0036232862766833163,0.0007598874812036183,0.0,0.0,0.004383173757886934
ASS_DGN/J448,0.0,0.0,0.0,0.0,0.0,0.0,0.0,0.0,0.0042013971895424225,0.0,0.0042013971895424225
ASS_DGN/I770,0.0011317778516663933,0.0028643714504279732,0.0,0.0,0.0,0.0,0.0,0.0,0.0,0.0,0.003996149302094366
ASS_DGN/I7020,,0.0,0.0,0.0,0.0,0.003339689393586476,0.0,0.0,0.0,0.0,0.003339689393586476
ASS_DGN/Z966,0.0,0.0,0.0,0.0,0.0,0.0030595547827873978,0.0,0.0,0.0,0.0,0.0030595547827873978
ASS_DGN/D377,0.0,0.0,0.0,0.0,0.0,0.0,0.0,0.0,0.0,0.00297352120943737,0.00297352120943737
ASS_DGN/D571,0.0,0.0,0.0,0.0,0.0,0.001960042793064295,0.0,0.0,0.0,0.0,0.001960042793064295
ASS_DGN/I120,0.0,0.0,0.0,0.0,0.0017098799495317788,0.0,0.0,0.0,0.0,0.0,0.0017098799495317788
ASS_DGN/Z921,0.0,0.0,0.0,0.0,0.0,0.0012608403029114492,0.0,0.0,0.0,0.0,0.0012608403029114492
ASS_DGN/Z924,0.0,0.0,0.0009305955746069872,0.0,0.0,0.0,0.0,0.0,0.0,0.0,0.0009305955746069872
ASS_DGN/I7090,,0.0,0.0,0.0,0.0,0.0,0.0,0.0,0.0009000948221146453,0.0,0.0009000948221146453
ASS_DGN/I482,,,0.0,0.0,0.0,0.0,0.0,0.0,0.0,0.0007824790477232705,0.0007824790477232705
ASS_DGN/E1130,0.0,0.0,0.0,0.0,0.0,0.0,0.0,0.0,0.0,0.00025743771623033416,0.00025743771623033416
ASS_DGN/D500,0.0,0.0,0.0,0.0,0.0,0.00013509386587203412,0.0,0.0,0.0,0.0,0.00013509386587203412
ASS_DGN/H904,,,0.0,,,0.0,0.0,,,,0.0
ASS_DGN/I2148,,,0.0,,0.0,0.0,,0.0,0.0,0.0,0.0
ASS_DGN/A000,,,,0.0,,,0.0,,,,0.0
ASS_DGN/xxxx,,,0.0,,,0.0,,,,0.0,0.0
