Var,Factor_2012,Factor_13,Factor_14,Factor_15,Factor_16,Factor_17,Factor_18,Factor_19,Factor_20,Factor_21,Factor_Total
GRG_GHM/07M06,0.08638859851973305,0.08171031557989245,0.11081534288634638,0.05039819156965549,0.0,0.0,0.0,0.05702244715330353,0.07982535979246895,0.0,0.46616025550139983
GRG_GHM/07M08,0.005843312591643296,0.14385066523509066,0.10106394724629017,0.11749662868262792,0.0,0.0,0.0,0.0,0.0,0.0,0.3682545537556521
GRG_GHM/11M17,0.1348464214465128,0.04627199212989021,0.0,0.055550469431693394,0.07322818688499094,0.0,0.0,0.0,0.0,0.010530806494465911,0.32042787638755327
GRG_GHM/06M09,0.0,0.0,0.0,0.0,0.0,0.0,0.0,0.0,0.0,0.21882863901130795,0.21882863901130795
GRG_GHM/01M21,0.0,0.0,0.0,0.0,0.02907014596032269,0.13350267164399396,0.0,0.0,0.0,0.04650172125742969,0.20907453886174635
GRG_GHM/06M03,0.0,0.0,0.0,0.0,0.0,0.0,0.0,0.0,0.19213246667037964,0.0,0.19213246667037964
GRG_GHM/02C05,0.026598855658169173,0.047744387485910686,0.0,0.0,0.0030273788227329302,0.06522066357347292,0.0,0.0,0.0,0.03404298871016967,0.1766342742504554
GRG_GHM/28Z03,0.0,0.0,0.0,0.0,0.02054817933096794,0.0,0.0,0.03751550810326581,0.03554788923123189,0.06603869364506276,0.1596502703105284
GRG_GHM/13C16,0.0,0.0,0.06643706384697921,0.03697527636921822,0.0,0.0,0.0,0.05154898104740873,0.0,0.0,0.15496132126360618
GRG_GHM/07M04,0.0,0.0,0.14894960143934569,0.0,0.0,0.0,0.0,0.0,0.0,0.0,0.14894960143934569
GRG_GHM/28Z07,0.0,0.02009854713875748,0.0038366192662363063,0.00027828583769022884,0.003364327525161364,0.007722940153898697,0.03947091386573321,0.010285428685306124,0.031746352778555,0.00444020145282367,0.12124361670416209
GRG_GHM/06K02,0.027165642198777856,0.0,0.0,0.0,0.07510051074075814,0.0,0.016856593127147577,0.0,0.0,0.0,0.11912274606668358
GRG_GHM/17M06,0.0,0.0,0.03848799624837479,0.05404428038406174,0.0,0.022479122396476408,0.0,0.0,0.0,0.0,0.11501139902891294
GRG_GHM/23M19,0.0,0.0,0.0,0.0,0.0,0.0,0.0,0.0,0.0,0.1122968493569126,0.1122968493569126
GRG_GHM/11M04,0.0,0.0,0.0,0.0,0.1103324560266806,0.0,0.0,0.0,0.0,0.0,0.1103324560266806
GRG_GHM/13K02,0.0,0.0,0.0,0.0,0.0,0.0,0.0,0.0,0.10124627310885276,0.0,0.10124627310885276
GRG_GHM/06K05,0.0,0.0,0.0,0.0,0.0,0.09378502169311805,0.0,0.0,0.0,0.0,0.09378502169311805
GRG_GHM/08M35,0.0,0.0,0.0,0.0,0.0,0.0,0.09321185952893873,0.0,0.0,0.0,0.09321185952893873
GRG_GHM/11M06,0.0,0.0,0.0,0.0,0.0838360145843288,0.0,0.0,0.0,0.0,0.0,0.0838360145843288
GRG_GHM/05M13,0.0,0.0,0.0,0.0,0.0,0.08279536666896582,0.0,0.0,0.0,0.0,0.08279536666896582
GRG_GHM/28Z24,0.016087048882942857,0.014972603501266677,0.01702167450354762,0.0,0.026438241187126493,0.006625647203931841,0.0,0.0,,0.0,0.08114521527881549
GRG_GHM/28Z18,0.0,0.0,0.008045317957809706,0.013122178029725517,0.025490200125931166,0.0005851004378537324,0.010690043005413206,0.00031644756804869177,0.02226209292090732,0.0,0.08051138004568933
GRG_GHM/07M02,0.0,0.0,0.0,0.0,0.0,0.0,0.05857767896429668,0.0,0.0,0.019426051197317547,0.07800373016161423
GRG_GHM/23M09,0.0,0.0,0.0,0.008654591003057228,0.01630498131767979,0.004124033990629687,0.0,0.0,0.04820610925030157,0.0,0.07728971556166828
GRG_GHM/05K10,0.0,0.0,0.0,0.0,0.0,0.07665703608548582,0.0,0.0,0.0,0.0,0.07665703608548582
GRG_GHM/07M09,0.05188062052556211,0.0,0.02441261178380895,0.0,0.0,0.0,0.0,0.0,0.0,0.0,0.07629323230937106
GRG_GHM/05M20,0.0,0.0,0.0,0.0,0.0737867317893697,0.0,0.0,0.0,0.0,0.0,0.0737867317893697
GRG_GHM/28Z23,0.0,0.0,0.00587093824825383,0.02039502929280792,0.005348678288430083,0.0017652665832026172,0.0,0.01727540903979838,0.023085693602273447,0.0,0.07374101505476628
GRG_GHM/07M14,0.0,0.015396081128918137,0.0,0.005259444475402974,0.0,0.030001881016784228,0.0,0.0,0.0,0.017926851860924464,0.0685842584820298
GRG_GHM/28Z14,0.05388409639343267,0.0,0.0,0.0,0.0,0.0,0.0,0.0,0.008501560333786136,0.0,0.062385656727218804
