Var,Factor_2012,Factor_13,Factor_14,Factor_15,Factor_16,Factor_17,Factor_18,Factor_19,Factor_20,Factor_21,Factor_22,Factor_Total
TRS_ACT_QSN/6,0.0002269620233895943,0.0018289630027220746,0.0,0.0004889010139160815,0.0,0.00013181771935535689,0.001583300442126114,0.0004431407815148236,0.0007849406515864597,0.0013521390689407167,0.0007409523549765155,0.007581117058527736
TRS_ACT_PRU/0.89000,,,,0.004130167360930642,0.0011942914980566913,0.0,0.0020320534571674357,0.0,0.0,0.0,0.0,0.007356512316154769
TRS_ACT_QSN/0,0.0019592612105266923,0.0006349513544405958,0.0012641444382619686,0.0002500990781133133,0.0004229959961784554,0.00039368080695857433,0.0004631040345234274,0.0,0.0,0.000993259323691154,0.0001545439182306332,0.006536040160924814
TRS_ACT_QSN/7,0.0,0.0,0.0011946651786218364,0.0004979593417260353,0.0004296704851936228,0.0,0.0,0.0013835099930144435,0.0015230919136687334,0.0,0.001252673704777566,0.006281570617002238
TRS_ACT_QSN/2,8.288479782414615e-05,0.0011981098037433578,0.00019769059972974935,0.0,0.0011122130086123451,0.00047861120738636117,0.0007353508306376505,0.0014757807932159104,0.00025238552093565734,0.00027313482315684457,0.0,0.005806161385242022
TRS_ACT_QSN/12,0.0,0.0013069451765648076,0.0008601070520651414,0.0,0.0011635329004020677,0.0,0.000377902925178202,0.002086158895266708,0.0,0.0,0.0,0.005794646949476926
TRS_TRS_MTF/0,0.0,0.0,0.0012596685318302975,0.0012395639557375867,0.0002730491484334487,0.00017225770192497383,0.0,0.00042391103181281043,0.0006202667047091487,0.0004919664412084934,0.0008258806330773227,0.005306564148734082
TRS_ACT_PRU/12.90000,0.0019297215862965652,0.0032749295952897895,0.0,0.0,0.0,0.0,0.0,,,,0.0,0.005204651181586355
TRS_ACT_QSN/3,0.0017922462306260096,0.0012548474341753765,0.0,0.0,0.00020988297761664765,0.0001671943833453815,0.0,0.000532123735325264,0.0,0.00044748379589274915,0.000711834986055338,0.005115613543036766
TRS_TRS_MTF/10,0.0028802258052718368,0.0,0.0,0.0002680597685991252,0.0,0.0,0.0005763740757972523,0.00042971636143888757,0.0007694819363731284,0.0,0.0,0.00492385794748023
TRS_PRS_IDE/63,0.0029962851149061102,0.000799059020518973,0.00013517514308527282,0.0,0.0,0.0008341346485919186,0.0,0.0,0.0,0.0,0.0,0.004764653927102275
TRS_ACT_QSN/5,0.0006813875267006353,0.0,0.0,0.0,0.0006079662373011824,0.0005573509827428089,0.0,0.0,0.0,0.0,0.0018053966093545706,0.0036521013560991975
TRS_TRS_MTF/110,0.0,0.0,4.823468210313746e-05,0.0,0.0,0.0,0.003584240221903799,0.0,0.0,0.0,0.0,0.0036324749040069363
TRS_PRS_IDE/11,0.0,0.0,0.0,0.0,0.0,0.00044298927098149427,0.0,0.0011402842393684384,0.0007035625300628609,0.0013243460660322104,0.0,0.003611182106445004
TRS_PRS_IDE/52,0.0,0.0,0.0025618417307468255,0.0,0.0,0.0,0.0,0.0,0.0,0.001015393421233218,0.0,0.003577235151980044
TRS_PRS_IDE/51,0.0,0.0,0.0035156723210531425,0.0,0.0,0.0,0.0,0.0,0.0,0.0,0.0,0.0035156723210531425
TRS_TRS_MTF/999,0.0014041836653427983,0.0,0.0009540434802673378,0.0,0.000600047445532597,0.0,0.0,0.0004474449615167166,0.0,,,0.0034057195526594496
TRS_PRS_IDE/61,0.0,0.0,0.0,0.0004860318840364449,0.0,0.0014683552502283773,0.0,0.0008890685344038384,0.0,0.0,0.0005472298780766069,0.003390685546745267
TRS_PRS_IDE/72,0.0,0.00030332776760529594,0.0,0.0007297199368170222,0.0017987432214317716,0.00034113660904331797,0.0,0.00010073893593462505,0.0,0.0,0.0,0.0032736664708320324
TRS_PRS_IDE/47,0.0,0.0,0.0,0.00047287415434370635,0.0,0.0016350286230963562,0.0009274034983491527,0.0,0.0,0.0,0.0,0.003035306275789215
TRS_ACT_QSN/9,0.0,0.0,0.0,0.0,0.0008662828990994965,0.0,0.0,0.0013586639671675266,0.0,0.0005844205886659531,0.0,0.0028093674549329764
TRS_ACT_PRU/12.08000,0.0,0.0027355287759193874,0.0,0.0,0.0,0.0,0.0,,,0.0,,0.0027355287759193874
TRS_ACT_QSN/1,0.0,0.0,0.0,0.0,0.0,0.0,0.00012025043761272544,0.0014170891843987344,0.0,0.0005434896249646595,0.0003832925128089376,0.002464121759785057
TRS_PRS_IDE/21,0.0,0.002281789513524252,0.0,0.0,0.0,0.0,0.0,0.0,0.0,0.0,0.0,0.002281789513524252
TRS_PRS_IDE/66,0.0,0.0,0.0,0.0,0.0,0.0,0.0,0.0,0.0015208893929019227,0.00034058368105306067,0.0001240842168582766,0.00198555729081326
TRS_ACT_QSN/4,0.0,0.00030566458153552154,0.0009402217987284878,0.0,1.369891446293695e-05,0.00032476259647885354,0.0,0.0,0.0,0.0,0.000377324490159404,0.001961672381365204
TRS_TRS_MTF/100,0.00017626705942973424,0.0,0.0001651851795055324,0.0002651832862483278,6.687690833871127e-06,0.00010021413596622733,0.0,0.00011115131664935801,0.0005703525570836718,0.0003917050787397428,0.0,0.0017867463044564655
TRS_ACT_PRU/6.57000,,0.0,0.0,0.0,0.0,0.0,0.0,0.0,0.0,0.0012615579405850644,0.0003925902559719905,0.001654148196557055
TRS_ACT_QSN/8,0.0,0.0,0.0,0.0,0.00017561565299527705,0.0,0.0,0.0,0.0,0.0010859116479910351,0.0,0.0012615273009863122
TRS_ACT_QSN/10,0.0,0.0,0.0,0.0,0.0,0.0,0.0,0.0012397487432413683,0.0,0.0,0.0,0.0012397487432413683
