Var,Factor_2012,Factor_13,Factor_14,Factor_15,Factor_16,Factor_17,Factor_18,Factor_19,Factor_20,Factor_21,Factor_22,Factor_Total
CAM_PRS_IDE/ZCQM001,0.08039090319061977,0.0432874722068948,0.04075672926487353,0.05462688327115346,0.03489769678999443,0.09536325865115285,0.07274179654803678,0.05764291381353094,0.036761520873430736,0.0,0.0005091960026415244,0.5169783706123289
CAM_PRS_IDE/JKHD001,0.0,0.0,0.0,0.0,0.055894111705066016,0.0,0.0,0.060248964135283946,0.0,0.036516021535954124,0.036280400195875806,0.1889394975721799
CAM_PRS_IDE/ZCQM004,0.0,0.0,0.0159660838818157,0.019982364092184218,0.0,0.0,0.05240807963541196,0.05616370794809028,0.0,0.02172889380720567,0.0064783993733638625,0.17272752873807168
CAM_PRS_IDE/QEQM001,0.01350850724205237,0.0,0.0,0.016710859066134613,0.012383064367818506,0.03165998706864745,0.0033754910115980116,0.0,0.05109284639821643,0.0,0.0,0.12873075515446739
CAM_PRS_IDE/ZCQJ004,0.0,0.0,0.0,0.01814151136783235,0.0,0.0,0.0,0.04508832283110158,0.0,0.04707773818620607,0.0,0.11030757238514
CAM_PRS_IDE/ZCQM008,0.0,0.04462260704671677,0.024915275276291893,0.0,0.0027292201079812378,0.01095941660295144,0.0,0.0,0.022945763002730716,0.0,0.0,0.10617228203667206
CAM_PRS_IDE/JKQP008,0.0,0.0992851187770267,0.0,0.0,0.0,,,,,,,0.0992851187770267
CAM_PRS_IDE/JKQX147,,,,,,,0.0,0.0,0.08063900186615239,0.0,0.0,0.08063900186615239
CAM_PRS_IDE/YYYY600,0.0,0.0096507365415277,0.0,0.01829877679426612,0.0,0.0,0.0,0.0,0.002425157894431061,0.0,0.0156619870679423,0.04603665829816718
CAM_PRS_IDE/HBQK002,0.0,0.0,0.0,0.02001414818316262,0.010796541161689141,0.0,0.0,0.00997794484755883,0.0014116483384107098,0.0,0.0,0.0422002825308213
CAM_PRS_IDE/BLQP010,0.0,0.0,0.03695003327284263,0.0,0.0,0.0,0.0,0.0,0.0,0.0,0.0,0.03695003327284263
CAM_PRS_IDE/HBJD001,,,0.0,0.0,0.0,0.00920844823536783,0.002447986530672803,0.007886680529045693,0.0,0.0,0.012262935430450334,0.03180605072553666
CAM_PRS_IDE/QEQK001,0.0,0.0,0.0,0.02954003704031506,0.0,0.0,0.0,0.0,0.0,0.0,0.0,0.02954003704031506
CAM_PRS_IDE/JVJF004,0.0027524102307808647,0.0,0.0004193415812672734,0.0034853018822046233,0.0,0.0047510785306611476,0.0,0.0038339067507258333,0.00019065843165783937,0.007755878103143247,0.0028010049366331445,0.025989580447073973
CAM_PRS_IDE/ZCQJ003,0.0,0.0,0.0,0.022736175703158973,0.0,0.0,0.0,0.0,0.0,0.0,0.0,0.022736175703158973
CAM_PRS_IDE/HLQM002,0.0,0.0,0.0,0.0,0.0,0.0,0.0,0.006239046923383932,0.01603491250933343,0.0,0.0,0.022273959432717365
CAM_PRS_IDE/DZQM006,0.0,0.0,0.0,0.0,0.0,0.0,0.004766311178367499,0.0,0.01044345856411492,0.006244171283636433,0.0,0.021453941026118854
CAM_PRS_IDE/BGQP002,0.0,0.0,0.0,0.008653462321229707,0.0,0.0,0.0,0.010467785603470864,0.0,0.0,0.0,0.01912124792470057
CAM_PRS_IDE/DEQP003,0.0,0.0,0.0,0.0,0.0,0.0,0.0,0.0,0.0,0.018563258814589496,0.0,0.018563258814589496
CAM_PRS_IDE/ZCQM005,0.0,0.0,0.0,0.0,0.0,0.0,0.00917838844941075,0.009024211139050246,0.0,0.0,0.0,0.018202599588460995
CAM_PRS_IDE/ZBQK002,0.0,0.017477072502144336,0.0,0.0,0.0,0.0,0.0,0.0,0.0,0.0,0.0,0.017477072502144336
CAM_PRS_IDE/ZCQJ006,0.0,0.0,0.0,0.0,0.0150845263178475,0.0,0.0,0.0,0.0,0.0,0.0,0.0150845263178475
CAM_PRS_IDE/JVJF008,0.0,0.0,0.003569433248492882,0.0032582588551584458,0.00019428813188597215,0.0,0.0028540372618636387,0.0,0.0035793366584871483,0.0,0.0,0.013455354155888086
CAM_PRS_IDE/ZCQM006,0.0,0.0,0.0,0.0,0.0,0.009565372144304828,0.0,0.0,0.0,0.0,0.0,0.009565372144304828
CAM_PRS_IDE/JKQX008,,,0.0,0.0,0.0,0.009377377799715654,0.0,0.0,0.0,,,0.009377377799715654
CAM_PRS_IDE/EJNF002,0.008739646512984547,0.0,0.0,0.0,0.0,0.0,0.0,0.0,0.0,0.0,0.0,0.008739646512984547
CAM_PRS_IDE/HBMD058,,,0.0,0.008738877766618577,0.0,0.0,0.0,0.0,0.0,0.0,0.0,0.008738877766618577
CAM_PRS_IDE/JVRP004,0.0,0.003272580680669574,0.0007867817273968586,0.0,0.00363505967114398,0.0,0.0,0.0,0.0,0.0,0.0,0.007694422079210413
CAM_PRS_IDE/BZQK001,0.0,0.0,0.0,0.002134159273361047,0.0,0.0,0.005112346385494543,0.0,0.0,0.0,0.0,0.00724650565885559
CAM_PRS_IDE/QZRB001,0.005482493169336351,0.0007072127250245629,0.0,0.0,0.0,0.0,0.0,0.0,0.0,0.0,0.0,0.006189705894360914
