Var,Factor_2012,Factor_13,Factor_14,Factor_15,Factor_16,Factor_17,Factor_18,Factor_19,Factor_Total
CCAM_COD/BFGA004,0.0,0.00919234159581352,0.0,0.04558604739271893,0.020966897640900886,0.014087455174170978,0.024303403059819973,0.0,0.11413614486342429
CCAM_COD/HHFE002,0.03456342421686044,0.0,0.0,0.0259809872181784,0.04623653749693027,0.0020079174003654033,0.0,0.00030626036834267633,0.1090951267006772
CCAM_COD/HEQE002,0.04154915097565991,0.017767317804319015,0.0188413578884036,0.0,0.0,0.0,0.0,0.0,0.07815782666838253
CCAM_COD/DEQP003,0.00821065830200686,0.007705593088836287,0.0023329786464295664,0.0,0.009151054462402256,0.0,0.020477082342929484,0.0,0.04787736684260445
CCAM_COD/EHNE001,0.01649870118034116,0.026790837502715985,0.0,0.0,0.0,0.0,0.0,0.0,0.04328953868305714
CCAM_COD/ZZLP025,0.0,0.0,0.0,0.0,0.0,0.04014139114597983,0.0,0.0,0.04014139114597983
CCAM_COD/YYYY015,0.0,0.013355050123121846,0.0008444094060006443,0.012753996039550906,0.0,0.0,0.0007015538459798145,0.012058410348276507,0.03971341976292972
CCAM_COD/JVRP004,0.006008278516950883,0.0,0.0042245447786857385,0.0009948412812937851,0.015109704152638986,0.0,0.006209795396713236,0.0037634012278838567,0.036310565354166484
CCAM_COD/YYYY600,0.0,0.0,0.0,0.0,0.0,0.026356465533478923,0.0,0.0,0.026356465533478923
CCAM_COD/BFGA427,,,,,,,,0.02440510462786075,0.02440510462786075
CCAM_COD/YYYY002,0.0,0.016819548121607505,0.0,0.0,0.0,0.0075617811361840025,0.0,0.0,0.024381329257791507
CCAM_COD/ZBQK002,0.018911353286948464,0.004656318960030334,0.0,0.0,0.0,0.0,0.0,0.0,0.023567672246978796
CCAM_COD/FEJF003,0.0,0.0,0.02107800344702062,0.0,0.0,0.0,0.0,0.0,0.02107800344702062
CCAM_COD/HHQE005,0.0,0.0,0.004496602008725227,0.014885827930481982,0.0,0.0,0.0,0.0,0.019382429939207208
CCAM_COD/JVJF008,0.0,0.0009562188543610008,0.0026866144950492866,0.0032745423388609064,0.0020145761636904133,0.0023303438137283433,0.0024077962600583896,0.0023074887326113395,0.015977580658359677
CCAM_COD/GLLP006,,,0.004941520725389203,0.004883557254667211,0.005173535852288083,,,,0.014998613832344496
CCAM_COD/JVJF004,0.0014085746109836358,0.0013941162503791384,2.864401032914895e-05,0.001174403907537652,0.0025324642841216623,0.0018568705723308895,0.0012792275235343367,0.0017578600471891744,0.011432161206405637
CCAM_COD/FELF011,0.0,0.0,0.0,0.0,0.008562362602734401,0.0,0.0,0.0,0.008562362602734401
CCAM_COD/AHQJ021,,,0.0,0.0,0.0,0.0,0.006328951968515374,0.0,0.006328951968515374
CCAM_COD/DDQH009,0.0,0.0,0.0,0.0,0.0,0.004487591537851572,0.0,0.0,0.004487591537851572
CCAM_COD/QAMA002,0.0,0.0,0.0,0.0,0.0,0.0,0.0035407596785233587,0.0,0.0035407596785233587
CCAM_COD/YYYY007,,0.0,,0.0,0.0026301101196732446,0.0,0.0,0.0,0.0026301101196732446
CCAM_COD/YYYY028,0.0,0.0,0.0,0.002487019885773222,0.0,0.0,0.0,0.0,0.002487019885773222
CCAM_COD/HHQE002,0.0,0.0,0.0,0.0,0.0,0.0005423782057783201,0.0,0.0,0.0005423782057783201
CCAM_COD/EPPP003,,0.0,0.0,0.0,0.0,2.0241224139837216e-05,3.063497807433441e-05,0.0,5.087620221417163e-05
CCAM_COD/MGKA003,,,,0.0,,,0.0,,0.0
CCAM_COD/MGFA003,,,,0.0,,,,,0.0
CCAM_COD/NEKA004,,,,0.0,0.0,,,,0.0
CCAM_COD/NCPA014,,,,0.0,0.0,,0.0,0.0,0.0
CCAM_COD/NDCB002,,,,0.0,,,,,0.0
