Var,Factor_2012,Factor_13,Factor_14,Factor_15,Factor_16,Factor_17,Factor_18,Factor_19,Factor_20,Factor_21,Factor_22,Factor_Total
PRS_NAT_REF/3315,0.03461924999415323,0.03690324728932038,0.037151289833531206,0.028039324059851937,0.027447923738930433,0.0279865105016788,0.024275298551447274,0.02527725119904239,0.01327873798474058,0.0032556668953641144,0.01143785242258284,0.26967235247064314
PRS_NAT_REF/3366,,,,,,,,0.013853249827064021,0.02162107526329897,0.021320876694611496,0.02346056610414502,0.0802557678891195
PRS_NAT_REF/3383,,,,0.013121442135061829,0.011822286145163204,0.012270066390598834,0.01126411060017022,0.004477631038194306,0.006754339485919069,0.006470935774567885,0.007752094245839277,0.07393290581551462
PRS_NAT_REF/3314,0.0,0.0,0.0,0.0,0.0,0.0,0.0,0.02841457671894609,0.0,0.0,0.0,0.02841457671894609
PSP_SPE_COD/8,0.0,0.0,0.0,0.0016027828814403416,0.006763347474267273,0.004810649156405868,0.00438652079574266,0.0015195681336911647,0.0024925247845903756,0.003197985300664892,0.0013820558824338505,0.026155434409236428
PSP_SPE_COD/7,0.003632169591217183,0.0036890774699822938,0.0,0.002519219709470321,0.002557305242118674,0.005931679547265859,0.0019253649829458618,0.0015310359652164443,0.000928587158212865,0.0014797519003284351,0.0,0.024194191566757936
PSE_ACT_NAT/0,0.0035947895705273534,0.0028171194809732507,0.0021004249736773996,0.0011228406815979035,0.0012559017596175982,0.0005940358330346156,0.001536702317793581,0.0010994230877522746,0.0022139829792786805,0.0020356673928297233,0.0010531238335430239,0.0194240119106254
PSP_SPE_COD/99,0.0,0.004314000294619442,0.002177848513078595,0.00037576709361450563,0.001061936539420753,0.0014198905856215643,0.0005940725970633291,0.0014193601386283084,0.0020104116235937254,0.0017113310706749995,0.0011607874285588364,0.016245405884874057
PRS_NAT_REF/3313,0.0030269311875312987,0.0013257990261209237,0.0,0.0,0.002124691116369036,0.0,0.0,0.0025556171424455055,7.621232734842431e-05,0.004381716804317558,0.0,0.013490967604132745
PRS_NAT_REF/3386,,,,0.0025168037719260896,0.0,0.002795922702067233,0.002454130621257888,0.0,0.0,0.0,0.0,0.00776685709525121
PRS_NAT_REF/3514,0.0,0.0,0.0,0.0,0.0,0.0,0.0,0.0,0.0,0.007526668098408887,0.0,0.007526668098408887
PSE_ACT_NAT/50,0.001278210228110395,0.001443857052086131,0.0032466492395110094,0.00015917999747373313,0.0,0.0,0.0,8.117998256095086e-05,6.760587204086977e-05,9.056414168628447e-05,0.000346041493059448,0.006713288006528823
PSP_ACT_NAT/99,0.004034598813048593,0.0,0.00042272480806851057,0.0005225235065384068,0.000321578760016016,0.0,0.0003637382104588906,0.0,0.0004102604856070221,0.0,0.0,0.00607542458373744
PRS_PDS_QCP/0,0.0026106095957009394,0.0010122202722889027,0.0007462346640620903,0.0001274700713200524,0.0005938777437693254,0.0,0.0,0.0,0.0,0.0,0.0,0.00509041234714131
PRS_NAT_REF/3312,0.0,0.0006525688239757488,0.003885425984729864,0.0,0.0,0.0,0.0,0.0,0.0,0.0,0.0,0.004537994808705613
PSP_ACT_NAT/0,0.0,0.0,0.0007949075786729549,0.0,0.0007952830426144439,0.0005193623532641844,0.0003381602402627792,0.0,0.0005435014373048909,0.0,0.0005816801710730132,0.0035728948231922666
PRS_NAT_REF/3316,0.0,0.0,0.003502406177351446,0.0,0.0,0.0,0.0,0.0,0.0,0.0,0.0,0.003502406177351446
PRS_NAT_REF/3111,0.0,0.00042877156670043836,0.0009882635285665667,0.0004889657347012073,0.000172211272717124,0.00040584207444457687,0.00037593309511301074,0.0,0.0002254534938387142,3.944815860217087e-05,0.000254240851074737,0.003379129775758546
PRS_NAT_REF/3211,0.0,0.0,4.1142819525718955e-05,0.0,0.0016302988271056972,0.00039930023804200646,1.1426930670871437e-05,0.0,0.0,0.0011806820865128411,0.00011229655764902102,0.0033751474595061556
PRS_NAT_REF/2334,,,,0.0,0.0,0.0,0.0016826791995857068,0.0014018726408408146,0.0,0.0,,0.0030845518404265214
PSP_SPE_COD/34,0.0,0.0,0.0,0.0,0.0,0.0,0.0,0.0,0.0013622134524566235,0.0006022444083503617,0.0010059356011313492,0.002970393461938335
PSP_SPE_COD/15,0.0,0.0,0.0,0.0,0.00015328229260722678,0.0003844791026305927,0.0,0.0005409538618896597,0.001644614509676251,0.0,0.0,0.00272332976680373
PRS_NAT_REF/3326,0.0,0.0,0.0,0.0,0.0,0.0,0.0,0.0,0.0,0.002613507527505572,0.0,0.002613507527505572
PSE_ACT_NAT/26,0.00032121914013145817,0.0002956618757973661,0.00016909473172927833,0.0,0.0,0.0002045497624805718,0.0009326445249759395,0.0003173126743106757,0.0,0.0,0.0,0.0022404827094252896
PSP_SPE_COD/1,0.0004309438044608794,0.00045671929018031014,0.0003685433652165356,0.0006229340850236468,0.00011419611384649971,0.0,0.0,7.417972655067102e-05,4.2368173135637945e-05,0.0,0.0,0.00210988455841418
PRS_NAT_REF/3341,0.0,0.0,0.0010213936757330312,0.0,0.0,0.0,0.0,0.0,0.0,0.0009764544144227779,0.0,0.001997848090155809
PRS_NAT_REF/3385,,,,0.0,0.00060347013114198,0.0013724777553686836,0.0,0.0,0.0,0.0,0.0,0.0019759478865106635
PSE_SPE_COD/1,0.0,0.0,0.0,0.0,0.0,0.0,0.0,0.0,0.0,0.0006618355315425989,0.0009471104982193179,0.0016089460297619169
PSP_SPE_COD/41,0.0,0.0,0.0,0.0,0.0,0.0,0.0,0.0,0.0,0.0015983091487648316,0.0,0.0015983091487648316
PSP_SPE_COD/6,0.0,0.0,0.0,0.0,0.0,0.0,0.0,0.0,0.0,0.0,0.001472536137976771,0.001472536137976771
