Var,Factor_2012,Factor_13,Factor_14,Factor_15,Factor_16,Factor_17,Factor_18,Factor_19,Factor_20,Factor_21,Factor_22,Factor_Total
PRS_NAT_REF/3355,0.0,0.0,0.028527342898492833,0.0,0.0,0.0,0.0,0.0,0.0,0.0,0.0,0.028527342898492833
PRS_NAT_REF/3317,0.0,0.0,0.010108514116766729,0.012623133219009515,0.0,0.0,0.0,0.0,0.0,0.0,0.0,0.022731647335776244
PRS_NAT_REF/3514,0.0014461335151809743,0.0016083957088046097,0.0,0.0007328959670944012,0.0027631487025315308,0.004941412313890659,0.0032501904510318885,0.0007819693229552373,0.002847342453673302,0.0031537299873302975,0.0009564715114143091,0.02248168993390721
PSP_SPE_COD/8,0.002143914260783926,0.0023982406909170617,0.0027922233087233975,0.0021843854176320805,0.0016060768837751693,0.001755713735500571,0.0019483560523741793,0.0017412155033388872,0.0022592637403656517,0.0015354339020458843,0.0013853893598049995,0.021750212855261807
PSP_SPE_COD/7,0.0,0.0006541156909448217,0.0,0.0,0.0,0.0,0.0011392228831391693,0.0037943321341429256,0.0036568375821705475,0.003745778876930419,0.0017024871753188585,0.014692774342646743
PRS_NAT_REF/3313,0.0017359290774537398,0.001593198087866949,0.0,0.0009652753780892004,0.0009462683616484952,0.001961971030556223,0.001307067468249235,0.0010110887389885967,0.0,0.0004983372112283117,0.001263739634011322,0.011282874988092073
PRS_NAT_REF/3312,0.0,0.0004616887968212145,0.003004567546338562,0.0013411703191062035,0.0005714623111255715,0.00017678038049928372,0.0016688407436786926,0.001903551511575489,0.0,0.0013677101548776702,0.0,0.010495771764022688
PSE_ACT_NAT/30,0.002239652444225748,0.0013234017658737267,0.00241768054430759,0.0013523454542644958,0.0004545043910767557,0.0,0.0,0.0004507167926348364,0.000437284802755832,0.0,0.0,0.008675586195138984
PSP_SPE_COD/99,0.0007371689655716157,0.0006813894050845352,0.0012548479499789906,0.0011696683054118924,0.0004582633586937339,0.0,0.0009420426048394097,0.000940632844557735,0.0009227320805644022,0.0005370319815349372,0.000707755014970186,0.008351532511207438
PSP_SPE_COD/35,0.0013260677660259764,0.000841413698447039,0.0006197217042949609,0.000650512751099277,0.0005445045874041217,0.00028100542580047737,0.0008294960632384683,0.0006584694597757205,0.0008382301764781942,0.0006590871066401537,0.0006975468451195964,0.007946055584323986
PSE_ACT_NAT/0,0.0009790233588668786,0.0005800231064382013,0.001570654507958083,0.0010059322033362083,0.0005186884382034378,0.0010965200909631954,0.0007582037480540478,0.0007305607455452109,0.0004250971305965461,8.077467955633817e-05,0.0,0.007745478009518147
PSE_ACT_NAT/26,0.00040309539218808617,0.0,0.0016796518531231625,0.0007568802076657109,0.0007314326462550344,0.0005518194474067687,0.0003588597395783589,0.001199049446083739,0.0009052600940834901,0.0,0.0006800230604314899,0.007266071886815841
PSP_SPE_COD/14,0.0012516545131707206,0.0004143618901774081,0.0007699609816448956,0.0,0.0010305453008860245,0.0006235396477186506,0.0012338365216176615,0.0,0.0,0.00028475170951393504,0.0012464123719333172,0.006855062936662613
PSP_ACT_NAT/19,0.0,0.0,0.0,0.00021929098288341924,0.0,0.00026208312033840914,0.000368522107716027,0.0013993281478479336,0.0016133080525379169,0.0011264347395297713,0.0,0.004988967150853478
PRS_NAT_REF/3316,0.0,0.0003227468990316455,0.004323869550344465,8.13369231963619e-05,0.0,0.0,0.0,0.0,0.0,0.0,0.0,0.004727953372572472
PSP_SPE_COD/1,0.0004200248453192284,0.0007241080936872669,0.0011670500467377196,0.00046367772116633294,0.00036913674897398504,0.00012925698646759092,0.00023167879755502167,0.00027510653207233666,0.00023239670330182355,0.0004519307305591771,0.00020414824832674754,0.00466851545416723
PRS_NAT_REF/3383,,,,0.0,0.0,0.0,0.0,0.0006874876244954554,0.0,0.0007242860152653735,0.0029291506051401183,0.004340924244900947
PSP_SPE_COD/42,3.327844194698647e-05,0.0007619824526087655,0.001187712234337074,0.00045754164286236404,0.00040690014179900225,0.0,0.0007705959368686632,0.0,0.00031342731440785865,0.00032093540555323347,0.0,0.004252373570383948
PSE_SPE_COD/6,0.0,0.0,0.0,0.0,0.0,0.0017400510983278468,0.0016144868169550828,0.0,0.0,0.0,0.0,0.0033545379152829296
PSE_ACT_NAT/55,0.0,0.0,0.0,0.0017781412698678277,0.0,0.0,0.0,0.0,0.000850894309882283,0.0,0.0,0.002629035579750111
PRS_NAT_REF/3125,0.0,0.0011317726844530178,0.0003164548144701495,0.0,0.00041155568036009105,0.0003112411843462905,0.0003822811335462873,0.0,0.0,0.0,0.0,0.002553305497175836
PRS_NAT_REF/3326,0.0,0.0,0.0,0.0,0.0,0.0,0.0,0.0,0.0,0.0,0.0025280234078724254,0.0025280234078724254
PRS_NAT_REF/3341,0.0,0.0,0.0,0.0,0.0,0.0,0.0,0.0,0.0024564293729710286,0.0,0.0,0.0024564293729710286
PSP_SPE_COD/33,0.0,0.0,0.0,0.0001485111079905931,0.0,0.0,0.000813368147753551,0.00026479125297457,0.00022969812862594648,0.0,0.0007911048937427258,0.0022474735310873866
PRS_NAT_REF/3211,0.0,0.0,0.0,0.0,0.0,0.0008624573313827077,0.00022166660151044362,0.0,0.0001796267719978312,0.0009034003111209175,0.0,0.0021671510160119
PSP_SPE_COD/15,0.0,0.0,0.0,0.0,0.0,0.0,0.0,0.00012898556569338382,0.0005786809620331142,0.0006434741352538833,0.0007724432130001649,0.002123583875980546
PSP_SPE_COD/9,0.0,0.0,0.00021510781163185875,0.0,0.0,0.0,0.0,0.00019593121436445866,0.0003831257121970075,0.0013162872887937417,0.0,0.0021104520269870667
PSP_SPE_COD/13,0.0,0.0,0.0,0.0,0.0,0.0,0.0012703459466348072,0.0,0.0005303306290906493,0.0,0.0,0.0018006765757254566
PSE_SPE_COD/99,0.00013638334024242734,0.0005774577783377458,5.243905594480597e-05,0.0009286147367373082,0.0,2.0957855942748753e-05,9.077354445795744e-06,0.0,0.0,0.0,0.0,0.001724930121650832
PSE_ACT_NAT/24,0.00034389764075346284,0.0,0.0009214894273533351,0.0001708251864158802,0.00011203080376476908,0.0,9.445369486393226e-05,0.0,6.306067894438907e-05,0.0,0.0,0.0017057574320957685
