Var,Factor_2012,Factor_2013,Factor_2014,Factor_2015,Factor_2016,Factor_2017,Factor_2018,Factor_2019,Factor_2020,Factor_2021,Factor_2022,Factor_Total
MED_MTF_COD/K74,0.13062119123025634,0.13454259429760468,0.12137222910513815,0.11091980997457998,0.1168862973025225,0.10359932140893413,0.12812640672362546,0.1354343391568065,0.11535294044660119,0.11840311663074934,0.1463906236297443,1.3616488699065625
MED_MTF_COD/K703,0.09593680681766842,0.09312864168000778,0.12014988313451215,0.10350595050232816,0.09958710138067405,0.09832510210835861,0.0899215207980482,0.10125558489983195,0.0909805065295643,0.08958021346324774,0.10778860649485605,1.0901599178090975
MED_MTF_COD/E11,0.05263774536397494,0.03976098951643052,0.05285438960948459,0.05951274153006017,0.05502482136408631,0.058335129362088296,0.04534165519009406,0.04848122049308528,0.06901770197401043,0.04306393028665299,0.053700623682561247,0.5777309483725288
MED_MTF_COD/E10,0.03604418297325029,0.038432178161109574,0.043986958119164865,0.05503285921365597,0.06369175192277514,0.026303704941620553,0.05121868646486361,0.0547929715188381,0.035815593391515084,0.03215325380081341,0.05036330225146421,0.48783544275907076
MED_MTF_COD/N18,0.0,0.00742934259196099,0.02855438342219583,0.018618941819017024,0.01485545539055301,0.017290557855037303,0.048680248244592286,0.02776164463292911,0.02285076855430539,0.027608505933627084,0.02773520610569867,0.2413850545499167
MED_MTF_COD/C22,0.007893003569068692,0.0075787217876643,0.0030346161590445097,0.013967034412593227,4.6085409584081634e-05,0.0007587470920979295,0.0295404633654198,0.014639326976469287,0.005496415734325508,0.004450626132657419,0.02472684434456005,0.11213188498348481
MED_MTF_COD/B182,0.0017924329725209846,0.001983295503271071,0.0046148030741913065,0.006981926862397172,0.007598356089362773,0.004224709947702243,0.0,0.005306063241796972,0.002561425334368603,0.006214947558758165,0.010791236338184185,0.05206919692255347
MED_MTF_COD/I25,0.0,0.0018183481071810236,0.0,0.006019088731411122,0.0020467436627323856,0.0,0.0,0.0,0.004738396385339137,0.0,0.010440630522013073,0.025063207408676742
MED_MTF_COD/C50,0.0,0.008649757516670142,0.0,0.0,0.0,0.0029223679276362746,0.00169091115295002,0.0,0.0,0.0,0.004526999551379778,0.017790036148636217
MED_MTF_COD/F31,0.0010325841888775343,0.0008521343682936086,0.0,0.010493162532627009,0.0,0.0,0.0,0.0,0.0012895053541584973,0.0,0.0,0.01366738644395665
MED_MTF_COD/B16,0.0,0.0,0.0,0.0,0.0,0.0,0.0,0.0,0.0,0.0,0.0,0.0
MED_MTF_COD/B181,0.0,0.0,0.0,0.0,0.0,0.0,0.0,0.0,0.0,0.0,0.0,0.0
MED_MTF_COD/B180,0.0,0.0,0.0,0.0,0.0,0.0,0.0,0.0,0.0,0.0,0.0,0.0
MED_MTF_COD/B18,0.0,0.0,0.0,0.0,0.0,0.0,0.0,0.0,0.0,0.0,0.0,0.0
MED_MTF_COD/B171,0.0,0.0,0.0,0.0,0.0,0.0,0.0,0.0,0.0,0.0,0.0,0.0
MED_MTF_COD/B17,0.0,0.0,0.0,0.0,0.0,0.0,0.0,0.0,0.0,0.0,0.0,0.0
MED_MTF_COD/A480,0.0,0.0,0.0,0.0,0.0,0.0,0.0,0.0,0.0,0.0,0.0,0.0
MED_MTF_COD/B159,0.0,0.0,0.0,0.0,0.0,0.0,0.0,0.0,0.0,0.0,0.0,0.0
MED_MTF_COD/B023,0.0,0.0,0.0,0.0,0.0,0.0,0.0,0.0,0.0,0.0,0.0,0.0
MED_MTF_COD/A80,0.0,0.0,0.0,0.0,0.0,0.0,0.0,0.0,0.0,0.0,0.0,0.0
MED_MTF_COD/B189,0.0,0.0,0.0,0.0,0.0,0.0,0.0,0.0,0.0,0.0,0.0,0.0
MED_MTF_COD/A30,0.0,0.0,0.0,0.0,0.0,0.0,0.0,0.0,0.0,0.0,0.0,0.0
MED_MTF_COD/A18,0.0,0.0,0.0,0.0,0.0,0.0,0.0,0.0,0.0,0.0,0.0,0.0
MED_MTF_COD/B188,0.0,0.0,0.0,0.0,0.0,0.0,0.0,0.0,0.0,0.0,0.0,0.0
MED_MTF_COD/B22,0.0,0.0,0.0,0.0,0.0,0.0,0.0,0.0,0.0,0.0,0.0,0.0
MED_MTF_COD/C01,0.0,0.0,0.0,0.0,0.0,0.0,0.0,0.0,0.0,0.0,0.0,0.0
MED_MTF_COD/B19,0.0,0.0,0.0,0.0,0.0,0.0,0.0,0.0,0.0,0.0,0.0,0.0
MED_MTF_COD/B20,0.0,0.0,0.0,0.0,0.0,0.0,0.0,0.0,0.0,0.0,0.0,0.0
MED_MTF_COD/C02,0.0,0.0,0.0,0.0,0.0,0.0,0.0,0.0,0.0,0.0,0.0,0.0
MED_MTF_COD/B23,0.0,0.0,0.0,0.0,0.0,0.0,0.0,0.0,0.0,0.0,0.0,0.0
