Var,Factor_2012,Factor_13,Factor_14,Factor_15,Factor_16,Factor_17,Factor_18,Factor_19,Factor_20,Factor_21,Factor_Total
GRG_GHM/14Z14,0.14845159121295257,0.16537889685628687,0.22710787680132355,0.181904916288401,0.22162366165289096,0.16001395537874727,0.0,0.12237476011821101,0.0,0.0,1.2268556583088133
GRG_GHM/07M12,0.19259696454087066,0.0,0.07347959214244261,0.05486686656624168,0.07717665494712475,0.062331099799658465,0.17327954049469135,0.2755151861852293,0.06337774719182108,0.2438394042398146,1.2164630561078944
GRG_GHM/07M06,0.11296436361166579,0.127964504387926,0.2097071986550558,0.12830154539409386,0.0,0.0,0.0,0.26333191907333436,0.18311284512380627,0.1470105315453927,1.1723929077912747
GRG_GHM/07M08,0.1648142028940543,0.2041483255707927,0.05100955905969846,0.3246188580563344,0.15009065916247066,0.06718088333912456,0.1536045253000472,0.0,0.0,0.015247633422971408,1.1307146468054938
GRG_GHM/07M13,0.1274088426962065,0.04985534581386098,0.06837803781399411,0.016609338996657393,0.10564867062791562,0.14784818409052622,0.12059422104508467,0.14234615767591804,0.0785757954046957,0.14077809505553734,0.9980426892203966
GRG_GHM/06M09,0.13807971759799886,0.16117844652632418,0.10756967274531198,0.18604523521430033,0.0426229634784992,0.0,0.011569668415825898,0.12511977482169928,0.0,0.20610917529977205,0.9782946540997318
GRG_GHM/05K10,0.0,0.0,0.0,0.127507179590212,0.0,0.16307014805146736,0.2415465623429377,0.0067838993402269555,0.34490372276621195,0.0,0.8838115120910559
GRG_GHM/07K06,,,0.0,0.09058682080630308,0.18307289632954069,0.21448648209095642,0.0,0.24484789874979382,0.01854254811857295,0.12801801791615258,0.8795546640113194
GRG_GHM/06K04,0.13502431019264394,0.029851874455831224,0.18577549842304694,0.011036242064496058,0.03162192348146858,0.0,0.042492941159855926,0.0,0.33433554181924663,0.0690855694293027,0.839223901025892
GRG_GHM/06K02,0.030572439549496684,0.19402744638634467,0.12163758269271382,0.1812333210290319,0.13923513103942448,0.0,0.008819197729557722,0.012801309105698664,0.019619625730809057,0.056301913410988294,0.7642479666740655
GRG_GHM/02C05,0.1661836336549073,0.03279667189006964,0.04488611728010738,0.14853193499953413,0.16264061155234336,0.0,0.0,0.1991205738409234,0.0,0.0024468469298664515,0.7566063901477516
GRG_GHM/23M14,0.011961240979328387,0.13109966410792193,0.0,0.10467838215258538,0.0609558643945004,0.0,0.0,0.020019434480195435,0.061810637311566344,0.11277860128585054,0.5033038247119483
GRG_GHM/07M02,0.0,0.14390705441315083,0.0,0.0,0.0,0.12904260874390378,0.1347981240886042,0.0,0.011566797010060652,0.07829894619597709,0.49761353045169654
GRG_GHM/23M20,0.1838885663460768,0.060711156556103,0.0458406222506611,0.04710098500388056,0.07119650518793547,0.0,0.006917468578152572,0.0,0.0,0.012362263435846189,0.42801756735865565
GRG_GHM/28Z17,0.035919934781394824,0.034618619279653665,0.03194314948253676,0.06395510258810999,0.01348117430590516,0.06526075075722185,0.004268239488960763,0.050648362703127225,0.006069382533467236,0.08805734773238914,0.3942220636527666
GRG_GHM/06M04,0.15938505227121993,0.0,0.062175799968751826,0.0,0.0,0.06856058989889052,0.07927235386837449,0.0,0.0,0.0,0.36939379600723676
GRG_GHM/07M04,0.12801821451957696,0.02991465635435119,0.05799518487621849,0.0,0.03152598480118339,0.0,0.10808332372700692,0.0,0.0,0.0,0.35553736427833693
GRG_GHM/13C07,0.0,0.0,0.0,0.0,0.0,0.0,0.0,0.0,0.29878594341772585,0.0,0.29878594341772585
GRG_GHM/13C16,0.0,0.0,0.08296514132802191,0.0,0.0,0.08175458016599872,0.0,0.13348747856563417,0.0,0.0,0.29820720005965484
GRG_GHM/07C09,0.07828517799802467,0.21526290389540662,0.0,0.0,0.0,0.0,0.0,0.0,0.0,0.0,0.2935480818934313
GRG_GHM/28Z23,0.0,0.023909049896505077,0.0,0.052993658297933136,0.011063361946898411,0.0,0.0,0.012609883139126376,0.13556729642606313,0.0456173289688942,0.28176057867542037
GRG_GHM/17M06,0.0,0.06910463489129982,0.0878512046872655,0.06935761541293489,0.0,0.0,0.0,0.0,0.05492851379531998,0.0,0.2812419687868202
GRG_GHM/14C08,0.2190997850499018,0.0,0.001355912658640904,0.0,0.0431389552369602,0.0,0.0,0.014882475376458601,0.0,0.0,0.2784771283219615
GRG_GHM/07M14,0.004647089443999101,0.01825207618522429,0.04876337706698595,0.05135860119367285,0.04863951930783927,0.03210070435139396,0.006210444929408769,0.0,0.052572218962761624,0.01484188209294669,0.27738591353423253
GRG_GHM/07M09,0.1275941361139253,0.14373597633754373,0.0,0.0,0.0,0.0,0.0,0.0,0.0,0.0,0.27133011245146904
GRG_GHM/28Z11,0.09878747473963226,0.0,0.04470505933941833,0.0,0.0,0.0,0.048092974333593726,0.0,0.0,0.0685621925130784,0.2601477009257227
GRG_GHM/27C02,0.0,0.0,0.0,0.0,0.07606352418158387,0.18103835735151946,0.0,0.0,0.0,0.0,0.2571018815331033
GRG_GHM/05K06,0.0,0.0,0.0,0.0,0.0,0.0,0.10558821523107717,0.0,0.0,0.13230434011620335,0.23789255534728052
GRG_GHM/07M07,0.0,0.0,0.0,0.1296806380602437,0.05010053212657637,0.0,0.0,0.0,0.0,0.045994874778230235,0.22577604496505033
GRG_GHM/11M04,0.0,0.0,0.0,0.0041069942286426605,0.03241146923797493,0.0,0.0,0.17062606883490536,0.0,0.0,0.20714453230152297
