Var,Factor_2012,Factor_13,Factor_14,Factor_15,Factor_16,Factor_17,Factor_18,Factor_19,Factor_20,Factor_21,Factor_Total
UCD_UCD_COD/0000009402852,,,0.2862087390154604,,,,,,,,0.2862087390154604
UCD_UCD_COD/3400894078036,,,,0.016118453528726283,0.10861181426594005,0.04594083197059192,0.03374455949330022,0.0430461354000744,0.028631525054328557,0.002846862946099132,0.27894018265906056
UCD_UCD_COD/0000009290502,0.2375,,,,,,,,,,0.2375
UCD_UCD_COD/0000009403082,,,0.2237089704794702,,,,,,,,0.2237089704794702
UCD_UCD_COD/3400894554462,,,,,,,,,0.09363171445745078,0.04569981379544091,0.1393315282528917
UCD_UCD_COD/3400894094524,,,,0.10072617455538167,0.03507078748317295,0.0,,,,,0.13579696203855462
UCD_UCD_COD/3400894057444,,,,0.08895198083026526,,,,,,,0.08895198083026526
UCD_UCD_COD/3400894312628,,,,,,,,,0.07669995748229788,0.003561379932729691,0.08026133741502757
UCD_UCD_COD/3400893507308,,,,0.028409662542758406,0.05054699727432519,0.0,,,,,0.0789566598170836
UCD_UCD_COD/3400894030829,,,,0.016289470730174456,0.037892882752060604,0.018164110002644937,0.0,,,,0.07234646348488
UCD_UCD_COD/3400894178941,,,,,0.0,0.07024457386342596,0.0,0.0,0.0,0.0,0.07024457386342596
UCD_UCD_COD/0000009350730,0.0,0.0,0.06590046645041828,,,,,,,,0.06590046645041828
UCD_UCD_COD/0000009385102,,0.06026733497925387,,,,,,,,,0.06026733497925387
UCD_UCD_COD/3400894138389,,,,,0.04331570357890117,0.015626349046287527,,,,,0.058942052625188694
UCD_UCD_COD/3400893964651,,,,,0.05889568070671058,,,,,,0.05889568070671058
UCD_UCD_COD/0000009295994,6.3606527452482924e-18,0.01321493384389886,0.04495873268937655,,,,,,,,0.058173666533275416
UCD_UCD_COD/0000009382598,,,0.05787127798071548,,,,,,,,0.05787127798071548
UCD_UCD_COD/3400894011088,,,,0.04964397159592501,,,,,,,0.04964397159592501
UCD_UCD_COD/3400893825983,,,,0.0,,0.0,0.0,0.04714838041686593,0.0,0.0,0.04714838041686593
UCD_UCD_COD/3400894178712,,,,,0.0,0.0,0.003453713982683451,0.04347018124378175,,,0.0469238952264652
UCD_UCD_COD/3400894293194,,,,,,,0.046242882223484424,,,,0.046242882223484424
UCD_UCD_COD/3400890015776,,,,,,,,,,0.04182680791846096,0.04182680791846096
UCD_UCD_COD/3400894307365,,,,,,,0.0,0.0,0.04008764882417068,0.0,0.04008764882417068
UCD_UCD_COD/3400893740736,,,,,,,,,0.02873114340512925,,0.02873114340512925
UCD_UCD_COD/3400894088370,,,,,,0.02453844368073604,,,,,0.02453844368073604
UCD_UCD_COD/3400890017039,,,,,,,,,,0.01645195308187421,0.01645195308187421
UCD_UCD_COD/3400894095354,,,,0.0,0.01532133062221601,0.0,,,,,0.01532133062221601
UCD_UCD_COD/0000009398211,,,0.015146104683301126,,,,,,,,0.015146104683301126
UCD_UCD_COD/3400894428343,,,,,,,,,0.0,0.006919792503701448,0.006919792503701448
UCD_UCD_COD/3400894094692,,,,8.081770546903713e-17,0.0,0.006235570629911192,,,,,0.006235570629911273
