Var,Factor_2012,Factor_13,Factor_14,Factor_15,Factor_16,Factor_17,Factor_18,Factor_19,Factor_20,Factor_21,Factor_22,Factor_Total
CAM_PRS_IDE/PCQM001,0.0,0.0,0.0,0.0,0.0,0.10883736700491638,0.0,0.01663698780644457,0.0,0.20678968719365173,0.0,0.3322640420050127
CAM_PRS_IDE/ZCQJ004,0.0,0.0,0.0,0.0,0.08237458267464842,0.021136745593450936,0.0,0.018243112605420768,0.1082736172732733,0.0,0.0889526421933355,0.31898070034012893
CAM_PRS_IDE/DEQP003,0.10155910038950178,0.10515488239367042,0.0,0.051452755349649756,0.0,0.016528048329475208,0.004947623317428992,0.0,0.0,0.0,0.021167341508217773,0.3008097512879439
CAM_PRS_IDE/BLQP010,0.0,0.0,0.0,0.0,0.0,0.0,0.042482566539442185,0.10166245691093562,0.054008554919370455,0.0,0.07131159761496096,0.2694651759847092
CAM_PRS_IDE/QEQM001,0.1444905500033695,0.10097056941295739,0.0,0.0,0.0,0.0,0.0,0.0,0.0,0.0,0.0,0.24546111941632687
CAM_PRS_IDE/HLQM002,0.0,0.0,0.0,0.05949700150267446,0.0,0.0,0.02455081209947969,0.03519986086597094,0.11831666567338375,0.0,0.0,0.23756434014150885
CAM_PRS_IDE/ZCQM001,0.0,0.0,0.0,0.0,0.0,0.0,0.04825725684766857,0.08220250771392419,0.0,0.0,0.10422707347591438,0.23468683803750712
CAM_PRS_IDE/BJQP002,0.0,0.0,0.06800895635568589,0.0,0.05557674097257819,0.0,0.0,0.0,0.0,0.0,0.09760555558191213,0.22119125291017622
CAM_PRS_IDE/HBQK002,0.0,0.0,0.0,0.0,0.16875357349352718,0.0,0.043866350695747534,0.0,0.0,0.0,0.0,0.21261992418927472
CAM_PRS_IDE/GLQP002,0.0,0.0,0.0,0.0,0.09762404440561696,0.0,0.049963444327386045,0.0,0.0,0.0,0.05440072313810367,0.2019882118711067
CAM_PRS_IDE/ZCQM006,0.0,0.05836963810946075,0.033575282185752134,0.009755549417735791,0.02143715139178744,0.020947468442103042,0.0,0.0,0.0,0.0,0.051611524302663685,0.19569661384950285
CAM_PRS_IDE/BGQP002,0.0,0.02815185646430509,0.0,0.06494226483889291,0.045988427010582984,0.02222677411458267,0.0,0.0,0.0,0.013605046573741812,0.0,0.17491436900210547
CAM_PRS_IDE/HBMD038,,,0.0,0.0,0.0,0.055910681521586,0.021353505026561508,0.04025986642678212,0.009760077128031282,0.040662817583633624,0.00015313793152004648,0.1681000856181146
CAM_PRS_IDE/ZCQM005,0.0,0.0,0.0,0.031081551319308263,0.0,0.01563160200563452,0.021019350922359605,0.05234658435814627,0.0451459346193623,0.0,0.0,0.16522502322481097
CAM_PRS_IDE/BGQP007,0.023659752728148145,0.029875372788037508,0.03747947304282923,0.016266061578394737,0.0,0.007940679953331906,0.0,0.025041177056653877,0.02086350162692187,0.00221107034985607,0.0,0.16333708912417336
CAM_PRS_IDE/ZZQH033,0.0,0.0,0.0,0.0,0.0,0.0,0.0,0.14947688236730353,0.0,0.013850921939304508,0.0,0.16332780430660804
CAM_PRS_IDE/NZQN001,0.0,0.14847232818519207,0.0,0.0,0.0,0.0,0.0,0.0,0.0,0.0,0.0,0.14847232818519207
CAM_PRS_IDE/BZQP002,0.1111460083818807,0.0,0.0,0.0,0.0,0.0,0.0,0.030348967458960447,0.0,0.0,0.0,0.14149497584084114
CAM_PRS_IDE/HBQK389,,,0.0,0.005193505284152138,0.09765879786051436,0.004049485458818372,0.0,0.0,0.02527453070009463,0.00601159893471689,0.0,0.1381879182382964
CAM_PRS_IDE/ZCQM008,0.09465566926742101,0.03718206971245646,0.0,0.0,0.0,0.0,0.0,0.0,0.0,0.0,0.0,0.13183773897987747
CAM_PRS_IDE/ZCQM004,0.06113917621936796,0.0,0.0,0.0,0.0,0.0,0.03627142558667311,0.0,0.0,0.015676303067062334,0.0,0.1130869048731034
CAM_PRS_IDE/HBMD050,,,0.01687201598872083,0.052077751059616886,0.042303126264936916,0.0,0.0,0.0,0.0,0.0014205191865593863,0.0,0.11267341249983402
CAM_PRS_IDE/HBJD001,,,0.0,0.0,0.009455642594936878,0.05674273093726475,0.0,0.03492206712797972,0.0,0.0029971463867562607,0.0,0.10411758704693759
CAM_PRS_IDE/NFQK003,0.0,0.0,0.0,0.0,0.009966893120984824,0.0,0.0,0.0,0.0,0.0,0.08401646952187311,0.09398336264285793
CAM_PRS_IDE/ZCQJ006,0.0,0.0,0.0,0.0,0.0,0.0,0.0,0.0912659955542914,0.0,0.0,0.0,0.0912659955542914
CAM_PRS_IDE/DEQP005,0.0,0.0,0.0,0.0,0.0,0.0,0.0,0.0,0.0,0.0,0.0906928326740613,0.0906928326740613
CAM_PRS_IDE/CDQP002,0.0,0.0,0.0,0.0,0.0,0.08620174823740705,0.0,0.0,0.0,0.0,0.0,0.08620174823740705
CAM_PRS_IDE/DZQM006,0.0,0.0,0.0,0.0,0.0,0.0,0.0,0.0,0.0,0.08165694576707545,0.0,0.08165694576707545
CAM_PRS_IDE/HBMD049,,,0.020908718619829375,0.03186618740000002,0.0,0.0,0.0,0.015897717330000612,0.0,0.00891519293088989,0.0,0.07758781628071991
CAM_PRS_IDE/HBMD054,,,0.0,0.02011583322418517,0.018461642522180098,0.03878777881620977,0.0,0.0,0.0,0.0,0.0,0.07736525456257504
