Var,Factor_2012,Factor_13,Factor_14,Factor_15,Factor_16,Factor_17,Factor_18,Factor_19,Factor_20,Factor_21,Factor_Total
DGN_PAL/C220,0.04243865670119041,0.08001378913113474,0.10283999613354057,0.1163377330318837,0.08613278275940046,0.13105650807762784,0.09884710865588464,0.08971104930637482,0.13401438349190845,0.1072969709764158,0.9886889782653614
DGN_PAL/I982,0.06142929728641898,0.06343226581694127,0.09559965737139205,0.12002201874021654,0.05016197525261783,0.08215091107411368,0.06969813421109049,0.052765504176064404,0.06651878053927675,0.03762488396687103,0.699403428435003
DGN_PAL/K746,0.1163418901368422,0.14019210830882425,0.08764177473427306,0.09990220259301795,0.08915555212232834,0.0,0.02660175583165801,0.0476240611829751,0.0,0.0,0.6074593449099189
DGN_PAL/I859,0.07919243083238826,0.09153871320830581,0.09285279245132373,0.0640538104887823,0.0,0.0,0.0,0.0,0.0,0.0,0.32763774698080006
DGN_REL/C220,0.0,0.011397587507366393,0.03197700560035297,0.036831747408373645,0.04614277154660509,0.04036221959932447,0.0,0.03483751078898315,0.014252991131534611,0.03911625295837956,0.25491808654091985
DGN_REL/K746,0.04961811314327127,0.04066956287545608,0.06213216809508681,0.06301130887466506,0.0,0.0,0.0,0.0,0.0,0.0035136156184969727,0.21894476860697618
DGN_PAL/R18,0.0014717982025437425,0.0005519347661784032,0.0281687935466394,0.007284698291888657,0.018484241892076068,0.025293830607001605,0.02171279022405962,0.007609103120590686,0.014587638412300047,0.02978864975173646,0.15495347881501467
DGN_PAL/Z092,0.0,0.05232984027258144,0.04611296960649323,0.03769124428980415,0.0,0.0,0.0,0.0,0.0,0.0,0.1361340541688788
DGN_PAL/Z098,0.0,0.0,0.030486646741068036,0.0,0.03327503687301347,0.0369498118244006,0.0028342068179648774,0.0,0.007391569882215042,0.013653568658958304,0.12459084079762034
DGN_PAL/Z944,0.010449081390170038,0.0,0.0,0.0,0.02413792918350393,0.0,0.024394822488746505,0.0,0.0,0.0,0.058981833062420476
DGN_PAL/Z511,0.013686131946484983,0.012693211262554302,0.0,0.0018603643852290643,0.005422030885332435,0.0031048829750007765,0.0,0.003326587135881569,0.0007669075585320117,0.007959108841974713,0.048819224990989854
DGN_REL/C349,0.0,0.004113773159055598,0.0,0.0,0.0,0.003895225648100333,0.0063493175514332,0.003754585479904768,0.0039990899162688194,0.011123840885929074,0.03323583264069179
DGN_REL/B182,0.0,0.0,0.0,0.02843898805011064,0.0,0.0,0.0,0.0,0.0,0.0,0.02843898805011064
DGN_PAL/Z5101,0.003201948388942144,0.0026731744736146696,0.0,0.0011932510427306513,0.0004946169765225908,0.0,0.006731340403459127,0.0007067195701915168,0.0011669071624575984,0.012261218588018166,0.028429176605936465
DGN_REL/C509,0.0035534512541077414,0.0,0.0,0.0035383553272760083,0.0023855587323979646,0.0,0.0,0.0,0.0031259632213098084,0.013810135786104766,0.02641346432119629
DGN_REL/N185,0.0023648433997907835,0.0,0.001908111169784898,0.0017258812720440167,0.001373385347480469,0.0012188956587076809,0.0028298139449305835,0.0009998403580530415,0.0019446256322688958,0.002411621146464893,0.016777017929525264
DGN_REL/C504,0.0,0.0,0.0,0.0,0.005609531590365856,0.0,0.0,0.010662267401035354,0.0,0.0,0.016271798991401208
DGN_REL/F102,0.0,0.0,0.0,0.0009567690931519437,0.014385401177395802,0.0,0.0,0.0,0.0,0.0,0.015342170270547746
DGN_PAL/Z491,0.0007776731991817704,0.0006045886126536431,0.0020554730838591396,0.0008661155560760449,0.0016495805444639254,0.0011634235269341153,0.001756976819398963,0.0016364433338229014,0.0019552414763829265,0.0022105660134837534,0.014676082166257182
DGN_PAL/Z097,0.0,0.0,0.0,0.0,0.007633436937994747,0.0,0.00455680795423908,0.0,0.0,0.0,0.012190244892233828
DGN_REL/C61,0.0027905199355773543,0.0014517325059235954,0.0,0.0050392095135755625,0.0,0.0028237562803489894,0.0,0.0,0.0,0.0,0.012105218235425501
DGN_REL/C341,0.0,0.0,0.0,0.0,0.0,0.0,0.011045559265885326,0.0,0.0,0.0,0.011045559265885326
DGN_REL/C211,0.005955274561724125,0.0,,0.0,0.0,0.0033596993349699765,,0.0,0.0,0.0,0.009314973896694102
DGN_REL/N189,0.0010122512887669832,0.0,0.0060408192321022855,0.0,0.0,0.0,0.0015763155783979198,0.0,0.0,0.0,0.008629386099267188
DGN_PAL/J90,0.0,0.0020259840623029126,0.0,0.0013010208323317779,0.003769150943981511,0.0,0.0,0.0,0.0,0.0,0.007096155838616202
DGN_PAL/Z512,0.0,0.0,0.0,0.0010026294138186817,0.0,0.0036286372282457176,0.0,0.0,0.0,0.0,0.004631266642064399
DGN_REL/L97,0.0,0.0,0.004245835475443413,0.0,0.0,0.0,0.0,0.0,0.0,0.0,0.004245835475443413
DGN_REL/C775,,,0.0037799646305199546,,,,,,,0.0,0.0037799646305199546
DGN_REL/C109,,0.0,0.0,0.0,0.003724783893241578,0.0,0.0,0.0,0.0,0.0,0.003724783893241578
DGN_PAL/K720,0.0,0.0,0.0,0.0,0.0,0.0032528351841816143,0.0,0.0,0.0,0.0,0.0032528351841816143
