{
   "settings": {
            "number_of_shards": 1,
            "number_of_replicas": 0,
            "max_ngram_diff" : "20",
            "analysis": {
                "filter": {
                    "substring_filter": {
                        "type":     "ngram",
                        "min_gram": 1,
                        "max_gram": 20
                      } },
                "analyzer": {
                    "substring": {
                        "type": "custom",
                        "tokenizer": "icu_tokenizer",
                        "filter": [
                            "lowercase",
                            "substring_filter",
                            "icu_folding"
                        ] }
                    } }
                } }
