PFS_SPE_COD;PFS_SPE_LIB;PFS_SPE_STA;SPE_STA_LIB;PFS_SPE_POS;SPE_POS_LIB;PFS_SPE_OMS;SPE_OMS_LIB;PFS_SPE_TDM;SPE_TDM_LIB;PFS_CAT_COD;PFS_CAT_LIB
10;NEUROCHIRURGIE;1;MEDECINS OMNIPRATICIENS;2;MEDECINS SPECIALISTES;2;MEDECINS SPECIALISTES;1;MEDECIN;1;MEDECIN
11;OTO RHINO-LARYNGOLOGIE;1;MEDECINS OMNIPRATICIENS;2;MEDECINS SPECIALISTES;2;MEDECINS SPECIALISTES;1;MEDECIN;1;MEDECIN
12;PEDIATRIE;1;MEDECINS OMNIPRATICIENS;2;MEDECINS SPECIALISTES;2;MEDECINS SPECIALISTES;1;MEDECIN;1;MEDECIN
13;PNEUMOLOGIE;1;MEDECINS OMNIPRATICIENS;2;MEDECINS SPECIALISTES;2;MEDECINS SPECIALISTES;1;MEDECIN;1;MEDECIN
14;RHUMATOLOGIE;1;MEDECINS OMNIPRATICIENS;2;MEDECINS SPECIALISTES;2;MEDECINS SPECIALISTES;1;MEDECIN;1;MEDECIN
15;OPHTALMOLOGIE;1;MEDECINS OMNIPRATICIENS;2;MEDECINS SPECIALISTES;2;MEDECINS SPECIALISTES;1;MEDECIN;1;MEDECIN
16;CHIRURGIE UROLOGIQUE;1;MEDECINS OMNIPRATICIENS;2;MEDECINS SPECIALISTES;2;MEDECINS SPECIALISTES;1;MEDECIN;1;MEDECIN
17;NEUROPSYCHIATRIE;1;MEDECINS OMNIPRATICIENS;3;PSYCHIATRES, NEUROPSYCHIATRES;2;MEDECINS SPECIALISTES;1;MEDECIN;1;MEDECIN
18;STOMATOLOGIE;1;MEDECINS OMNIPRATICIENS;2;MEDECINS SPECIALISTES;2;MEDECINS SPECIALISTES;1;MEDECIN;1;MEDECIN
20;REANIMATION INTENSIVE MEDICALE;1;MEDECINS OMNIPRATICIENS;2;MEDECINS SPECIALISTES;2;MEDECINS SPECIALISTES;1;MEDECIN;1;MEDECIN
22;SPECIALISTE EN MEDECINE GENERALE AVEC DIPLÔME;1;MEDECINS OMNIPRATICIENS;1;MEDECINS OMNIPRATICIENS;1;MEDECINS OMNIPRATICIENS;1;MEDECIN;1;MEDECIN
23;SPECIALITE EN MED. GENERALE RECONNUE PAR L'ORDRE;1;MEDECINS OMNIPRATICIENS;1;MEDECINS OMNIPRATICIENS;1;MEDECINS OMNIPRATICIENS;1;MEDECIN;1;MEDECIN
31;MEDECINE PHYSIQUE ET DE READAPTATION;1;MEDECINS OMNIPRATICIENS;2;MEDECINS SPECIALISTES;2;MEDECINS SPECIALISTES;1;MEDECIN;1;MEDECIN
32;NEUROLOGIE;1;MEDECINS OMNIPRATICIENS;3;PSYCHIATRES, NEUROPSYCHIATRES;2;MEDECINS SPECIALISTES;1;MEDECIN;1;MEDECIN
33;PSYCHIATRIE GENERALE;1;MEDECINS OMNIPRATICIENS;3;PSYCHIATRES, NEUROPSYCHIATRES;2;MEDECINS SPECIALISTES;1;MEDECIN;1;MEDECIN
34;GERIATRIE;1;MEDECINS OMNIPRATICIENS;2;MEDECINS SPECIALISTES;2;MEDECINS SPECIALISTES;1;MEDECIN;1;MEDECIN
35;NEPHROLOGIE;1;MEDECINS OMNIPRATICIENS;2;MEDECINS SPECIALISTES;2;MEDECINS SPECIALISTES;1;MEDECIN;1;MEDECIN
36;CHIRURGIE DENTAIRE (SPECIALISTE O.D.F.);4;DENTISTES;5;DENTISTES;5;DENTISTES;4;DENTISTE;4;DENTISTE (EX : SPECIALISTE O.D.F.)
37;ANATOMIE-CYTOLOGIE-PATHOLOGIQUE;1;MEDECINS OMNIPRATICIENS;2;MEDECINS SPECIALISTES;2;MEDECINS SPECIALISTES;1;MEDECIN;1;MEDECIN
38;DIRECTEUR LABORATOIRE MEDECIN;1;MEDECINS OMNIPRATICIENS;2;MEDECINS SPECIALISTES;2;MEDECINS SPECIALISTES;1;MEDECIN;1;MEDECIN
41;CHIRURGIE ORTHOPEDIQUE ET TRAUMATOLOGIE;1;MEDECINS OMNIPRATICIENS;2;MEDECINS SPECIALISTES;2;MEDECINS SPECIALISTES;1;MEDECIN;1;MEDECIN
42;ENDOCRINOLOGIE ET METABOLISMES;1;MEDECINS OMNIPRATICIENS;2;MEDECINS SPECIALISTES;2;MEDECINS SPECIALISTES;1;MEDECIN;1;MEDECIN
43;CHIRURGIE INFANTILE;1;MEDECINS OMNIPRATICIENS;2;MEDECINS SPECIALISTES;2;MEDECINS SPECIALISTES;1;MEDECIN;1;MEDECIN
44;CHIRURGIE MAXILLO-FACIALE;1;MEDECINS OMNIPRATICIENS;2;MEDECINS SPECIALISTES;2;MEDECINS SPECIALISTES;1;MEDECIN;1;MEDECIN
45;CHIRURGIE MAXILLO-FACIALE ET STOMATOLOGIE;1;MEDECINS OMNIPRATICIENS;2;MEDECINS SPECIALISTES;2;MEDECINS SPECIALISTES;1;MEDECIN;1;MEDECIN
46;CHIRURGIE PLASTIQUE RECONSTRUCTRICE  ET ESTHETIQUE;1;MEDECINS OMNIPRATICIENS;2;MEDECINS SPECIALISTES;2;MEDECINS SPECIALISTES;1;MEDECIN;1;MEDECIN
47;CHIRURGIE THORACIQUE ET CARDIO-VASCULAIRE;1;MEDECINS OMNIPRATICIENS;2;MEDECINS SPECIALISTES;2;MEDECINS SPECIALISTES;1;MEDECIN;1;MEDECIN
48;CHIRURGIE VASCULAIRE;1;MEDECINS OMNIPRATICIENS;2;MEDECINS SPECIALISTES;2;MEDECINS SPECIALISTES;1;MEDECIN;1;MEDECIN
49;CHIRURGIE VISCERALE ET DIGESTIVE;1;MEDECINS OMNIPRATICIENS;2;MEDECINS SPECIALISTES;2;MEDECINS SPECIALISTES;1;MEDECIN;1;MEDECIN
69;CHIRURGIE ORALE;1;MEDECINS OMNIPRATICIENS;2;MEDECINS SPECIALISTES;2;MEDECINS SPECIALISTES;1;MEDECIN;1;MEDECIN
70;GYNECOLOGIE MEDICALE;1;MEDECINS OMNIPRATICIENS;2;MEDECINS SPECIALISTES;2;MEDECINS SPECIALISTES;1;MEDECIN;1;MEDECIN
71;HEMATOLOGIE;1;MEDECINS OMNIPRATICIENS;2;MEDECINS SPECIALISTES;2;MEDECINS SPECIALISTES;1;MEDECIN;1;MEDECIN
72;MEDECINE NUCLEAIRE;1;MEDECINS OMNIPRATICIENS;2;MEDECINS SPECIALISTES;2;MEDECINS SPECIALISTES;1;MEDECIN;1;MEDECIN
73;ONCOLOGIE MEDICALE;1;MEDECINS OMNIPRATICIENS;2;MEDECINS SPECIALISTES;2;MEDECINS SPECIALISTES;1;MEDECIN;1;MEDECIN
74;ONCOLOGIE RADIOTHERAPIQUE;1;MEDECINS OMNIPRATICIENS;2;MEDECINS SPECIALISTES;2;MEDECINS SPECIALISTES;1;MEDECIN;1;MEDECIN
75;PSYCHIATRIE DE L ENFANT ET DE L ADOLESCENT;1;MEDECINS OMNIPRATICIENS;3;PSYCHIATRES, NEUROPSYCHIATRES;2;MEDECINS SPECIALISTES;1;MEDECIN;1;MEDECIN
76;RADIOTHERAPIE;1;MEDECINS OMNIPRATICIENS;2;MEDECINS SPECIALISTES;2;MEDECINS SPECIALISTES;1;MEDECIN;1;MEDECIN
77;OBSTETRIQUE;1;MEDECINS OMNIPRATICIENS;2;MEDECINS SPECIALISTES;2;MEDECINS SPECIALISTES;1;MEDECIN;1;MEDECIN
78;GENETIQUE MEDICALE;1;MEDECINS OMNIPRATICIENS;2;MEDECINS SPECIALISTES;2;MEDECINS SPECIALISTES;1;MEDECIN;1;MEDECIN
79;GYNECOLOGIE OBSTETRIQUE ET GYNECOLOGIE MEDICALE;1;MEDECINS OMNIPRATICIENS;2;MEDECINS SPECIALISTES;2;MEDECINS SPECIALISTES;1;MEDECIN;1;MEDECIN
80;SANTE PUBLIQUE ET MEDECINE SOCIALE;1;MEDECINS OMNIPRATICIENS;2;MEDECINS SPECIALISTES;2;MEDECINS SPECIALISTES;1;MEDECIN;1;MEDECIN
81;MEDECINE DES MALADIES INFECTIEUSES ET TROPICALES;1;MEDECINS OMNIPRATICIENS;2;MEDECINS SPECIALISTES;2;MEDECINS SPECIALISTES;1;MEDECIN;1;MEDECIN
82;MEDECINE LEGALE ET EXPERTISES MEDICALES;1;MEDECINS OMNIPRATICIENS;2;MEDECINS SPECIALISTES;2;MEDECINS SPECIALISTES;1;MEDECIN;1;MEDECIN
83;MEDECINE D'URGENCE;1;MEDECINS OMNIPRATICIENS;2;MEDECINS SPECIALISTES;2;MEDECINS SPECIALISTES;1;MEDECIN;1;MEDECIN
84;MEDECINE VASCULAIRE;1;MEDECINS OMNIPRATICIENS;2;MEDECINS SPECIALISTES;2;MEDECINS SPECIALISTES;1;MEDECIN;1;MEDECIN
85;ALLERGOLOGIE;1;MEDECINS OMNIPRATICIENS;2;MEDECINS SPECIALISTES;2;MEDECINS SPECIALISTES;1;MEDECIN;1;MEDECIN
99;NON RENSEIGNE;9;VALEUR INCONNUE;0;NON RENSEIGNE;0;NON RENSEIGNE;99;VALEUR INCONNUE;9;ORTHOPTISTE - ORTHOPHONISTE
0;NON RENSEIGNE;9;VALEUR INCONNUE;0;NON RENSEIGNE;0;NON RENSEIGNE;99;VALEUR INCONNUE;9;ORTHOPTISTE - ORTHOPHONISTE
1;MEDECINE GENERALE;1;MEDECINS OMNIPRATICIENS;1;MEDECINS OMNIPRATICIENS;1;MEDECINS OMNIPRATICIENS;1;MEDECIN;1;MEDECIN
2;ANESTHESIOLOGIE - REANIMATION CHIRURGICALE;1;MEDECINS OMNIPRATICIENS;2;MEDECINS SPECIALISTES;2;MEDECINS SPECIALISTES;1;MEDECIN;1;MEDECIN
3;PATHOLOGIE CARDIO-VASCULAIRE;1;MEDECINS OMNIPRATICIENS;2;MEDECINS SPECIALISTES;2;MEDECINS SPECIALISTES;1;MEDECIN;1;MEDECIN
4;CHIRURGIE GENERALE;1;MEDECINS OMNIPRATICIENS;2;MEDECINS SPECIALISTES;2;MEDECINS SPECIALISTES;1;MEDECIN;1;MEDECIN
5;DERMATOLOGIE ET VENEROLOGIE;1;MEDECINS OMNIPRATICIENS;2;MEDECINS SPECIALISTES;2;MEDECINS SPECIALISTES;1;MEDECIN;1;MEDECIN
6;RADIODIAGNOSTIC ET IMAGERIE MEDICALE;1;MEDECINS OMNIPRATICIENS;2;MEDECINS SPECIALISTES;2;MEDECINS SPECIALISTES;1;MEDECIN;1;MEDECIN
7;GYNECOLOGIE OBSTETRIQUE;1;MEDECINS OMNIPRATICIENS;2;MEDECINS SPECIALISTES;2;MEDECINS SPECIALISTES;1;MEDECIN;1;MEDECIN
8;GASTRO-ENTEROLOGIE ET HEPATOLOGIE;1;MEDECINS OMNIPRATICIENS;2;MEDECINS SPECIALISTES;2;MEDECINS SPECIALISTES;1;MEDECIN;1;MEDECIN
9;MEDECINE INTERNE;1;MEDECINS OMNIPRATICIENS;2;MEDECINS SPECIALISTES;2;MEDECINS SPECIALISTES;1;MEDECIN;1;MEDECIN
