CAT_PC1_CH1;CH1_PC1_LIB;TEC_COL
01;AGRICULTEURS EXPLOITANTS;0
02;ARTISANS, COMMERCANTS ET CHEFS D'ENTREPRISE;0
03;CADRES ET PROFESSIONS INTELLECTUELLES SUPERIEURES;0
04;PROFESSIONS INTERMEDIAIRES;0
05;EMPLOYES;0
06;OUVRIERS;0
07;RETRAITES;0
08;AUTRES PERSONNES SANS ACTIVITE PROFESSIONNELLE;0
