MTM_NAT;MTM_LIB;TEC_COL
0;SANS OBJET;0
1;BENEFICIAIRES DE L'ALLOCATION DE SOLIDARITE AUX PERSONNES AGEES OU DE L'ALLOCATION SUPPLEMENTAIRE D'INVALIDITE;0
2;REGIME LOCAL ALSACE MOSELLE;0
3;REGIME LOCAL FRONTALIER;0
4;REGIME LOCAL ET FONDS NATIONAL DE SOLIDARITE;0
5;SOINS A L ETRANGER (REGIME MILITAIRE);0
9;VALEUR INCONNUE;1
