{
  "stats": {
    "suites": 3,
    "tests": 21,
    "passes": 20,
    "pending": 0,
    "failures": 1,
    "start": "2021-01-07T15:20:28.003Z",
    "end": "2021-01-07T15:23:06.589Z",
    "duration": 158586,
    "testsRegistered": 21,
    "passPercent": 95.23809523809523,
    "pendingPercent": 0,
    "other": 0,
    "hasOther": false,
    "skipped": 0,
    "hasSkipped": false
  },
  "results": [
    {
      "uuid": "48fc9935-b09a-4076-9393-074518ca999c",
      "title": "",
      "fullFile": "",
      "file": "",
      "beforeHooks": [],
      "afterHooks": [],
      "tests": [],
      "suites": [
        {
          "uuid": "1c8928d1-23a1-447b-8249-34cfb6c4507a",
          "title": "Public dashboard loads and displays expected metrics",
          "fullFile": "/Users/robin.kavanagh@paconsulting.com/Documents/Git Home/selenium_framework/test/dashboardPage.test.js",
          "file": "/test/dashboardPage.test.js",
          "beforeHooks": [
            {
              "title": "\"before all\" hook in \"Public dashboard loads and displays expected metrics\"",
              "fullTitle": "Public dashboard loads and displays expected metrics \"before all\" hook in \"Public dashboard loads and displays expected metrics\"",
              "timedOut": false,
              "duration": 25908,
              "state": null,
              "speed": null,
              "pass": false,
              "fail": false,
              "pending": false,
              "context": null,
              "code": "page = new Page();\ndriver = page.driver;\npage.clearScreenshots(screenshotDirectory);\nawait page.visit(baseUrl);\nconst user = { ...users['USER'], password: process.env.USERGOOGLEPWD };\nawait page.login(user);\n// -- Commented out access to account dashboard until fixes applied --\n//await page.findAndOpenUserNavigationDropdown(false);\n//await page.clickNavigationLink('optDashboardSelector');\nawait page.clickNavigationLink('lnkPublicDashboardSelector');\nawait page.wait(5000);\nawait page.takeScreenshot('1. dashboard', screenshotDirectory);",
              "err": {},
              "uuid": "8f323cce-0bd4-470a-a0c6-5288f906473d",
              "parentUUID": "1c8928d1-23a1-447b-8249-34cfb6c4507a",
              "isHook": true,
              "skipped": false
            }
          ],
          "afterHooks": [
            {
              "title": "\"after all\" hook in \"Public dashboard loads and displays expected metrics\"",
              "fullTitle": "Public dashboard loads and displays expected metrics \"after all\" hook in \"Public dashboard loads and displays expected metrics\"",
              "timedOut": false,
              "duration": 57,
              "state": null,
              "speed": null,
              "pass": false,
              "fail": false,
              "pending": false,
              "context": null,
              "code": "await page.quit();",
              "err": {},
              "uuid": "53d57d98-cf70-4ed0-874f-9ff753a0b397",
              "parentUUID": "1c8928d1-23a1-447b-8249-34cfb6c4507a",
              "isHook": true,
              "skipped": false
            }
          ],
          "tests": [
            {
              "title": "Displays the total datasets",
              "fullTitle": "Public dashboard loads and displays expected metrics Displays the total datasets",
              "timedOut": false,
              "duration": 706,
              "state": "passed",
              "speed": "slow",
              "pass": true,
              "fail": false,
              "pending": false,
              "context": null,
              "code": "const result = await page.findDatasetsCount();\nawait page.takeScreenshot('2. total-datasets', screenshotDirectory);\nconsole.log(`Total datasets: ${result.labelText}`);\nexpect(result.labelDisplayed).to.equal(true);\nexpect(parseInt(result.labelText)).to.be.above(0);",
              "err": {},
              "uuid": "af842193-0bb9-486e-a32e-37848bb7f8f3",
              "parentUUID": "1c8928d1-23a1-447b-8249-34cfb6c4507a",
              "isHook": false,
              "skipped": false
            },
            {
              "title": "Displays the percentage of datasets with technical metadata",
              "fullTitle": "Public dashboard loads and displays expected metrics Displays the percentage of datasets with technical metadata",
              "timedOut": false,
              "duration": 725,
              "state": "passed",
              "speed": "slow",
              "pass": true,
              "fail": false,
              "pending": false,
              "context": null,
              "code": "const result = await page.findDatasetMetadataPercentage();\nawait page.takeScreenshot('3. percentage-datasets', screenshotDirectory);\nconsole.log(`Datasets with technical metadata: ${result.labelText}%`);\nexpect(result.labelDisplayed).to.equal(true);\nexpect(parseFloat(result.labelText)).to.be.above(0);",
              "err": {},
              "uuid": "8f676202-79c0-4207-8ab7-c1be2cecd0e9",
              "parentUUID": "1c8928d1-23a1-447b-8249-34cfb6c4507a",
              "isHook": false,
              "skipped": false
            },
            {
              "title": "Displays the number of users that have visited the site in the last month",
              "fullTitle": "Public dashboard loads and displays expected metrics Displays the number of users that have visited the site in the last month",
              "timedOut": false,
              "duration": 737,
              "state": "passed",
              "speed": "slow",
              "pass": true,
              "fail": false,
              "pending": false,
              "context": null,
              "code": "const result = await page.findUsersMonthlyCount();\nawait page.takeScreenshot('4. total-users', screenshotDirectory);\nconsole.log(`Users that have visited the site in the last month: ${result.labelText}`);\nexpect(result.labelDisplayed).to.equal(true);\nexpect(parseFloat(result.labelText)).to.be.above(-1);",
              "err": {},
              "uuid": "5d060db7-e8ec-42d4-9918-7c1606646491",
              "parentUUID": "1c8928d1-23a1-447b-8249-34cfb6c4507a",
              "isHook": false,
              "skipped": false
            },
            {
              "title": "Displays the percentage of new users that have registered in the last month",
              "fullTitle": "Public dashboard loads and displays expected metrics Displays the percentage of new users that have registered in the last month",
              "timedOut": false,
              "duration": 704,
              "state": "passed",
              "speed": "slow",
              "pass": true,
              "fail": false,
              "pending": false,
              "context": null,
              "code": "const result = await page.findUsersRegisteredPercentage();\nawait page.takeScreenshot('5. percentage-users', screenshotDirectory);\nconsole.log(`Percentage of visiting users who registered in the last month: ${result.labelText}%`);\nexpect(result.labelDisplayed).to.equal(true);\nexpect(parseFloat(result.labelText)).to.be.above(-1);",
              "err": {},
              "uuid": "0e2a13f4-41c8-4fa9-96cd-633d6739fa77",
              "parentUUID": "1c8928d1-23a1-447b-8249-34cfb6c4507a",
              "isHook": false,
              "skipped": false
            },
            {
              "title": "Displays the percentage of searches that returned results in the last month",
              "fullTitle": "Public dashboard loads and displays expected metrics Displays the percentage of searches that returned results in the last month",
              "timedOut": false,
              "duration": 687,
              "state": "passed",
              "speed": "slow",
              "pass": true,
              "fail": false,
              "pending": false,
              "context": null,
              "code": "const result = await page.findSearchResultsPercentage();\nawait page.takeScreenshot('6. percentage-searches', screenshotDirectory);\nconsole.log(`Percentage of searches returning results in the last month: ${result.labelText}%`);\nexpect(result.labelDisplayed).to.equal(true);\nexpect(parseFloat(result.labelText)).to.be.above(-1);",
              "err": {},
              "uuid": "5c5533e3-482b-423c-9382-6435a270a83c",
              "parentUUID": "1c8928d1-23a1-447b-8249-34cfb6c4507a",
              "isHook": false,
              "skipped": false
            },
            {
              "title": "Displays the number of new data access requests submitted in the last month",
              "fullTitle": "Public dashboard loads and displays expected metrics Displays the number of new data access requests submitted in the last month",
              "timedOut": false,
              "duration": 710,
              "state": "passed",
              "speed": "slow",
              "pass": true,
              "fail": false,
              "pending": false,
              "context": null,
              "code": "const result = await page.findNewDataAccessRequestCount();\nawait page.takeScreenshot('7. total-access-requests', screenshotDirectory);\nconsole.log(`Number of new data access requests in the last month: ${result.labelText}`);\nexpect(result.labelDisplayed).to.equal(true);\nexpect(parseFloat(result.labelText)).to.be.above(-1);",
              "err": {},
              "uuid": "b87478be-f75d-4499-87ad-41231cb15df0",
              "parentUUID": "1c8928d1-23a1-447b-8249-34cfb6c4507a",
              "isHook": false,
              "skipped": false
            },
            {
              "title": "Displays the percentage of uptime the Gateway has had in the last month",
              "fullTitle": "Public dashboard loads and displays expected metrics Displays the percentage of uptime the Gateway has had in the last month",
              "timedOut": false,
              "duration": 686,
              "state": "passed",
              "speed": "slow",
              "pass": true,
              "fail": false,
              "pending": false,
              "context": null,
              "code": "const result = await page.findGatewayUptimePercentage();\nawait page.takeScreenshot('8. percentage-uptime', screenshotDirectory);\nconsole.log(`Percentage of Gateway uptime in the last month: ${result.labelText}%`);\nexpect(result.labelDisplayed).to.equal(true);\nexpect(parseFloat(result.labelText)).to.be.above(0);",
              "err": {},
              "uuid": "3c88ac99-c086-4fc9-ae7a-b17665ea8935",
              "parentUUID": "1c8928d1-23a1-447b-8249-34cfb6c4507a",
              "isHook": false,
              "skipped": false
            },
            {
              "title": "Displays the date and time the metrics were last updated",
              "fullTitle": "Public dashboard loads and displays expected metrics Displays the date and time the metrics were last updated",
              "timedOut": false,
              "duration": 702,
              "state": "passed",
              "speed": "slow",
              "pass": true,
              "fail": false,
              "pending": false,
              "context": null,
              "code": "const result = await page.findMetricsLastUpdated();\nawait page.takeScreenshot('9. last-updated-metrics', screenshotDirectory);\nconsole.log(`Metrics label: ${result.labelText}`);\nexpect(result.labelDisplayed).to.equal(true);\nexpect(result.labelText).to.contain('Last updated');",
              "err": {},
              "uuid": "a71bbef6-0f23-4140-8eef-dda5f17cb1ae",
              "parentUUID": "1c8928d1-23a1-447b-8249-34cfb6c4507a",
              "isHook": false,
              "skipped": false
            },
            {
              "title": "Displays the most popular datasets by the number of access requests",
              "fullTitle": "Public dashboard loads and displays expected metrics Displays the most popular datasets by the number of access requests",
              "timedOut": false,
              "duration": 771,
              "state": "passed",
              "speed": "slow",
              "pass": true,
              "fail": false,
              "pending": false,
              "context": null,
              "code": "const result = await page.findPopularDatasets();\nawait page.takeScreenshot('10. popular-datasets', screenshotDirectory);\nconsole.log(`Most popular datasets:`);\nexpect(result.length).to.be.above(0);\nresult.forEach((dataset) => {\n\tconsole.log(`Dataset: ${dataset.datasetNameText} - Custodian: ${dataset.datasetCustodianNameText} - Access Requests: ${dataset.datasetCountText}`);\n\texpect(dataset.datasetNameText.length).to.be.above(0);\n\texpect(dataset.datasetCustodianNameText.length).to.be.above(0);\n\texpect(parseInt(dataset.datasetCountText)).to.be.above(0);\n\texpect(dataset.linkAlive).to.equal(true);\n});",
              "err": {},
              "uuid": "89ec0a10-9c9c-40f1-b672-2fc9e558ffa6",
              "parentUUID": "1c8928d1-23a1-447b-8249-34cfb6c4507a",
              "isHook": false,
              "skipped": false
            },
            {
              "title": "Displays the most popular searches performed by users",
              "fullTitle": "Public dashboard loads and displays expected metrics Displays the most popular searches performed by users",
              "timedOut": false,
              "duration": 1126,
              "state": "passed",
              "speed": "slow",
              "pass": true,
              "fail": false,
              "pending": false,
              "context": null,
              "code": "const result = await page.findPopularSearches();\nawait page.takeScreenshot('11. popular-searches', screenshotDirectory);\nconsole.log(`Most popular searches:`);\nexpect(result.length).to.be.above(0);\nresult.forEach((search) => {\n\tconsole.log(`Term: ${search.searchTermText} - Count: ${search.searchCountText} - Results: ${search.latestResultsText}`);\n\texpect(search.searchTermText.length).to.be.above(0);\n\texpect(search.latestResultsText.length).to.be.above(0);\n\texpect(parseInt(search.searchCountText)).to.be.above(0);\n\texpect(search.linkAlive).to.equal(true);\n});",
              "err": {},
              "uuid": "fdf1cc5f-40ed-4b50-b494-db362a2d53fa",
              "parentUUID": "1c8928d1-23a1-447b-8249-34cfb6c4507a",
              "isHook": false,
              "skipped": false
            },
            {
              "title": "Displays unmet demand searches for datasets by default where no results were returned from user searches",
              "fullTitle": "Public dashboard loads and displays expected metrics Displays unmet demand searches for datasets by default where no results were returned from user searches",
              "timedOut": false,
              "duration": 2388,
              "state": "passed",
              "speed": "slow",
              "pass": true,
              "fail": false,
              "pending": false,
              "context": null,
              "code": "const result = await page.findUnmetDemandSearches();\nawait page.takeScreenshot('12. unmet-demand-searches-default', screenshotDirectory);\nconsole.log(`Unmet demand searches:`);\nexpect(result.length).to.be.above(0);\nresult.forEach((search) => {\n\tconsole.log(`Term: ${search.searchTermText} - Count: ${search.searchCountText} - Dataset Results: ${search.searchResultsText}`);\n\texpect(search.searchTermText.length).to.be.above(0);\n\texpect(search.searchResultsText.length).to.be.above(0);\n\texpect(parseInt(search.searchCountText)).to.be.above(0);\n\texpect(search.linkAlive).to.equal(true);\n});",
              "err": {},
              "uuid": "43eedc80-7e2a-4316-9a30-52b2ddd8aa22",
              "parentUUID": "1c8928d1-23a1-447b-8249-34cfb6c4507a",
              "isHook": false,
              "skipped": false
            },
            {
              "title": "Displays unmet demand searches for Tools when the Tools tab is clicked",
              "fullTitle": "Public dashboard loads and displays expected metrics Displays unmet demand searches for Tools when the Tools tab is clicked",
              "timedOut": false,
              "duration": 1918,
              "state": "passed",
              "speed": "slow",
              "pass": true,
              "fail": false,
              "pending": false,
              "context": null,
              "code": "const result = await page.findUnmetDemandSearches('Tools');\nawait page.takeScreenshot('13. unmet-demand-searches-tools', screenshotDirectory);\nconsole.log(`Unmet demand searches:`);\nexpect(result.length).to.be.above(0);\nresult.forEach((search) => {\n\tconsole.log(`Term: ${search.searchTermText} - Count: ${search.searchCountText} - Tools Results: ${search.searchResultsText}`);\n\texpect(search.searchTermText.length).to.be.above(0);\n\texpect(search.searchResultsText.length).to.be.above(0);\n\texpect(parseInt(search.searchCountText)).to.be.above(0);\n\texpect(search.linkAlive).to.equal(true);\n});",
              "err": {},
              "uuid": "7f3b2ddc-ac67-42ef-80dd-20248fdb63c1",
              "parentUUID": "1c8928d1-23a1-447b-8249-34cfb6c4507a",
              "isHook": false,
              "skipped": false
            },
            {
              "title": "Displays unmet demand searches for Projects when the Projects tab is clicked",
              "fullTitle": "Public dashboard loads and displays expected metrics Displays unmet demand searches for Projects when the Projects tab is clicked",
              "timedOut": false,
              "duration": 1932,
              "state": "passed",
              "speed": "slow",
              "pass": true,
              "fail": false,
              "pending": false,
              "context": null,
              "code": "const result = await page.findUnmetDemandSearches('Projects');\nawait page.takeScreenshot('14. unmet-demand-searches-projects', screenshotDirectory);\nconsole.log(`Unmet demand searches:`);\nexpect(result.length).to.be.above(0);\nresult.forEach((search) => {\n\tconsole.log(`Term: ${search.searchTermText} - Count: ${search.searchCountText} - Projects Results: ${search.searchResultsText}`);\n\texpect(search.searchTermText.length).to.be.above(0);\n\texpect(search.searchResultsText.length).to.be.above(0);\n\texpect(parseInt(search.searchCountText)).to.be.above(0);\n\texpect(search.linkAlive).to.equal(true);\n});",
              "err": {},
              "uuid": "e22cf0c8-18fb-4398-ba37-d9595650056f",
              "parentUUID": "1c8928d1-23a1-447b-8249-34cfb6c4507a",
              "isHook": false,
              "skipped": false
            },
            {
              "title": "Displays unmet demand searches for Papers when the Papers tab is clicked",
              "fullTitle": "Public dashboard loads and displays expected metrics Displays unmet demand searches for Papers when the Papers tab is clicked",
              "timedOut": false,
              "duration": 1884,
              "state": "passed",
              "speed": "slow",
              "pass": true,
              "fail": false,
              "pending": false,
              "context": null,
              "code": "const result = await page.findUnmetDemandSearches('Papers');\nawait page.takeScreenshot('16. unmet-demand-searches-papers', screenshotDirectory);\nconsole.log(`Unmet demand searches:`);\nexpect(result.length).to.be.above(0);\nresult.forEach((search) => {\n\tconsole.log(`Term: ${search.searchTermText} - Count: ${search.searchCountText} - Papers Results: ${search.searchResultsText}`);\n\texpect(search.searchTermText.length).to.be.above(0);\n\texpect(search.searchResultsText.length).to.be.above(0);\n\texpect(parseInt(search.searchCountText)).to.be.above(0);\n\texpect(search.linkAlive).to.equal(true);\n});",
              "err": {},
              "uuid": "ef12ef0e-1566-4439-8adb-8e0008d44d11",
              "parentUUID": "1c8928d1-23a1-447b-8249-34cfb6c4507a",
              "isHook": false,
              "skipped": false
            },
            {
              "title": "Displays unmet demand searches for People when the People tab is clicked",
              "fullTitle": "Public dashboard loads and displays expected metrics Displays unmet demand searches for People when the People tab is clicked",
              "timedOut": false,
              "duration": 2061,
              "state": "passed",
              "speed": "slow",
              "pass": true,
              "fail": false,
              "pending": false,
              "context": null,
              "code": "const result = await page.findUnmetDemandSearches('People');\nawait page.takeScreenshot('17. unmet-demand-searches-people', screenshotDirectory);\nconsole.log(`Unmet demand searches:`);\nexpect(result.length).to.be.above(0);\nresult.forEach((search) => {\n\tconsole.log(`Term: ${search.searchTermText} - Count: ${search.searchCountText} - People Results: ${search.searchResultsText}`);\n\texpect(search.searchTermText.length).to.be.above(0);\n\texpect(search.searchResultsText.length).to.be.above(0);\n\texpect(parseInt(search.searchCountText)).to.be.above(0);\n\texpect(search.linkAlive).to.equal(true);\n});",
              "err": {},
              "uuid": "a5d693cc-fa3b-4a22-bf9d-6f88402f9209",
              "parentUUID": "1c8928d1-23a1-447b-8249-34cfb6c4507a",
              "isHook": false,
              "skipped": false
            },
            {
              "title": "Displays unmet demand searches for Datasets when the Datasets tab is clicked",
              "fullTitle": "Public dashboard loads and displays expected metrics Displays unmet demand searches for Datasets when the Datasets tab is clicked",
              "timedOut": false,
              "duration": 1893,
              "state": "passed",
              "speed": "slow",
              "pass": true,
              "fail": false,
              "pending": false,
              "context": null,
              "code": "const result = await page.findUnmetDemandSearches('Datasets');\nawait page.takeScreenshot('18. unmet-demand-searches-datasets', screenshotDirectory);\nconsole.log(`Unmet demand searches:`);\nexpect(result.length).to.be.above(0);\nresult.forEach((search) => {\n\tconsole.log(`Term: ${search.searchTermText} - Count: ${search.searchCountText} - Dataset Results: ${search.searchResultsText}`);\n\texpect(search.searchTermText.length).to.be.above(0);\n\texpect(search.searchResultsText.length).to.be.above(0);\n\texpect(parseInt(search.searchCountText)).to.be.above(0);\n\texpect(search.linkAlive).to.equal(true);\n});",
              "err": {},
              "uuid": "90e8e583-adc4-47da-82ca-48cb7fe63ac5",
              "parentUUID": "1c8928d1-23a1-447b-8249-34cfb6c4507a",
              "isHook": false,
              "skipped": false
            }
          ],
          "suites": [],
          "passes": [
            "af842193-0bb9-486e-a32e-37848bb7f8f3",
            "8f676202-79c0-4207-8ab7-c1be2cecd0e9",
            "5d060db7-e8ec-42d4-9918-7c1606646491",
            "0e2a13f4-41c8-4fa9-96cd-633d6739fa77",
            "5c5533e3-482b-423c-9382-6435a270a83c",
            "b87478be-f75d-4499-87ad-41231cb15df0",
            "3c88ac99-c086-4fc9-ae7a-b17665ea8935",
            "a71bbef6-0f23-4140-8eef-dda5f17cb1ae",
            "89ec0a10-9c9c-40f1-b672-2fc9e558ffa6",
            "fdf1cc5f-40ed-4b50-b494-db362a2d53fa",
            "43eedc80-7e2a-4316-9a30-52b2ddd8aa22",
            "7f3b2ddc-ac67-42ef-80dd-20248fdb63c1",
            "e22cf0c8-18fb-4398-ba37-d9595650056f",
            "ef12ef0e-1566-4439-8adb-8e0008d44d11",
            "a5d693cc-fa3b-4a22-bf9d-6f88402f9209",
            "90e8e583-adc4-47da-82ca-48cb7fe63ac5"
          ],
          "failures": [],
          "pending": [],
          "skipped": [],
          "duration": 19630,
          "root": false,
          "rootEmpty": false,
          "_timeout": 50000
        },
        {
          "uuid": "7a11d57f-38f1-481b-bfad-41406e5226e7",
          "title": "Navigation bar displays correctly for user after login",
          "fullFile": "/Users/robin.kavanagh@paconsulting.com/Documents/Git Home/selenium_framework/test/homePage.test.js",
          "file": "/test/homePage.test.js",
          "beforeHooks": [
            {
              "title": "\"before each\" hook in \"Navigation bar displays correctly for user after login\"",
              "fullTitle": "Navigation bar displays correctly for user after login \"before each\" hook in \"Navigation bar displays correctly for user after login\"",
              "timedOut": false,
              "duration": 4419,
              "state": null,
              "speed": null,
              "pass": false,
              "fail": false,
              "pending": false,
              "context": null,
              "code": "page = new Page();\ndriver = page.driver;\npage.clearScreenshots(screenshotDirectory);\nawait page.visit(baseUrl);",
              "err": {},
              "uuid": "c9cb2652-6fb3-4a8f-a7a3-019ac8b48b6f",
              "parentUUID": "7a11d57f-38f1-481b-bfad-41406e5226e7",
              "isHook": true,
              "skipped": false
            }
          ],
          "afterHooks": [
            {
              "title": "\"after all\" hook in \"Navigation bar displays correctly for user after login\"",
              "fullTitle": "Navigation bar displays correctly for user after login \"after all\" hook in \"Navigation bar displays correctly for user after login\"",
              "timedOut": false,
              "duration": 747,
              "state": null,
              "speed": null,
              "pass": false,
              "fail": false,
              "pending": false,
              "context": null,
              "code": "await page.quit();",
              "err": {},
              "uuid": "e216efcd-e3fb-4c47-bd86-f4983b80f694",
              "parentUUID": "7a11d57f-38f1-481b-bfad-41406e5226e7",
              "isHook": true,
              "skipped": false
            }
          ],
          "tests": [
            {
              "title": "Displays the expected navigation items",
              "fullTitle": "Navigation bar displays correctly for user after login Displays the expected navigation items",
              "timedOut": false,
              "duration": 25630,
              "state": "failed",
              "speed": null,
              "pass": false,
              "fail": true,
              "pending": false,
              "context": null,
              "code": "const user = { ...users['USER'], password: process.env.USERGOOGLEPWD };\nawait page.login(user);\npage.takeScreenshot('1. home', screenshotDirectory);\nconst username = await page.findUsername();\nexpect(username.labelText).to.include('Test Account');\nexpect(username.labelDisplayed).to.equal(true);\nconst notificationBadge = await page.findNotificationBadge();\nexpect(notificationBadge.imgDisplayed).to.equal(true);\nconst messageBadge = await page.findMessageBadge();\nexpect(messageBadge.imgDisplayed).to.equal(true);",
              "err": {
                "message": "TimeoutError: Looking for element By(xpath, //*[@id=\"identifierId\"])\nWait timed out after 20285ms",
                "estack": "TimeoutError: Looking for element By(xpath, //*[@id=\"identifierId\"])\nWait timed out after 20285ms\n    at /Users/robin.kavanagh@paconsulting.com/Documents/Git Home/selenium_framework/node_modules/selenium-webdriver/lib/webdriver.js:890:17\n    at runMicrotasks (<anonymous>)\n    at processTicksAndRejections (internal/process/task_queues.js:97:5)",
                "diff": null
              },
              "uuid": "4f366b65-05e9-4974-8b0a-df34dc41b7a2",
              "parentUUID": "7a11d57f-38f1-481b-bfad-41406e5226e7",
              "isHook": false,
              "skipped": false
            },
            {
              "title": "Provides a navigation dropdown with the correct links for a non admin user",
              "fullTitle": "Navigation bar displays correctly for user after login Provides a navigation dropdown with the correct links for a non admin user",
              "timedOut": false,
              "duration": 12990,
              "state": "passed",
              "speed": "slow",
              "pass": true,
              "fail": false,
              "pending": false,
              "context": null,
              "code": "const user = { ...users['USER'], password: process.env.USERGOOGLEPWD };\nawait page.login(user);\npage.takeScreenshot('1. home', screenshotDirectory);\nconst result = await page.findAndOpenUserNavigationDropdown(false);\nexpect(result.ddDisplayed).to.equal(true);\nexpect(result.optDashboardDisplayed).to.equal(true);\nexpect(result.optAccountDisplayed).to.equal(true);\nexpect(result.optToolsDisplayed).to.equal(true);\nexpect(result.optReviewsDisplayed).to.equal(true);\nexpect(result.optProjectsDisplayed).to.equal(true);\nexpect(result.optPapersDisplayed).to.equal(true);\nexpect(result.optCoursesDisplayed).to.equal(true);\nexpect(result.optDataAccessRequestsDisplayed).to.equal(true);\nexpect(result.optCollectionsDisplayed).to.equal(true);\nexpect(result.optUsersRolesDisplayed).to.equal(false);\nexpect(result.optLogoutDisplayed).to.equal(true);\npage.takeScreenshot('2. navigation-open', screenshotDirectory);",
              "err": {},
              "uuid": "9c5db8a5-a130-4ca1-8cad-1478dec40af3",
              "parentUUID": "7a11d57f-38f1-481b-bfad-41406e5226e7",
              "isHook": false,
              "skipped": false
            },
            {
              "title": "Provides a navigation dropdown with the correct links for an admin user",
              "fullTitle": "Navigation bar displays correctly for user after login Provides a navigation dropdown with the correct links for an admin user",
              "timedOut": false,
              "duration": 12903,
              "state": "passed",
              "speed": "slow",
              "pass": true,
              "fail": false,
              "pending": false,
              "context": null,
              "code": "const user = { ...users['ADMIN'], password: process.env.ADMINGOOGLEPWD };\nawait page.login(user);\npage.takeScreenshot('1. home-admin', screenshotDirectory);\nconst result = await page.findAndOpenUserNavigationDropdown(true);\nexpect(result.ddDisplayed).to.equal(true);\nexpect(result.optDashboardDisplayed).to.equal(true);\nexpect(result.optAccountDisplayed).to.equal(true);\nexpect(result.optToolsDisplayed).to.equal(true);\nexpect(result.optReviewsDisplayed).to.equal(true);\nexpect(result.optProjectsDisplayed).to.equal(true);\nexpect(result.optPapersDisplayed).to.equal(true);\nexpect(result.optCoursesDisplayed).to.equal(true);\nexpect(result.optDataAccessRequestsDisplayed).to.equal(true);\nexpect(result.optCollectionsDisplayed).to.equal(true);\nexpect(result.optUsersRolesDisplayed).to.equal(true);\nexpect(result.optLogoutDisplayed).to.equal(true);\npage.takeScreenshot('2. navigation-open-admin', screenshotDirectory);",
              "err": {},
              "uuid": "079b1e4b-7bda-42e6-8d43-4f0199057a46",
              "parentUUID": "7a11d57f-38f1-481b-bfad-41406e5226e7",
              "isHook": false,
              "skipped": false
            }
          ],
          "suites": [],
          "passes": [
            "9c5db8a5-a130-4ca1-8cad-1478dec40af3",
            "079b1e4b-7bda-42e6-8d43-4f0199057a46"
          ],
          "failures": [
            "4f366b65-05e9-4974-8b0a-df34dc41b7a2"
          ],
          "pending": [],
          "skipped": [],
          "duration": 51523,
          "root": false,
          "rootEmpty": false,
          "_timeout": 50000
        },
        {
          "uuid": "d1bbfdf9-65dc-44b2-853e-7b6fea4a49bc",
          "title": "User account profile displays details of logged in user and can be updated",
          "fullFile": "/Users/robin.kavanagh@paconsulting.com/Documents/Git Home/selenium_framework/test/userAccountPage.test.js",
          "file": "/test/userAccountPage.test.js",
          "beforeHooks": [
            {
              "title": "\"before all\" hook in \"User account profile displays details of logged in user and can be updated\"",
              "fullTitle": "User account profile displays details of logged in user and can be updated \"before all\" hook in \"User account profile displays details of logged in user and can be updated\"",
              "timedOut": false,
              "duration": 21916,
              "state": null,
              "speed": null,
              "pass": false,
              "fail": false,
              "pending": false,
              "context": null,
              "code": "page = new Page();\ndriver = page.driver;\npage.clearScreenshots(screenshotDirectory);\nawait page.visit(baseUrl);\nconst user = { ...users['USER'], password: process.env.USERGOOGLEPWD };\n                await page.login(user);\n                await page.findAndOpenUserNavigationDropdown(false);\nawait page.clickNavigationLink('optAccountSelector');\nawait page.takeScreenshot('1. user account profile', screenshotDirectory);",
              "err": {},
              "uuid": "a8730351-102d-4d1a-9fd7-a27959d6700f",
              "parentUUID": "d1bbfdf9-65dc-44b2-853e-7b6fea4a49bc",
              "isHook": true,
              "skipped": false
            }
          ],
          "afterHooks": [
            {
              "title": "\"after all\" hook in \"User account profile displays details of logged in user and can be updated\"",
              "fullTitle": "User account profile displays details of logged in user and can be updated \"after all\" hook in \"User account profile displays details of logged in user and can be updated\"",
              "timedOut": false,
              "duration": 55,
              "state": null,
              "speed": null,
              "pass": false,
              "fail": false,
              "pending": false,
              "context": null,
              "code": "await page.quit();",
              "err": {},
              "uuid": "22a4d6fe-3273-4cce-9e01-74902965cb07",
              "parentUUID": "d1bbfdf9-65dc-44b2-853e-7b6fea4a49bc",
              "isHook": true,
              "skipped": false
            }
          ],
          "tests": [
            {
              "title": "Displays the users name and email address",
              "fullTitle": "User account profile displays details of logged in user and can be updated Displays the users name and email address",
              "timedOut": false,
              "duration": 837,
              "state": "passed",
              "speed": "slow",
              "pass": true,
              "fail": false,
              "pending": false,
              "context": null,
              "code": "const result = await page.findUserProfileDetails();\nawait page.takeScreenshot('2. users-bio-details', screenshotDirectory);\n                console.log(`Users names and email address: ${result.firstName} ${result.lastName} - ${result.emailAddress}`);\n                \n                expect(result.firstName).to.equal(users['USER'].firstName);\n                expect(result.lastName).to.equal(users['USER'].lastName);\n                expect(result.emailAddress).to.equal(users['USER'].emailAddress);",
              "err": {},
              "uuid": "6ee46a2b-d32a-4098-ad93-00d112fdcf62",
              "parentUUID": "d1bbfdf9-65dc-44b2-853e-7b6fea4a49bc",
              "isHook": false,
              "skipped": false
            },
            {
              "title": "Displays the correct validation messages when form fields are empty",
              "fullTitle": "User account profile displays details of logged in user and can be updated Displays the correct validation messages when form fields are empty",
              "timedOut": false,
              "duration": 23372,
              "state": "passed",
              "speed": "slow",
              "pass": true,
              "fail": false,
              "pending": false,
              "context": null,
              "code": "await page.clearFormData();\nawait page.takeScreenshot('3. users-bio-empty-fields', screenshotDirectory);\nawait page.submitSaveForm();\nawait page.takeScreenshot('4. users-bio-empty-fields-validation', screenshotDirectory);\nconsole.log(`Form validation state: `);\nconst result = await page.getFormValidState();\nObject.keys(result).forEach(key => {\n    console.log(`Field: ${key} - Displayed: ${result[key].displayed} - Message: ${result[key].text}`);\n    expect(result[key].displayed).to.equal(true);\n    expect(result[key].text).to.not.equal('');\n});",
              "err": {},
              "uuid": "b157cc7e-c6c7-4748-92d4-274e058fdb9e",
              "parentUUID": "d1bbfdf9-65dc-44b2-853e-7b6fea4a49bc",
              "isHook": false,
              "skipped": false
            }
          ],
          "suites": [],
          "passes": [
            "6ee46a2b-d32a-4098-ad93-00d112fdcf62",
            "b157cc7e-c6c7-4748-92d4-274e058fdb9e"
          ],
          "failures": [],
          "pending": [],
          "skipped": [],
          "duration": 24209,
          "root": false,
          "rootEmpty": false,
          "_timeout": 50000
        }
      ],
      "passes": [],
      "failures": [],
      "pending": [],
      "skipped": [],
      "duration": 0,
      "root": true,
      "rootEmpty": true,
      "_timeout": 2000
    }
  ],
  "meta": {
    "mocha": {
      "version": "8.2.1"
    },
    "mochawesome": {
      "options": {
        "quiet": false,
        "reportFilename": "mochawesome",
        "saveHtml": true,
        "saveJson": true,
        "consoleReporter": "spec",
        "useInlineDiffs": false,
        "code": true
      },
      "version": "6.2.1"
    },
    "marge": {
      "options": {
        "autoOpen": "true"
      },
      "version": "5.1.0"
    }
  }
}