module gitlab.com/hblabs.co/rc/realtime

go 1.21.5

require github.com/gofiber/fiber/v2 v2.51.0

require (
	github.com/andybalholm/brotli v1.0.5 // indirect
	github.com/fasthttp/websocket v1.5.7 // indirect
	github.com/gofiber/contrib/websocket v1.3.0 // indirect
	github.com/golang-jwt/jwt v3.2.2+incompatible // indirect
	github.com/google/uuid v1.4.0 // indirect
	github.com/klauspost/compress v1.17.3 // indirect
	github.com/mattn/go-colorable v0.1.13 // indirect
	github.com/mattn/go-isatty v0.0.20 // indirect
	github.com/mattn/go-runewidth v0.0.15 // indirect
	github.com/rivo/uniseg v0.2.0 // indirect
	github.com/savsgio/gotils v0.0.0-20230208104028-c358bd845dee // indirect
	github.com/valyala/bytebufferpool v1.0.0 // indirect
	github.com/valyala/fasthttp v1.51.0 // indirect
	github.com/valyala/tcplisten v1.0.0 // indirect
	golang.org/x/net v0.18.0 // indirect
	golang.org/x/sys v0.14.0 // indirect
)
