// Jest Snapshot v1, https://goo.gl/fbAQLP

exports[`The \`DropdownMenu\` component renders correctly 1`] = `
<Fragment>
  <WithStyles(ForwardRef(Menu))
    MenuListProps={
      Object {
        "classes": Object {
          "root": undefined,
        },
      }
    }
    anchorEl={null}
    classes={Object {}}
    id="testId"
    items={
      Array [
        Object {
          "label": "foo",
        },
        Object {
          "label": "bar",
        },
      ]
    }
    onClick={[Function]}
    open={false}
    transformOrigin={
      Object {
        "horizontal": "right",
        "vertical": 0,
      }
    }
  >
    <b>
      Toggle
    </b>
  </WithStyles(ForwardRef(Menu))>
</Fragment>
`;
