// Jest Snapshot v1, https://goo.gl/fbAQLP

exports[`The \`VerticalMenu\` component renders correctly 1`] = `
<nav>
  <WithStyles(VerticalMenuButton)
    key="0"
    label="foo"
  />
  <WithStyles(VerticalMenuButton)
    key="1"
    label="bar"
  />
</nav>
`;
