// Jest Snapshot v1, https://goo.gl/fbAQLP

exports[`The \`Fab\` component renders correctly 1`] = `
<WithStyles(ForwardRef(Fab))
  color="primary"
  data-scope="fab:button"
  onClick={[Function]}
>
  <Icon>
    add
  </Icon>
</WithStyles(ForwardRef(Fab))>
`;
