(8,36)
(10,15)
(18,35)
(11,42)
(10,21)
(3,27)
(3,9)
(12,26)
(13,26)
(5,36)
(12,18)
(16,29)
(15,30)
(15,23)
(20,35)
(18,2)
(7,8)
(6,17)
(2,6)
(20,42)
(22,23)
(22,19)
(9,37)
(15,24)
(12,20)
(6,26)
(20,30)
(21,23)
(15,20)
(5,31)
(10,25)
(21,27)
(9,5)
(23,29)
(2,7)
(13,45)
(7,45)
(15,17)
(3,14)
(4,0)
(8,8)
(13,28)
(21,34)
(4,1)
(3,49)
(13,10)
(21,18)
(20,12)
(11,36)
(7,39)
