underwriter_user_name,business_unit_code,business_unit_desc
BALTJCLM,OSI,SIT
CALKDMPY,OSI,SIT
CASTROD,OSI,SIT
HEFNACLM,OSI,SIT
REELACLM,OSI,SIT
THOCRCLM,OSI,SIT
VILDDMPY,OSI,SIT
BERCRCLM,OSI,SIT
ARNOLDH,DEST,Cake
AROCHAN,DEST,Cake
