{
"users":[
    {
      "id": 1,
      "username": "john_doe",
      "email": "john.doe@example.com",
      "age": 30,
      "country": "United States"
    },
    {
      "id": 2,
      "username": "jane_smith",
      "email": "jane.smith@example.com",
      "age": 25,
      "country": "Canada"
    },
    {
      "id": 3,
      "username": "bob_johnson",
      "email": "bob.johnson@example.com",
      "age": 40,
      "country": "United Kingdom"
    }
  ]
}
  