2016/07/19 16:31:02.879 | TUNATTIJARI.06872 :Appl | Fix | OUT | [8=FIX.4.2 9=360 35=8 34=1244 49=1 56=00000035 52=20160719-16:31:02 11=TUN01A02 37=20160719019400 150=0 20=0 39=0 48=TN0007620016 22=4 55=TN0007620016 54=2 38=20 40=1 151=0 126=00000000-00:00:00 110=0 111=0 59=0 9945=00000000000000 9596=1 9265=20160719162426363744 47=N 439= 1=0123456789123456 109= 58=Order OK1 9262=20160719A0000063191 10=131]



bin/logstash -e 'input { generator { "message" => "2016/07/19-16:31:08.543-8=FIX.4.2 9=360 35=8 34=4696 49=1 56=00000013 52=20160719-16:31:08 11=TUN01A02 37=20160719020195 150=0 20=0 39=0 48=TN0007620016 22=4 55=TN0007620016 54=2 38=20 40=1 151=0 126=00000000-00:00:00 110=0 111=0 59=0 9945=00000000000000 9596=1 9265=20160719162432603170 47=N 439= 1=0123456789123456 109= 58=Order 9262=20160719A0000065505 10=138"} } filter { grok { match => { "message" => "%{DATESTAMP:timestamp}-%{GREEDYDATA:request}" } } kv { source => "request" field_split => " " value_split => "=" } } output { stdout { codec => json_lines } }'

#output
{"sequence":7277,"some":"thing","@timestamp":"2017-11-22T18:20:05.251Z","@version":"1","host":"avce.local","is":"here","message":"some:thing,is:here"}


$ cd /usr/share/logstash
$ sudo bin/logstah -f /etc/logstash/conf.d/example.conf