\relax 
\providecommand\hyper@newdestlabel[2]{}
\providecommand\HyperFirstAtBeginDocument{\AtBeginDocument}
\HyperFirstAtBeginDocument{\ifx\hyper@anchor\@undefined
\global\let\oldcontentsline\contentsline
\gdef\contentsline#1#2#3#4{\oldcontentsline{#1}{#2}{#3}}
\global\let\oldnewlabel\newlabel
\gdef\newlabel#1#2{\newlabelxx{#1}#2}
\gdef\newlabelxx#1#2#3#4#5#6{\oldnewlabel{#1}{{#2}{#3}}}
\AtEndDocument{\ifx\hyper@anchor\@undefined
\let\contentsline\oldcontentsline
\let\newlabel\oldnewlabel
\fi}
\fi}
\global\let\hyper@last\relax 
\gdef\HyperFirstAtBeginDocument#1{#1}
\providecommand\HyField@AuxAddToFields[1]{}
\providecommand\HyField@AuxAddToCoFields[2]{}
\catcode `:\active 
\catcode `;\active 
\catcode `!\active 
\catcode `?\active 
\babel@aux{french}{}
\@input{Remerciement/remerciement.aux}
\@writefile{toc}{\contentsline {chapter}{Liste des Figures}{iv}{Doc-Start}}
\@writefile{toc}{\contentsline {xchapter}{}{iv}{Doc-Start}}
\@writefile{lof}{\contentsline {xchapter}{}{iv}{Doc-Start}}
\@writefile{lot}{\contentsline {xchapter}{}{iv}{Doc-Start}}
\@input{Resumes/resumeF.aux}
\@input{Introduction/introduction.aux}
\@input{Chapitre0/chapitre0.aux}
\@input{Chapitre1/chapitre1.aux}
\@input{Chapitre2/chapitre2.aux}
\@input{Chapitre3/chapitre3.aux}
\@input{Conclusion/conclusion.aux}
\bibstyle{Biblio/unsrt_modif}
\bibdata{Biblio/aesm_edspia}
\bibcite{Scrum}{{1}{}{{}}{{}}}
\bibcite{Roles}{{2}{}{{}}{{}}}
\bibcite{angular}{{3}{}{{}}{{}}}
\bibcite{node}{{4}{}{{}}{{}}}
\bibcite{express}{{5}{}{{}}{{}}}
\bibcite{nodeasync}{{6}{}{{}}{{}}}
\bibcite{mongodb}{{7}{}{{}}{{}}}
\bibcite{mongoose}{{8}{}{{}}{{}}}
\bibcite{defdevops}{{9}{}{{}}{{}}}
\bibcite{stepsdevops}{{10}{}{{}}{{}}}
\bibcite{mocha}{{11}{}{{}}{{}}}
\bibcite{chai}{{12}{}{{}}{{}}}
\bibcite{git}{{13}{}{{}}{{}}}
\bibcite{gitlab}{{14}{}{{}}{{}}}
\@writefile{toc}{\contentsline {chapter}{Bibliographique}{29}{chapter*.34}}
\bibcite{dockerhub}{{15}{}{{}}{{}}}
\providecommand\NAT@force@numbers{}\NAT@force@numbers
\global\mtcsecondpartfalse
