<?xml version="1.0" encoding="UTF-8"?>
<svg xmlns:xlink="http://www.w3.org/1999/xlink" width="158px" height="127px" viewBox="0 0 158 127" version="1.1"
     xmlns="http://www.w3.org/2000/svg">
    <!-- Generator: Sketch 52.1 (67048) - http://www.bohemiancoding.com/sketch -->
    <title>Icon</title>
    <desc>Created with Sketch.</desc>
    <g id="Page-1" stroke="none" stroke-width="1" fill="none" fill-rule="evenodd">
        <g id="On-Boarding---5" transform="translate(-104.000000, -161.000000)">
            <g id="Icon" transform="translate(104.000000, 161.000000)">
                <path d="M45.7301086,13.0010743 C44.0322761,15.2200052 42.009263,16.7208917 40.1672652,17.1771424 C39.5154822,15.3949249 39.6285189,12.8784859 40.51868,10.2301086 C38.2997492,8.53227612 36.7988627,6.50926299 36.342612,4.66726523 C38.1248295,4.01548217 40.6412684,4.12851885 43.2896458,5.01868003 C44.9874783,2.79974916 47.0104914,1.2988627 48.8524891,0.842611956 C49.5042722,2.62482948 49.3912355,5.14126844 48.5010743,7.78964576 C50.7200052,9.48747825 52.2208917,11.5104914 52.6771424,13.3524891 C50.8949249,14.0042722 48.3784859,13.8912355 45.7301086,13.0010743 Z M8.27170362,56.3274637 C7.4733567,58.0856398 6.34440273,59.4108416 5.1749387,60.0044472 C4.45895598,58.9056376 4.14385405,57.1935023 4.33155338,55.2717036 C2.57337728,54.4733567 1.2481755,53.3444027 0.654569838,52.1749387 C1.75337944,51.458956 3.46551482,51.143854 5.38731346,51.3315534 C6.18566038,49.5733773 7.31461435,48.2481755 8.48407838,47.6545698 C9.2000611,48.7533794 9.51516303,50.4655148 9.32746369,52.3873135 C11.0856398,53.1856604 12.4108416,54.3146144 13.0044472,55.4840784 C11.9056376,56.2000611 10.1935023,56.515163 8.27170362,56.3274637 Z M150.850588,104.552882 C148.975498,105.146915 147.202824,105.195562 145.956355,104.714884 C146.300135,103.423934 147.381442,102.018405 148.964176,100.850588 C148.370143,98.9754975 148.321496,97.202824 148.802174,95.9563552 C150.093123,96.3001349 151.498652,97.3814424 152.666469,98.9641757 C154.54156,98.3701431 156.314234,98.3214962 157.560703,98.8021737 C157.216923,100.093123 156.135615,101.498652 154.552882,102.666469 C155.146915,104.54156 155.195562,106.314234 154.714884,107.560703 C153.423934,107.216923 152.018405,106.135615 150.850588,104.552882 Z"
                      id="Stars" fill="#FFFFFF" opacity="0.520097373"></path>
                <circle id="Oval-3" fill-opacity="0.6" fill="#FFFFFF" opacity="0.9" cx="84" cy="69" r="58"></circle>
                <path d="M84.0002258,40 C70.9452697,40 58.9680196,44.3944635 49.6257788,51.4858649 C48.9267334,52.021553 48.7931217,53.0244095 49.3275207,53.7282635 C49.8619037,54.4290161 50.865419,54.5629541 51.5644564,54.02725 C60.3690373,47.3436662 71.6598961,43.1887905 83.9998281,43.1887905 C96.3397521,43.1887905 107.630619,47.343427 116.43519,54.02725 C117.134236,54.5629381 118.137727,54.4290161 118.672126,53.7282635 C118.929996,53.3918997 119.041839,52.9652261 118.985917,52.5447554 C118.929996,52.1243086 118.709404,51.7412392 118.373868,51.4858649 C109.031629,44.3943041 97.0543785,40 83.9994225,40 L84.0002258,40 Z M84.0002258,55.1486486 C74.6452609,55.1486486 65.9241939,57.9859108 59.1453837,63.4708378 C58.7663494,63.7137664 58.5084794,64.1092976 58.4370247,64.5577932 C58.36557,65.0031555 58.4867344,65.4609716 58.7694592,65.8128986 C59.0552938,66.1648336 59.4747163,66.3797292 59.9251895,66.4015273 C60.3756865,66.4264428 60.81376,66.2582609 61.1337313,65.9374764 C67.2946302,60.9543682 75.2886633,58.3382764 84.000186,58.3382764 C92.7117087,58.3382764 100.705821,60.9543682 106.866641,65.9374764 C107.186644,66.2582609 107.624709,66.4264428 108.075183,66.4015273 C108.52568,66.3797292 108.945142,66.1648257 109.230913,65.8128986 C109.513638,65.4609636 109.634802,65.0031635 109.563347,64.5577932 C109.491893,64.1093135 109.234023,63.7137743 108.854988,63.4708378 C102.07586,57.9863095 93.3551111,55.1486486 84.0001462,55.1486486 L84.0002258,55.1486486 Z M84.0002258,69.5 C78.2898159,69.5 72.8620751,71.2939189 68.6896431,74.6076459 C68.3540987,74.8692551 68.1397267,75.25545 68.0869151,75.6821635 C68.0372054,76.1057277 68.1583698,76.5324014 68.4224515,76.8656716 C68.6865332,77.2020354 69.0748891,77.4169309 69.4974533,77.4636446 C69.9199856,77.5134757 70.3456198,77.388898 70.6780781,77.1241714 C74.241666,74.2931281 78.9609045,72.6892051 84.0002735,72.6892051 C89.0396424,72.6892051 93.7592787,74.2931281 97.3224688,77.1241714 C97.6549033,77.388898 98.0805375,77.5134757 98.5030937,77.4636446 C98.925626,77.4169309 99.3139581,77.2020354 99.5780955,76.8656716 C99.8421772,76.5324253 99.9633415,76.1057516 99.9136318,75.6821635 C99.8608123,75.2554819 99.6464403,74.8693189 99.3109039,74.6076459 C95.1383923,71.2939189 89.7109697,69.5 84.0003212,69.5 L84.0002258,69.5 Z"
                      id="Fill-1" fill="#535353"></path>
                <path d="M84.0002258,83.0540541 C79.6071623,83.0540541 76.0466763,86.6232351 76.0466763,91.027027 C76.0466763,95.4308189 79.6071623,99 84.0002258,99 C88.3932893,99 91.9537752,95.4308189 91.9537752,91.027027 C91.9537752,86.6232351 88.3932893,83.0540541 84.0002258,83.0540541 Z"
                      id="Path" fill="#FEC24C"></path>
            </g>
        </g>
    </g>
</svg>