<?xml version="1.0" encoding="utf-8"?>
<!-- Generator: Adobe Illustrator 22.1.0, SVG Export Plug-In . SVG Version: 6.00 Build 0)  -->
<svg version="1.1" id="Calque_1" xmlns="http://www.w3.org/2000/svg" xmlns:xlink="http://www.w3.org/1999/xlink" x="0px" y="0px"
	 viewBox="0 0 35 35" style="enable-background:new 0 0 35 35;" xml:space="preserve">
<style type="text/css">
	.st0{clip-path:url(#SVGID_2_);}
	.st1{clip-path:url(#SVGID_4_);fill:#0067AC;}
</style>
<g>
	<defs>
		<path id="SVGID_1_" d="M14.6,14.3v1.5h0.8h0.8v9.8h-0.8h-0.8V27h0.8h0.8h3h0.8h0.8v-1.5h-0.8h-0.8V14.3h-0.8h-3H14.6z M17.6,6.8
			c-1.2,0-2.3,1-2.3,2.3c0,1.2,1,2.3,2.3,2.3s2.3-1,2.3-2.3C19.8,7.8,18.8,6.8,17.6,6.8z M17.6,1.5c8.7,0,15.7,7.1,15.7,15.8
			S26.3,33,17.6,33S1.8,26,1.8,17.3S8.9,1.5,17.6,1.5z M17.6,0C8.1,0,0.3,7.7,0.3,17.3s7.7,17.3,17.2,17.3s17.2-7.7,17.2-17.3
			S27.1,0,17.6,0z"/>
	</defs>
	<use xlink:href="#SVGID_1_"  style="overflow:visible;fill:#0067AC;"/>
	<clipPath id="SVGID_2_">
		<use xlink:href="#SVGID_1_"  style="overflow:visible;"/>
	</clipPath>
	<g class="st0">
		<defs>
			<rect id="SVGID_3_" x="-1436" y="-706" width="1559" height="2256"/>
		</defs>
		<use xlink:href="#SVGID_3_"  style="overflow:visible;fill:#0067AC;"/>
		<clipPath id="SVGID_4_">
			<use xlink:href="#SVGID_3_"  style="overflow:visible;"/>
		</clipPath>
		<rect x="-4.7" y="-5" class="st1" width="44.5" height="44.5"/>
	</g>
</g>
</svg>
