<?xml version="1.0" encoding="utf-8"?>
<!-- Generator: Adobe Illustrator 22.1.0, SVG Export Plug-In . SVG Version: 6.00 Build 0)  -->
<svg version="1.1" id="Calque_1" xmlns="http://www.w3.org/2000/svg" xmlns:xlink="http://www.w3.org/1999/xlink" x="0px" y="0px"
	 viewBox="0 0 62 51" style="enable-background:new 0 0 62 51;" xml:space="preserve">
<style type="text/css">
	.st0{clip-path:url(#SVGID_2_);}
	.st1{clip-path:url(#SVGID_4_);fill:#B7CDFF;}
	.st2{clip-path:url(#SVGID_6_);}
	.st3{clip-path:url(#SVGID_8_);fill:#CEE0FF;}
	.st4{clip-path:url(#SVGID_10_);}
	.st5{clip-path:url(#SVGID_12_);fill:#A2B8EA;}
	.st6{clip-path:url(#SVGID_14_);}
	.st7{clip-path:url(#SVGID_16_);fill:#FFE46C;}
	.st8{clip-path:url(#SVGID_18_);}
	.st9{clip-path:url(#SVGID_20_);fill:#A361C7;}
	.st10{clip-path:url(#SVGID_22_);}
	.st11{clip-path:url(#SVGID_24_);fill:#A361C7;}
	.st12{clip-path:url(#SVGID_26_);}
	.st13{clip-path:url(#SVGID_28_);fill:#A361C7;}
	.st14{clip-path:url(#SVGID_30_);}
	.st15{clip-path:url(#SVGID_32_);fill:#A361C7;}
	.st16{clip-path:url(#SVGID_34_);}
	.st17{clip-path:url(#SVGID_36_);fill:#A361C7;}
	.st18{clip-path:url(#SVGID_38_);}
	.st19{clip-path:url(#SVGID_40_);fill:#A361C7;}
	.st20{clip-path:url(#SVGID_42_);}
	.st21{clip-path:url(#SVGID_44_);fill:#A361C7;}
	.st22{clip-path:url(#SVGID_46_);}
	.st23{clip-path:url(#SVGID_48_);fill:#A361C7;}
	.st24{clip-path:url(#SVGID_50_);}
	.st25{clip-path:url(#SVGID_52_);fill:#A361C7;}
	.st26{clip-path:url(#SVGID_54_);}
	.st27{clip-path:url(#SVGID_56_);fill:#A361C7;}
	.st28{clip-path:url(#SVGID_58_);}
	.st29{clip-path:url(#SVGID_60_);fill:#A361C7;}
	.st30{clip-path:url(#SVGID_62_);}
	.st31{clip-path:url(#SVGID_64_);fill:#A361C7;}
</style>
<g>
	<defs>
		<path id="SVGID_1_" d="M50.7,29c0.3-1.2,0.4-2.5,0.4-3.9C51.1,14.6,42.5,6,32,6c-8.7,0-16,5.8-18.3,13.7c-7,1.4-12.3,7.6-12.3,15
			C1.3,43.1,8.2,50,16.7,50c5,0,28.7,0,33.5,0c5.8,0,10.5-4.7,10.5-10.5C60.7,33.9,56.2,29.3,50.7,29z"/>
	</defs>
	<clipPath id="SVGID_2_">
		<use xlink:href="#SVGID_1_"  style="overflow:visible;"/>
	</clipPath>
	<g class="st0">
		<defs>
			<rect id="SVGID_3_" x="-1316" y="-197" width="1559" height="2256"/>
		</defs>
		<clipPath id="SVGID_4_">
			<use xlink:href="#SVGID_3_"  style="overflow:visible;"/>
		</clipPath>
		<rect x="-3.7" y="1" class="st1" width="69.3" height="54"/>
	</g>
</g>
<g>
	<defs>
		<path id="SVGID_5_" d="M16.8,16.6c1.1,1.1,2.8,0.9,3.7-0.2C23.3,13.1,27.4,11,32,11s8.7,2.1,11.5,5.4c1,1.1,2.7,1.3,3.7,0.2
			c0.9-0.9,1-2.4,0.1-3.4C43.7,8.8,38.2,6,32,6s-11.7,2.8-15.3,7.2C15.8,14.2,15.9,15.7,16.8,16.6z"/>
	</defs>
	<clipPath id="SVGID_6_">
		<use xlink:href="#SVGID_5_"  style="overflow:visible;"/>
	</clipPath>
	<g class="st2">
		<defs>
			<rect id="SVGID_7_" x="-1316" y="-197" width="1559" height="2256"/>
		</defs>
		<clipPath id="SVGID_8_">
			<use xlink:href="#SVGID_7_"  style="overflow:visible;"/>
		</clipPath>
		<rect x="11.1" y="1" class="st3" width="41.9" height="21.3"/>
	</g>
</g>
<g>
	<defs>
		<polygon id="SVGID_9_" points="5,45 60,45 54,50 12,50 		"/>
	</defs>
	<clipPath id="SVGID_10_">
		<use xlink:href="#SVGID_9_"  style="overflow:visible;"/>
	</clipPath>
	<g class="st4">
		<defs>
			<rect id="SVGID_11_" x="-1316" y="-197" width="1559" height="2256"/>
		</defs>
		<clipPath id="SVGID_12_">
			<use xlink:href="#SVGID_11_"  style="overflow:visible;"/>
		</clipPath>
		<rect y="40" class="st5" width="65" height="15"/>
	</g>
</g>
<g>
	<defs>
		<path id="SVGID_13_" d="M26,23c-7.2,0-13-5.8-13-13c0-3.5,1.4-6.6,3.6-9c-0.2,0-0.4,0-0.6,0C8.3,1,2,7.3,2,15s6.3,14,14,14
			c4.8,0,9-2.4,11.6-6.1C27,23,26.5,23,26,23z"/>
	</defs>
	<clipPath id="SVGID_14_">
		<use xlink:href="#SVGID_13_"  style="overflow:visible;"/>
	</clipPath>
	<g class="st6">
		<defs>
			<rect id="SVGID_15_" x="-1316" y="-197" width="1559" height="2256"/>
		</defs>
		<clipPath id="SVGID_16_">
			<use xlink:href="#SVGID_15_"  style="overflow:visible;"/>
		</clipPath>
		<rect x="-3" y="-4" class="st7" width="35.6" height="38"/>
	</g>
</g>
<g>
	<defs>
		<path id="SVGID_17_" d="M12,43c-0.6,0-1,0.4-1,1v2c0,0.6,0.4,1,1,1s1-0.4,1-1v-2C13,43.4,12.6,43,12,43z"/>
	</defs>
	<clipPath id="SVGID_18_">
		<use xlink:href="#SVGID_17_"  style="overflow:visible;"/>
	</clipPath>
	<g class="st8">
		<defs>
			<rect id="SVGID_19_" x="-1316" y="-197" width="1559" height="2256"/>
		</defs>
		<clipPath id="SVGID_20_">
			<use xlink:href="#SVGID_19_"  style="overflow:visible;"/>
		</clipPath>
		<rect x="6" y="38" class="st9" width="12" height="14"/>
	</g>
</g>
<g>
	<defs>
		<path id="SVGID_21_" d="M17,43c-0.6,0-1,0.4-1,1v2c0,0.6,0.4,1,1,1s1-0.4,1-1v-2C18,43.4,17.6,43,17,43z"/>
	</defs>
	<clipPath id="SVGID_22_">
		<use xlink:href="#SVGID_21_"  style="overflow:visible;"/>
	</clipPath>
	<g class="st10">
		<defs>
			<rect id="SVGID_23_" x="-1316" y="-197" width="1559" height="2256"/>
		</defs>
		<clipPath id="SVGID_24_">
			<use xlink:href="#SVGID_23_"  style="overflow:visible;"/>
		</clipPath>
		<rect x="11" y="38" class="st11" width="12" height="14"/>
	</g>
</g>
<g>
	<defs>
		<path id="SVGID_25_" d="M22,43c-0.6,0-1,0.4-1,1v2c0,0.6,0.4,1,1,1s1-0.4,1-1v-2C23,43.4,22.6,43,22,43z"/>
	</defs>
	<clipPath id="SVGID_26_">
		<use xlink:href="#SVGID_25_"  style="overflow:visible;"/>
	</clipPath>
	<g class="st12">
		<defs>
			<rect id="SVGID_27_" x="-1316" y="-197" width="1559" height="2256"/>
		</defs>
		<clipPath id="SVGID_28_">
			<use xlink:href="#SVGID_27_"  style="overflow:visible;"/>
		</clipPath>
		<rect x="16" y="38" class="st13" width="12" height="14"/>
	</g>
</g>
<g>
	<defs>
		<path id="SVGID_29_" d="M27,43c-0.6,0-1,0.4-1,1v2c0,0.6,0.4,1,1,1s1-0.4,1-1v-2C28,43.4,27.6,43,27,43z"/>
	</defs>
	<clipPath id="SVGID_30_">
		<use xlink:href="#SVGID_29_"  style="overflow:visible;"/>
	</clipPath>
	<g class="st14">
		<defs>
			<rect id="SVGID_31_" x="-1316" y="-197" width="1559" height="2256"/>
		</defs>
		<clipPath id="SVGID_32_">
			<use xlink:href="#SVGID_31_"  style="overflow:visible;"/>
		</clipPath>
		<rect x="21" y="38" class="st15" width="12" height="14"/>
	</g>
</g>
<g>
	<defs>
		<path id="SVGID_33_" d="M37,43c-0.6,0-1,0.4-1,1v2c0,0.6,0.4,1,1,1s1-0.4,1-1v-2C38,43.4,37.6,43,37,43z"/>
	</defs>
	<clipPath id="SVGID_34_">
		<use xlink:href="#SVGID_33_"  style="overflow:visible;"/>
	</clipPath>
	<g class="st16">
		<defs>
			<rect id="SVGID_35_" x="-1316" y="-197" width="1559" height="2256"/>
		</defs>
		<clipPath id="SVGID_36_">
			<use xlink:href="#SVGID_35_"  style="overflow:visible;"/>
		</clipPath>
		<rect x="31" y="38" class="st17" width="12" height="14"/>
	</g>
</g>
<g>
	<defs>
		<path id="SVGID_37_" d="M32,43c-0.6,0-1,0.4-1,1v2c0,0.6,0.4,1,1,1c0.6,0,1-0.4,1-1v-2C33,43.4,32.6,43,32,43z"/>
	</defs>
	<clipPath id="SVGID_38_">
		<use xlink:href="#SVGID_37_"  style="overflow:visible;"/>
	</clipPath>
	<g class="st18">
		<defs>
			<rect id="SVGID_39_" x="-1316" y="-197" width="1559" height="2256"/>
		</defs>
		<clipPath id="SVGID_40_">
			<use xlink:href="#SVGID_39_"  style="overflow:visible;"/>
		</clipPath>
		<rect x="26" y="38" class="st19" width="12" height="14"/>
	</g>
</g>
<g>
	<defs>
		<path id="SVGID_41_" d="M42,43c-0.6,0-1,0.4-1,1v2c0,0.6,0.4,1,1,1s1-0.4,1-1v-2C43,43.4,42.6,43,42,43z"/>
	</defs>
	<clipPath id="SVGID_42_">
		<use xlink:href="#SVGID_41_"  style="overflow:visible;"/>
	</clipPath>
	<g class="st20">
		<defs>
			<rect id="SVGID_43_" x="-1316" y="-197" width="1559" height="2256"/>
		</defs>
		<clipPath id="SVGID_44_">
			<use xlink:href="#SVGID_43_"  style="overflow:visible;"/>
		</clipPath>
		<rect x="36" y="38" class="st21" width="12" height="14"/>
	</g>
</g>
<g>
	<defs>
		<path id="SVGID_45_" d="M47,43c-0.6,0-1,0.4-1,1v2c0,0.6,0.4,1,1,1s1-0.4,1-1v-2C48,43.4,47.6,43,47,43z"/>
	</defs>
	<clipPath id="SVGID_46_">
		<use xlink:href="#SVGID_45_"  style="overflow:visible;"/>
	</clipPath>
	<g class="st22">
		<defs>
			<rect id="SVGID_47_" x="-1316" y="-197" width="1559" height="2256"/>
		</defs>
		<clipPath id="SVGID_48_">
			<use xlink:href="#SVGID_47_"  style="overflow:visible;"/>
		</clipPath>
		<rect x="41" y="38" class="st23" width="12" height="14"/>
	</g>
</g>
<g>
	<defs>
		<path id="SVGID_49_" d="M52,43c-0.6,0-1,0.4-1,1v2c0,0.6,0.4,1,1,1s1-0.4,1-1v-2C53,43.4,52.6,43,52,43z"/>
	</defs>
	<clipPath id="SVGID_50_">
		<use xlink:href="#SVGID_49_"  style="overflow:visible;"/>
	</clipPath>
	<g class="st24">
		<defs>
			<rect id="SVGID_51_" x="-1316" y="-197" width="1559" height="2256"/>
		</defs>
		<clipPath id="SVGID_52_">
			<use xlink:href="#SVGID_51_"  style="overflow:visible;"/>
		</clipPath>
		<rect x="46" y="38" class="st25" width="12" height="14"/>
	</g>
</g>
<g>
	<defs>
		<path id="SVGID_53_" d="M41.9,14.7c0.3-0.4,0.3-1.1-0.1-1.4c-0.8-0.6-1.6-1.2-2.5-1.6c-0.5-0.3-1.1-0.1-1.4,0.4
			c-0.3,0.5-0.1,1.1,0.4,1.4c0.8,0.4,1.5,0.9,2.1,1.4c0.2,0.2,0.4,0.2,0.6,0.2C41.4,15.1,41.7,14.9,41.9,14.7z"/>
	</defs>
	<clipPath id="SVGID_54_">
		<use xlink:href="#SVGID_53_"  style="overflow:visible;"/>
	</clipPath>
	<g class="st26">
		<defs>
			<rect id="SVGID_55_" x="-1316" y="-197" width="1559" height="2256"/>
		</defs>
		<clipPath id="SVGID_56_">
			<use xlink:href="#SVGID_55_"  style="overflow:visible;"/>
		</clipPath>
		<rect x="32.8" y="6.5" class="st27" width="14.3" height="13.5"/>
	</g>
</g>
<g>
	<defs>
		<path id="SVGID_57_" d="M35.2,10.2c-3.6-0.8-7.5-0.2-10.7,1.5c-0.5,0.3-0.7,0.9-0.4,1.4c0.2,0.3,0.5,0.5,0.9,0.5
			c0.2,0,0.3,0,0.5-0.1c2.8-1.5,6.2-2,9.3-1.3c0.5,0.1,1.1-0.2,1.2-0.8C36.1,10.8,35.8,10.3,35.2,10.2z"/>
	</defs>
	<clipPath id="SVGID_58_">
		<use xlink:href="#SVGID_57_"  style="overflow:visible;"/>
	</clipPath>
	<g class="st28">
		<defs>
			<rect id="SVGID_59_" x="-1316" y="-197" width="1559" height="2256"/>
		</defs>
		<clipPath id="SVGID_60_">
			<use xlink:href="#SVGID_59_"  style="overflow:visible;"/>
		</clipPath>
		<rect x="19" y="4.8" class="st29" width="22" height="13.7"/>
	</g>
</g>
<g>
	<defs>
		<path id="SVGID_61_" d="M58,45v-1c0-0.6-0.4-1-1-1s-1,0.4-1,1v2c0,0.3,0.1,0.5,0.3,0.7C54.6,48.1,52.4,49,50,49H16
			c-3,0-5.8-1-8.1-2.6C8,46.3,8,46.1,8,46v-2c0-0.6-0.4-1-1-1s-1,0.4-1,1v0.8c-2.5-2.5-4-6-4-9.8c0-3.6,1.3-6.8,3.5-9.3
			C8.2,28.4,11.9,30,16,30c5,0,9.6-2.4,12.4-6.5c0.2-0.3,0.2-0.7,0-1.1c-0.2-0.3-0.6-0.5-1-0.5C26.9,22,26.4,22,26,22
			c-4.1,0-7.8-2.1-10-5.3c1.6-3.1,4.2-5.8,7.3-7.5C26,7.8,29,7,32,7c9.9,0,18,8.1,18,18c0,0.6-0.1,1.3-0.1,2c-0.9,0-1.7,0.1-2.6,0.3
			c-0.5,0.1-0.9,0.7-0.7,1.2c0.1,0.5,0.7,0.9,1.2,0.7c1-0.2,2-0.3,3-0.2c5.2,0.4,9.3,4.7,9.3,10C60,41.2,59.3,43.3,58,45z M3,15
			C3,8.3,8,2.9,14.5,2.1C12.9,4.4,12,7.2,12,10c0,2.5,0.6,4.8,1.8,6.8c0,0,0.1,0.2,0.3,0.4c0,0,0,0,0,0c0.3,0.5,0.7,1,1.1,1.5
			c0,0,0,0,0,0c2.4,3,6.1,5,10.3,5.2c-2.4,2.5-5.8,4-9.4,4c-3.5,0-6.7-1.4-9.1-3.7c-0.5-0.5-0.9-1-1.3-1.5C4,20.6,3,17.9,3,15z
			 M53.1,27.4C53.1,27.4,53,27.4,53.1,27.4c-0.5-0.1-0.8-0.2-1.2-0.3C52,26.4,52,25.7,52,25c0-11-9-20-20-20c-3.4,0-6.7,0.8-9.6,2.5
			c-3.1,1.7-5.7,4.2-7.5,7.2c-0.6-1.4-0.9-3-0.9-4.6c0-3.1,1.2-6,3.3-8.3c0.3-0.3,0.4-0.7,0.2-1.1C17.4,0.3,17,0,16.6,0l-0.2,0
			c-0.1,0-0.3,0-0.4,0C7.7,0,1,6.7,1,15c0,3.5,1.2,6.7,3.2,9.2C1.6,27.1,0,30.9,0,35c0,8.8,7.2,16,16,16h34c6.6,0,12-5.4,12-12
			C62,33.5,58.2,28.8,53.1,27.4z"/>
	</defs>
	<clipPath id="SVGID_62_">
		<use xlink:href="#SVGID_61_"  style="overflow:visible;"/>
	</clipPath>
	<g class="st30">
		<defs>
			<rect id="SVGID_63_" x="-1316" y="-197" width="1559" height="2256"/>
		</defs>
		<clipPath id="SVGID_64_">
			<use xlink:href="#SVGID_63_"  style="overflow:visible;"/>
		</clipPath>
		<rect x="-5" y="-5" class="st31" width="72" height="61"/>
	</g>
</g>
</svg>
