com\dm\common\adapter\CommonAdapterResource.class
com\dm\common\attachment\UploadAttachments.class
com\dm\common\notification\NotificationsAdapterResource.class
com\dm\common\utils\Base64.class
com\dm\common\utils\EncryptionUtil$EncryptionKeyPair.class
com\dm\common\utils\EncryptionUtil.class
com\dm\common\adapter\CommonAdapterApplication.class
com\dm\common\config\GlobalConfig.class
com\dm\common\notification\Calculator.class
