<?xml version="1.0" encoding="utf-8"?>
<!-- Generator: Adobe Illustrator 22.1.0, SVG Export Plug-In . SVG Version: 6.00 Build 0)  -->
<svg version="1.1" id="Calque_1" xmlns="http://www.w3.org/2000/svg" xmlns:xlink="http://www.w3.org/1999/xlink" x="0px" y="0px"
	 viewBox="0 0 58 58" style="enable-background:new 0 0 58 58;" xml:space="preserve">
<style type="text/css">
	.st0{clip-path:url(#SVGID_2_);}
	.st1{clip-path:url(#SVGID_4_);fill:#4A4A4A;}
</style>
<g>
	<defs>
		<path id="SVGID_1_" d="M29,42c-0.6,0-1,0.4-1,1v2c0,0.6,0.4,1,1,1s1-0.4,1-1v-2C30,42.4,29.6,42,29,42z M39.1,37.7
			c-0.3,0-0.5,0.1-0.7,0.3c-0.2,0.2-0.2,0.4-0.3,0.6c-0.2,0.4-0.1,0.8,0.2,1.1l1.3,1.3c0.2,0.2,0.4,0.3,0.7,0.3s0.5-0.1,0.7-0.3
			c0,0,0.1-0.1,0.1-0.1c0,0,0.1,0,0.1-0.1c0.4-0.4,0.4-1,0-1.4L39.8,38C39.6,37.8,39.3,37.7,39.1,37.7z M42,33.2
			c-0.4,0-0.8,0.2-0.9,0.6c-0.2,0.5,0,1.1,0.6,1.3l1.9,0.8c0.1,0.1,0.3,0.1,0.4,0.1c0.4,0,0.8-0.2,0.9-0.6c0.2-0.5,0-1.1-0.6-1.3
			l-1.9-0.8C42.2,33.3,42.1,33.2,42,33.2z M43,28c-0.6,0-1,0.4-1,1s0.4,1,1,1h2c0.6,0,1-0.4,1-1s-0.4-1-1-1H43z M13,28
			c-0.6,0-1,0.4-1,1s0.4,1,1,1h2c0.6,0,1-0.4,1-1s-0.4-1-1-1H13z M43.6,21.5c-0.1,0-0.3,0-0.4,0.1l-1.8,0.8
			c-0.5,0.2-0.7,0.8-0.5,1.3c0.2,0.4,0.5,0.6,0.9,0.6c0.1,0,0.3,0,0.4-0.1l1.8-0.8c0.5-0.2,0.7-0.8,0.5-1.3
			C44.4,21.7,44,21.5,43.6,21.5z M29,18c-0.6,0-1,0.4-1,1v8.3c-0.6,0.3-1,1-1,1.7c0,1.1,0.9,2,2,2c0.2,0,0.3,0,0.5-0.1l6.3,6.3
			c0.2,0.2,0.4,0.3,0.7,0.3s0.5-0.1,0.7-0.3c0.4-0.4,0.4-1,0-1.4l-6.3-6.3c0-0.2,0.1-0.3,0.1-0.5c0-0.7-0.4-1.4-1-1.7V19
			C30,18.4,29.6,18,29,18z M40.1,16.5c-0.3,0-0.5,0.1-0.7,0.3L38,18.2c-0.4,0.4-0.4,1,0,1.4c0.2,0.2,0.4,0.3,0.7,0.3
			c0.3,0,0.5-0.1,0.7-0.3l1.4-1.4c0.4-0.4,0.4-1,0-1.4C40.6,16.6,40.4,16.5,40.1,16.5z M35,13.2c-0.4,0-0.8,0.2-0.9,0.6l-0.8,1.9
			c-0.2,0.5,0,1.1,0.6,1.3c0.1,0,0.3,0.1,0.4,0.1c0.4,0,0.8-0.2,0.9-0.6l0.8-1.9c0.2-0.5,0-1.1-0.6-1.3C35.2,13.2,35.1,13.2,35,13.2
			z M29,12c-0.6,0-1,0.4-1,1v2c0,0.6,0.4,1,1,1s1-0.4,1-1v-2C30,12.4,29.6,12,29,12z M36.5,7.3c-0.4,0-0.7,0.3-0.9,0.7
			c-0.2,0.5,0.1,1.1,0.6,1.3c0.8,0.3,1.6,0.6,2.3,1c0.1,0.1,0.3,0.1,0.5,0.1c0.4,0,0.7-0.2,0.9-0.5c0.3-0.5,0.1-1.1-0.4-1.3
			c-0.8-0.4-1.7-0.8-2.5-1.1C36.8,7.4,36.7,7.3,36.5,7.3z M29,6C16.3,6,6,16.3,6,29s10.3,23,23,23s23-10.3,23-23
			c0-7.1-3.2-13.7-8.8-18.1c-0.4-0.3-1.1-0.3-1.4,0.2c-0.3,0.4-0.3,1.1,0.2,1.4c5.1,4,8,10,8,16.5c0,11.6-9.4,21-21,21S8,40.6,8,29
			S17.4,8,29,8c1,0,2.1,0.1,3.1,0.2c0.6,0.1,1.1-0.3,1.1-0.8c0.1-0.5-0.3-1.1-0.8-1.1C31.3,6.1,30.1,6,29,6z M29,2
			c14.9,0,27,12.1,27,27S43.9,56,29,56S2,43.9,2,29S14.1,2,29,2z M29,0C13,0,0,13,0,29s13,29,29,29s29-13,29-29S45,0,29,0z"/>
	</defs>
	<use xlink:href="#SVGID_1_"  style="overflow:visible;fill:#4A4A4A;"/>
	<clipPath id="SVGID_2_">
		<use xlink:href="#SVGID_1_"  style="overflow:visible;"/>
	</clipPath>
	<g class="st0">
		<defs>
			<rect id="SVGID_3_" x="-1239" y="-1074" width="1559" height="2256"/>
		</defs>
		<use xlink:href="#SVGID_3_"  style="overflow:visible;fill:#4A4A4A;"/>
		<clipPath id="SVGID_4_">
			<use xlink:href="#SVGID_3_"  style="overflow:visible;"/>
		</clipPath>
		<rect x="-5" y="-5" class="st1" width="68" height="68"/>
	</g>
</g>
</svg>
