D:\DM-MFP8\2018_ess_dm247\adapters\MobileFirstBankAdapter\src\main\java\com\mobilefirstbank\resources\AppointmentsResource.java
D:\DM-MFP8\2018_ess_dm247\adapters\MobileFirstBankAdapter\src\main\java\com\mobilefirstbank\BranchManager.java
D:\DM-MFP8\2018_ess_dm247\adapters\MobileFirstBankAdapter\src\main\java\com\mobilefirstbank\MobileFirstBankApplication.java
D:\DM-MFP8\2018_ess_dm247\adapters\MobileFirstBankAdapter\src\main\java\com\mobilefirstbank\models\Location.java
D:\DM-MFP8\2018_ess_dm247\adapters\MobileFirstBankAdapter\src\main\java\com\mobilefirstbank\models\Transaction.java
D:\DM-MFP8\2018_ess_dm247\adapters\MobileFirstBankAdapter\src\main\java\com\mobilefirstbank\resources\BranchesResource.java
D:\DM-MFP8\2018_ess_dm247\adapters\MobileFirstBankAdapter\src\main\java\com\mobilefirstbank\AccountManager.java
D:\DM-MFP8\2018_ess_dm247\adapters\MobileFirstBankAdapter\src\main\java\com\mobilefirstbank\resources\AccountsResource.java
D:\DM-MFP8\2018_ess_dm247\adapters\MobileFirstBankAdapter\src\main\java\com\mobilefirstbank\models\Account.java
D:\DM-MFP8\2018_ess_dm247\adapters\MobileFirstBankAdapter\src\main\java\com\mobilefirstbank\models\Branch.java
