[
  { "Letter": "أ" },
  { "id": 0, "title": "عطل كهربائي أفرع البلدية", "category_id": 11 },
  { "id": 1, "title": "عطل أجهزة الحريق", "category_id": 11 },
  { "id": 2, "title": "عطل أعمال صحية", "category_id": 11 },
  { "id": 3, "title": "أمن مباني بلدية دبي", "category_id": 11 },
  { "id": 4, "title": "حيوانات أليفة مفقودة", "category_id": 2 },
  { "id": 5, "title": "ألعاب الأطفال", "category_id": 5 },
  { "id": 6, "title": "أغذية فاسدة", "category_id": 8 },
  { "id": 7, "title": "طوارئ بيئية/ أغذية", "category_id": 8 },
  { "id": 8, "title": "أغذية منتهية الصلاحية", "category_id": 8 },
  { "id": 9, "title": "أشجار حاجبة للرؤية/ طرق رئيسية", "category_id": 6 },
  { "id": 10, "title": "أضرار بالمرافق/المنشآت البحرية", "category_id": 6 },
  { "id": 11, "title": "صيانة ألعاب الحدائق", "category_id": 11 },
  { "id": 12, "title": "أغطية مخارج الصرف الصحي", "category_id": 5 },
  { "id": 13, "title": "أسلوب قيادة المركبات", "category_id": 11 },
  { "Letter": "ب" },
  { "id": 14, "title": "علاج حيوان مريض بالمزارع/العزب", "category_id": 2 },
  { "id": 15, "title": "أمن مباني بلدية دبي", "category_id": 11 },
  { "id": 16, "title": "مخالفة قوانين الرفق بالحيوان", "category_id": 2 },
  { "id": 17, "title": "طوارئ بيئية/ أغذية", "category_id": 8 },
  { "id": 18, "title": "طوارئ بيئية/ بيئة وصحة عامة", "category_id": 5 },
  { "id": 19, "title": "إصطدام السفن بالشاطئ/ الحائط", "category_id": 6 },
  { "id": 20, "title": "أضرار بالمرافق/المنشآت البحرية", "category_id": 6 },
  { "id": 21, "title": "حفر آبار إرتوازية بدون ترخيص", "category_id": 6 },
  { "id": 22, "title": "تلوث بري", "category_id": 6 },
  { "id": 23, "title": "تلوث بحري", "category_id": 6 },
  { "id": 24, "title": "تكدس النفايات العامة بالحاويات", "category_id": 4 },
  { "id": 25, "title": "البناء بدون ترخيص", "category_id": 7 },
  { "id": 26, "title": "خطأ إملائي بلوحة إعلانية", "category_id": 7 },
  { "id": 27, "title": "مخلفات بناء تحت الإنشاء", "category_id": 7 },
  { "Letter": "ت" },
  { "id": 28, "title": "تلقيح صناعي", "category_id": 2 },
  { "id": 29, "title": "تقليم الأشجار لمنازل الأفراد", "category_id": 6 },
  { "id": 30, "title": "تربية حيوانات في المناطق السكنية", "category_id": 2 },
  { "id": 31, "title": "تكاثرالحشرات في المواقع العامة", "category_id": 1 },
  { "id": 32, "title": "تخزين المواد الغذائية/الرصيف", "category_id": 8 },
  { "id": 33, "title": "تلوث جوي", "category_id": 6 },
  { "id": 34, "title": "حفر آبار إرتوازية بدون ترخيص", "category_id": 6 },
  { "id": 35, "title": "تلوث بري", "category_id": 6 },
  { "id": 36, "title": "تلوث بحري", "category_id": 6 },
  { "id": 37, "title": "لا توجد مياه ري", "category_id": 3 },
  { "id": 38, "title": "تجمع رمال بسبب مشاريع صرف صحي", "category_id": 11 },
  { "id": 39, "title": "تسرب مياه الري", "category_id": 3 },
  { "id": 40, "title": "تكدس النفايات العامة بالحاويات", "category_id": 4 },
  { "id": 41, "title": "عدم وجود لوحة ترخيص البناء", "category_id": 7 },
  { "id": 42, "title": "تأثير مبنى على المظهر العام", "category_id": 7 },
  { "id": 43, "title": "البناء بدون ترخيص", "category_id": 7 },
  { "id": 44, "title": "تغير استخدام المبنى", "category_id": 7 },
  { "id": 45, "title": "تلف لوحة إعلانية", "category_id": 7 },
  { "id": 46, "title": "تساقط مواد في مبني تحت الإنشاء", "category_id": 7 },
  { "id": 47, "title": "تقرير معاينة بسبب الضرر 1", "category_id": 10 },
  { "id": 48, "title": "تقرير معاينة بسبب الضرر 2", "category_id": 7 },
  { "Letter": "ج" },
  { "id": 49, "title": "تلوث جوي", "category_id": 6 },
  { "id": 50, "title": "إغلاق مدخل جراء مشاريع صرف صحي", "category_id": 11 },
  { "Letter": "ح" },
  { "id": 51, "title": "حتا- زراعة", "category_id": 6 },
  { "id": 52, "title": "حتا-تصريف مياه امطار موسمية", "category_id": 3 },
  { "id": 53, "title": "حتا - سحب مياه المجاري", "category_id": 3 },
  { "id": 54, "title": "حتا-خدمات الآليات الثقيلة", "category_id": 12 },
  { "id": 55, "title": "علاج حيوان مريض بالمزارع/العزب", "category_id": 2 },
  { "id": 56, "title": "خدمات حاويات النفايات", "category_id": 4 },
  { "id": 57, "title": "تربية حيوانات في المناطق السكنية", "category_id": 2 },
  { "id": 58, "title": "حيوانات أليفة مفقودة", "category_id": 2 },
  { "id": 59, "title": "حتا - حيوانات سائبة", "category_id": 2 },
  { "id": 60, "title": "حيوانات كبيرة سائبة", "category_id": 2 },
  { "id": 61, "title": "مخالفات مربي حيوانات", "category_id": 2 },
  { "id": 62, "title": "حوادث السلامة المهنية والعامة", "category_id": 5 },
  { "id": 63, "title": "أشجار حاجبة للرؤية/ طرق رئيسية", "category_id": 6 },
  { "id": 64, "title": "حفر آبار إرتوازية بدون ترخيص", "category_id": 6 },
  { "id": 65, "title": "حتا-انسدادات المجاري", "category_id": 3 },
  { "id": 66, "title": "حوادث الطرق السريعة", "category_id": 4 },
  { "id": 67, "title": "حوادث الطرق الداخلية", "category_id": 4 },
  { "Letter": "خ" },
  { "id": 68, "title": "خدمة إزالة النفايات الزراعية", "category_id": 4 },
  { "id": 69, "title": "خدمات حاويات النفايات", "category_id": 4 },
  { "id": 70, "title": "صيانة مسطحات خضراء/ طريق عام", "category_id": 6 },
  { "id": 71, "title": "خطأ إملائي بلوحة إعلانية", "category_id": 7 },
  { "Letter": "د" },
  { "id": 72, "title": "أمن مباني بلدية دبي", "category_id": 11 },
  { "id": 73, "title": "مساكن عمال داخل منشآت صناعية", "category_id": 5 },
  { "Letter": "ر" },
  { "id": 74, "title": "طلب رش الحشرات المنزلية", "category_id": 1 },
  { "id": 75, "title": "طلب رش الآفات الزراعية", "category_id": 1 },
  { "id": 76, "title": "أشجار حاجبة للرؤية/ طرق رئيسية", "category_id": 6 },
  { "id": 77, "title": "انبعاث روائح كريهة", "category_id": 11 },
  { "id": 78, "title": "لا توجد مياه ري", "category_id": 3 },
  { "id": 79, "title": "تجمع رمال بسبب مشاريع صرف صحي", "category_id": 11 },
  { "Letter": "ز" },
  { "id": 80, "title": "حتا- زراعة", "category_id": 6 },
  { "Letter": "س" },
  { "id": 81, "title": "حتا - سحب مياه المجاري", "category_id": 3 },
  { "id": 82, "title": "سحب مياه الأمطار", "category_id": 4 },
  { "id": 83, "title": "قطط سائبة", "category_id": 2 },
  { "id": 84, "title": "عطل كهربائي سكن موظفين", "category_id": 11 },
  { "id": 85, "title": "حتا - حيوانات سائبة", "category_id": 2 },
  { "id": 86, "title": "كلاب سائبة", "category_id": 2 },
  { "id": 87, "title": "حيوانات كبيرة سائبة", "category_id": 2 },
  { "id": 88, "title": "سلامة مواد التطهير والتعقيم", "category_id": 5 },
  { "id": 89, "title": "سلامة المكملات الصحية", "category_id": 5 },
  { "id": 90, "title": "إشتراطات سلامة الأحواض", "category_id": 5 },
  { "id": 91, "title": "سلامة مستحضرات التجميل", "category_id": 5 },
  { "id": 92, "title": "سوء استخدام الشاطئ من الزوار", "category_id": 6 },
  { "id": 93, "title": "سقوط الأشجار/الطرق الرئيسية", "category_id": 4 },
  { "id": 94, "title": "سقوط الأشجارعلى الطرق الداخلية", "category_id": 6 },
  { "id": 95, "title": "سوء وضع مواد ومعدات البناء", "category_id": 7 },
  { "id": 96, "title": "سكن العزاب في المناطق السكنية", "category_id": 7 },
  { "Letter": "ش" },
  { "id": 97, "title": "شكاوي علي المؤسسات البيطرية", "category_id": 2 },
  { "id": 98, "title": "إنسداد شبكة الصرف الصحي", "category_id": 3 },
  { "Letter": "ص" },
  { "id": 99, "title": "تلقيح صناعي", "category_id": 2 },
  { "id": 100, "title": "عطل أعمال صحية", "category_id": 11 },
  { "id": 101, "title": "صيانة مرافق الحدائق العامة", "category_id": 6 },
  { "id": 102, "title": "مساكن عمال داخل منشآت صناعية", "category_id": 5 },
  { "id": 103, "title": "صيانة الملاعب الرياضية", "category_id": 11 },
  { "id": 104, "title": "صيانة ألعاب الحدائق", "category_id": 11 },
  { "id": 105, "title": "صيانة مسطحات خضراء/ طريق عام", "category_id": 6 },
  { "id": 106, "title": "تجمع رمال بسبب مشاريع صرف صحي", "category_id": 11 },
  { "id": 107, "title": "إغلاق مدخل جراء مشاريع صرف صحي", "category_id": 11 },
  { "id": 108, "title": "عدم إعادة الإنترلوك/مشاريع صرف", "category_id": 3 },
  { "Letter": "ض" },
  { "id": 109, "title": "ضجيج", "category_id": 6 },
  { "id": 110, "title": "الضغط ضعيف", "category_id": 3 },
  { "Letter": "ط" },
  { "id": 111, "title": "طلب رش الحشرات المنزلية", "category_id": 1 },
  { "id": 112, "title": "طلب رش الآفات الزراعية", "category_id": 1 },
  { "id": 113, "title": "طوارئ بيئية/ أغذية", "category_id": 8 },
  { "id": 114, "title": "طوارئ بيئية/ بيئة وصحة عامة", "category_id": 5 },
  { "id": 115, "title": "أشجار حاجبة للرؤية/ طرق رئيسية", "category_id": 6 },
  { "id": 116, "title": "صيانة مسطحات خضراء/ طريق عام", "category_id": 6 },
  { "id": 117, "title": "طلب إزالة المركبات المهملة", "category_id": 4 },
  { "Letter": "ع" },
  { "id": 118, "title": "كل البرامج الوقائية عدى الرش", "category_id": 2 },
  { "id": 119, "title": "علاج حيوان مريض بالمزارع/العزب", "category_id": 2 },
  { "id": 120, "title": "عطل التكييف", "category_id": 11 },
  { "id": 121, "title": "عطل الأبواب والشبابيك", "category_id": 11 },
  { "id": 122, "title": "عطل كهربائي أفرع البلدية", "category_id": 11 },
  { "id": 123, "title": "عطل كهربائي سكن موظفين", "category_id": 11 },
  { "id": 124, "title": "عطل أجهزة الحريق", "category_id": 11 },
  { "id": 125, "title": "عطل أعمال صحية", "category_id": 11 },
  { "id": 126, "title": "عطل المصاعد", "category_id": 11 },
  { "id": 127, "title": "مساكن عمال داخل منشآت صناعية", "category_id": 5 },
  { "id": 128, "title": "عدة عائلات في منزل واحد", "category_id": 7 },
  { "Letter": "غ" },
  { "id": 129, "title": "غش في المواصفات الغذائية", "category_id": 8 },
  { "id": 130, "title": " وضعية الحاجزالخارجي غيرمناسبة", "category_id": 7 },
  { "Letter": "ف" },
  { "id": 131, "title": "فحوصات مخبرية", "category_id": 2 },
  { "id": 132, "title": "أغذية فاسدة", "category_id": 8 },
  { "Letter": "ق" },
  { "id": 133, "title": "قطط سائبة", "category_id": 2 },
  { "id": 134, "title": "مخالفة قوانين الرفق بالحيوان", "category_id": 2 },
  { "id": 135, "title": "أسلوب قيادة المركبات", "category_id": 11 },
  { "Letter": "ك" },
  { "id": 136, "title": "عطل كهربائي أفرع البلدية", "category_id": 11 },
  { "id": 137, "title": "عطل كهربائي سكن موظفين", "category_id": 11 },
  { "id": 138, "title": "كلاب سائبة", "category_id": 2 },
  { "id": 139, "title": "حيوانات كبيرة سائبة", "category_id": 2 },
  { "id": 140, "title": "انبعاث روائح كريهة", "category_id": 11 },
  { "Letter": "ل" },
  { "id": 141, "title": "تقليم الأشجار لمنازل الأفراد", "category_id": 6 },
  { "id": 142, "title": "الاشتراطات الصحية للمباني", "category_id": 5 },
  { "id": 143, "title": "أشجار حاجبة للرؤية/ طرق رئيسية", "category_id": 6 },
  { "id": 144, "title": "عدم وجود لوحة ترخيص البناء", "category_id": 7 },
  { "id": 145, "title": "تلف لوحة إعلانية", "category_id": 7 },
  { "Letter": "م" },
  { "id": 146, "title": "حتا-تصريف مياه امطار موسمية", "category_id": 3 },
  { "id": 147, "title": "مكافحة الطفيليات الخارجيةرش", "category_id": 2 },
  { "id": 148, "title": "حتا - سحب مياه المجاري", "category_id": 3 },
  { "id": 149, "title": "سحب مياه الأمطار", "category_id": 4 },
  { "id": 150, "title": "فحوصات مخبرية", "category_id": 2 },
  { "id": 151, "title": "علاج حيوان مريض بالمزارع/العزب", "category_id": 2 },
  { "id": 152, "title": "عطل كهربائي سكن موظفين", "category_id": 11 },
  { "id": 153, "title": "أمن مباني بلدية دبي", "category_id": 11 },
  { "id": 154, "title": "ملاحظات على الأسواق العامة", "category_id": 11 },
  { "id": 155, "title": "صيانة مرافق الحدائق العامة", "category_id": 6 },
  { "id": 156, "title": "حيوانات أليفة مفقودة", "category_id": 2 },
  { "id": 157, "title": "مخالفات مربي حيوانات", "category_id": 2 },
  { "id": 158, "title": "مخالفة قوانين الرفق بالحيوان", "category_id": 2 },
  { "id": 159, "title": "متسولين وباعة ومغسلي السيارات", "category_id": 5 },
  { "id": 160, "title": "اشتراطات الصحية/ مساكن العمال", "category_id": 5 },
  { "id": 161, "title": "أغذية منتهية الصلاحية", "category_id": 8 },
  { "id": 162, "title": "مخالفات المؤسسات الصحية", "category_id": 5 },
  { "id": 163, "title": "مساكن عمال داخل منشآت صناعية", "category_id": 5 },
  { "id": 164, "title": "سلامة مواد التطهير والتعقيم", "category_id": 5 },
  { "id": 165, "title": "مخالفات التدخين", "category_id": 5 },
  { "id": 166, "title": "سلامة مستحضرات التجميل", "category_id": 5 },
  { "id": 167, "title": "نظافة مرافق الحدائق", "category_id": 6 },
  { "id": 168, "title": "صيانة مسطحات خضراء/ طريق عام", "category_id": 6 },
  { "id": 169, "title": "لا توجد مياه ري", "category_id": 3 },
  { "id": 170, "title": "تجمع رمال بسبب مشاريع صرف صحي", "category_id": 11 },
  { "id": 171, "title": "أغطية مخارج الصرف الصحي", "category_id": 5 },
  { "id": 172, "title": "إغلاق مدخل جراء مشاريع صرف صحي", "category_id": 11 },
  { "id": 173, "title": "تسرب مياه الري", "category_id": 3 },
  { "id": 174, "title": "مخلفات الطرق السريعة", "category_id": 4 },
  { "id": 175, "title": "مخلفات النظافة العامة", "category_id": 4 },
  { "id": 176, "title": "تأثير مبنى على المظهر العام", "category_id": 7 },
  { "id": 177, "title": "تساقط مواد في مبني تحت الإنشاء", "category_id": 7 },
  { "id": 178, "title": "سوء وضع مواد ومعدات البناء", "category_id": 7 },
  { "id": 179, "title": "عدة عائلات في منزل واحد", "category_id": 7 },
  { "id": 180, "title": "مخلفات بناء تحت الإنشاء", "category_id": 7 },
  { "id": 181, "title": "ملاحظة على محطات المعالجة", "category_id": 3 },
  { "id": 182, "title": "تقرير معاينة بسبب الضرر 1", "category_id": 10 },
  { "id": 183, "title": "تقرير معاينة بسبب الضرر 2", "category_id": 7 },
  { "Letter": "ن" },
  { "id": 184, "title": "نظافة المؤسسات الغذائية", "category_id": 8 },
  { "id": 185, "title": "نوعية الهواء الداخلي", "category_id": 5 },
  { "id": 186, "title": "نظافة مرافق الحدائق", "category_id": 6 },
  { "id": 187, "title": "نظافة المرافق الصحية", "category_id": 5 },
  { "Letter": "و" },
  { "id": 188, "title": "عطل الأبواب والشبابيك", "category_id": 11 },
  { "id": 189, "title": "متسولين وباعة ومغسلي السيارات", "category_id": 5 },
  { "id": 190, "title": "طوارئ بيئية/ بيئة وصحة عامة", "category_id": 5 },
  { "id": 191, "title": "الطوارئ البيئي/مباني وتخطيط", "category_id": 7 },
  { "id": 192, "title": "حوادث السلامة المهنية والعامة", "category_id": 5 },
  { "id": 193, "title": "سلامة مواد التطهير والتعقيم", "category_id": 5 },
  { "id": 194, "title": "عدم وجود لوحة ترخيص البناء", "category_id": 7 },
  { "id": 195, "title": " وضعية الحاجزالخارجي غيرمناسبة", "category_id": 7 },
  { "id": 196, "title": "سوء وضع مواد ومعدات البناء", "category_id": 7 }
]
