<?xml version="1.0" encoding="utf-8"?>
<!-- Generator: Adobe Illustrator 22.1.0, SVG Export Plug-In . SVG Version: 6.00 Build 0)  -->
<svg version="1.1" id="Calque_1" xmlns="http://www.w3.org/2000/svg" xmlns:xlink="http://www.w3.org/1999/xlink" x="0px" y="0px"
	 viewBox="0 0 16.9 7.1" style="enable-background:new 0 0 16.9 7.1;" xml:space="preserve">
<style type="text/css">
	.st0{fill:#D5EEFE;}
	.st1{opacity:0.7;fill:#979797;}
	.st2{fill:none;}
</style>
<polygon class="st0" points="0,1.1 0.2,0 16.9,0 16.9,7.1 "/>
<polygon class="st1" points="0.1,0.3 16.1,5.9 16.1,0 16.9,0 16.9,6 16.9,7.1 0,1.1 "/>
<path class="st2" d="M16.1,6.3"/>
<path class="st2" d="M16.1,0"/>
</svg>
