<?xml version="1.0" encoding="utf-8"?>
<!-- Generator: Adobe Illustrator 22.1.0, SVG Export Plug-In . SVG Version: 6.00 Build 0)  -->
<svg version="1.1" id="Calque_1" xmlns="http://www.w3.org/2000/svg" xmlns:xlink="http://www.w3.org/1999/xlink" x="0px" y="0px"
	 viewBox="0 0 65 65" style="enable-background:new 0 0 65 65;" xml:space="preserve">
<style type="text/css">
	.st0{clip-path:url(#SVGID_2_);}
	.st1{clip-path:url(#SVGID_4_);fill:#FFE46C;}
	.st2{clip-path:url(#SVGID_6_);}
	.st3{clip-path:url(#SVGID_8_);fill:#FFE46C;}
	.st4{clip-path:url(#SVGID_10_);}
	.st5{clip-path:url(#SVGID_12_);fill:#FFF68C;}
	.st6{clip-path:url(#SVGID_14_);}
	.st7{clip-path:url(#SVGID_16_);fill:#FFF68C;}
	.st8{clip-path:url(#SVGID_18_);}
	.st9{clip-path:url(#SVGID_20_);fill:#B7CDFF;}
	.st10{clip-path:url(#SVGID_22_);}
	.st11{clip-path:url(#SVGID_24_);fill:#CEE0FF;}
	.st12{clip-path:url(#SVGID_26_);}
	.st13{clip-path:url(#SVGID_28_);fill:#A2B8EA;}
	.st14{clip-path:url(#SVGID_30_);}
	.st15{clip-path:url(#SVGID_32_);fill:#A361C7;}
	.st16{clip-path:url(#SVGID_34_);}
	.st17{clip-path:url(#SVGID_36_);fill:#A361C7;}
	.st18{clip-path:url(#SVGID_38_);}
	.st19{clip-path:url(#SVGID_40_);fill:#A361C7;}
	.st20{clip-path:url(#SVGID_42_);}
	.st21{clip-path:url(#SVGID_44_);fill:#A361C7;}
	.st22{clip-path:url(#SVGID_46_);}
	.st23{clip-path:url(#SVGID_48_);fill:#A361C7;}
	.st24{clip-path:url(#SVGID_50_);}
	.st25{clip-path:url(#SVGID_52_);fill:#A361C7;}
	.st26{clip-path:url(#SVGID_54_);}
	.st27{clip-path:url(#SVGID_56_);fill:#A361C7;}
	.st28{clip-path:url(#SVGID_58_);}
	.st29{clip-path:url(#SVGID_60_);fill:#A361C7;}
	.st30{clip-path:url(#SVGID_62_);}
	.st31{clip-path:url(#SVGID_64_);fill:#A361C7;}
	.st32{clip-path:url(#SVGID_66_);}
	.st33{clip-path:url(#SVGID_68_);fill:#A361C7;}
	.st34{clip-path:url(#SVGID_70_);}
	.st35{clip-path:url(#SVGID_72_);fill:#A361C7;}
	.st36{clip-path:url(#SVGID_74_);}
	.st37{clip-path:url(#SVGID_76_);fill:#A361C7;}
	.st38{clip-path:url(#SVGID_78_);}
	.st39{clip-path:url(#SVGID_80_);fill:#A361C7;}
	.st40{clip-path:url(#SVGID_82_);}
	.st41{clip-path:url(#SVGID_84_);fill:#A361C7;}
	.st42{clip-path:url(#SVGID_86_);}
	.st43{clip-path:url(#SVGID_88_);fill:#A361C7;}
	.st44{clip-path:url(#SVGID_90_);}
	.st45{clip-path:url(#SVGID_92_);fill:#A361C7;}
</style>
<g>
	<defs>
		<polygon id="SVGID_1_" points="41.1,42 25.5,42 18,55 23,55 17.9,63.2 39,51 32,51 		"/>
	</defs>
	<clipPath id="SVGID_2_">
		<use xlink:href="#SVGID_1_"  style="overflow:visible;"/>
	</clipPath>
	<g class="st0">
		<defs>
			<rect id="SVGID_3_" x="-1210" y="-197" width="1559" height="2256"/>
		</defs>
		<clipPath id="SVGID_4_">
			<use xlink:href="#SVGID_3_"  style="overflow:visible;"/>
		</clipPath>
		<rect x="12.9" y="37" class="st1" width="33.2" height="31.2"/>
	</g>
</g>
<g>
	<defs>
		<polygon id="SVGID_5_" points="47.1,42 36.5,42 28,55 34,55 31.9,61.2 47,51 40,51 		"/>
	</defs>
	<clipPath id="SVGID_6_">
		<use xlink:href="#SVGID_5_"  style="overflow:visible;"/>
	</clipPath>
	<g class="st2">
		<defs>
			<rect id="SVGID_7_" x="-1210" y="-197" width="1559" height="2256"/>
		</defs>
		<clipPath id="SVGID_8_">
			<use xlink:href="#SVGID_7_"  style="overflow:visible;"/>
		</clipPath>
		<rect x="23" y="37" class="st3" width="29.1" height="29.2"/>
	</g>
</g>
<g>
	<defs>
		<polygon id="SVGID_9_" points="29.5,42 25.5,42 17,55 21,55 		"/>
	</defs>
	<clipPath id="SVGID_10_">
		<use xlink:href="#SVGID_9_"  style="overflow:visible;"/>
	</clipPath>
	<g class="st4">
		<defs>
			<rect id="SVGID_11_" x="-1210" y="-197" width="1559" height="2256"/>
		</defs>
		<clipPath id="SVGID_12_">
			<use xlink:href="#SVGID_11_"  style="overflow:visible;"/>
		</clipPath>
		<rect x="12" y="37" class="st5" width="22.5" height="23"/>
	</g>
</g>
<g>
	<defs>
		<polygon id="SVGID_13_" points="40.5,42 36.5,42 28,55 32,55 		"/>
	</defs>
	<clipPath id="SVGID_14_">
		<use xlink:href="#SVGID_13_"  style="overflow:visible;"/>
	</clipPath>
	<g class="st6">
		<defs>
			<rect id="SVGID_15_" x="-1210" y="-197" width="1559" height="2256"/>
		</defs>
		<clipPath id="SVGID_16_">
			<use xlink:href="#SVGID_15_"  style="overflow:visible;"/>
		</clipPath>
		<rect x="23" y="37" class="st7" width="22.5" height="23"/>
	</g>
</g>
<g>
	<defs>
		<path id="SVGID_17_" d="M53.6,25c2.1-10.5-4.4-20.8-14.7-23.4C28.5-1,17.9,5.1,14.8,15.3C6.7,16.9,1.1,24.4,1.9,32.6
			C2.8,40.8,9.7,47.1,18,47h35c6.1,0.2,11.1-4.6,11.3-10.7C64.5,30.2,59.7,25.2,53.6,25z"/>
	</defs>
	<clipPath id="SVGID_18_">
		<use xlink:href="#SVGID_17_"  style="overflow:visible;"/>
	</clipPath>
	<g class="st8">
		<defs>
			<rect id="SVGID_19_" x="-1210" y="-197" width="1559" height="2256"/>
		</defs>
		<clipPath id="SVGID_20_">
			<use xlink:href="#SVGID_19_"  style="overflow:visible;"/>
		</clipPath>
		<rect x="-3.1" y="-4" class="st9" width="72.4" height="56"/>
	</g>
</g>
<g>
	<defs>
		<path id="SVGID_21_" d="M18.8,11.6c0.5,0.5,1.2,0.8,1.9,0.7c0.7,0,1.4-0.4,1.8-0.9C25.4,8,29.6,6,34,6s8.6,2,11.5,5.4
			c0.4,0.6,1.1,0.9,1.8,0.9c0.7,0,1.4-0.2,1.9-0.7c0.9-0.9,1-2.4,0.1-3.4C45.5,3.6,39.9,1,34,1S22.5,3.6,18.7,8.2
			C17.8,9.2,17.9,10.7,18.8,11.6z"/>
	</defs>
	<clipPath id="SVGID_22_">
		<use xlink:href="#SVGID_21_"  style="overflow:visible;"/>
	</clipPath>
	<g class="st10">
		<defs>
			<rect id="SVGID_23_" x="-1210" y="-197" width="1559" height="2256"/>
		</defs>
		<clipPath id="SVGID_24_">
			<use xlink:href="#SVGID_23_"  style="overflow:visible;"/>
		</clipPath>
		<rect x="13.1" y="-4" class="st11" width="41.9" height="21.3"/>
	</g>
</g>
<g>
	<defs>
		<polygon id="SVGID_25_" points="7,42 62,42 56,47 14,47 		"/>
	</defs>
	<clipPath id="SVGID_26_">
		<use xlink:href="#SVGID_25_"  style="overflow:visible;"/>
	</clipPath>
	<g class="st12">
		<defs>
			<rect id="SVGID_27_" x="-1210" y="-197" width="1559" height="2256"/>
		</defs>
		<clipPath id="SVGID_28_">
			<use xlink:href="#SVGID_27_"  style="overflow:visible;"/>
		</clipPath>
		<rect x="2" y="37" class="st13" width="65" height="15"/>
	</g>
</g>
<g>
	<defs>
		<path id="SVGID_29_" d="M60,43v-2c0-0.6-0.4-1-1-1s-1,0.4-1,1v2c0,0.5,0.4,0.9,0.8,1c-1.8,1.3-4,2-6.2,2H18.5
			c-3.1,0-6-0.9-8.6-2.5C9.9,43.3,10,43.2,10,43v-2c0-0.6-0.4-1-1-1s-1,0.4-1,1v1c-3-2.6-4.8-6.3-5-10.2c-0.3-6.8,4-13,10.4-15.1
			C13.2,18.1,13,19.6,13,21c0,0.6,0.4,1,1,1s1-0.4,1-1c0-1.8,0.3-3.6,0.8-5.4c0.1-0.3,0.2-0.7,0.3-1c0.1-0.3,0.2-0.4,0.2-0.6
			C19.3,6.7,26.2,2,34,2c0.8,0,1.6,0.1,2.4,0.2c8.5,1.1,15.2,7.8,16.4,16.2c0.2,1.9,0.2,3.8-0.1,5.6c-0.6,0-1.2,0.1-1.8,0.2
			c-0.4,0.1-0.7,0.3-0.8,0.6c-0.1,0.3-0.1,0.7,0.2,1c0.2,0.3,0.6,0.4,1,0.4C52,26,52.8,26,53.6,26c0.3,0,0.5,0,0.8,0.1h0.3
			c5,0.8,8.5,5.3,8.3,10.3C62.9,38.9,61.8,41.3,60,43z M39.4,50.1l-0.2,0.3c-0.2,0.3-0.3,0.7-0.1,1.1c0.1,0.2,0.2,0.3,0.4,0.4
			C39.7,52,39.8,52,40,52h3.7l-9.9,6.7l1.2-3.4c0.1-0.3,0.1-0.6-0.1-0.8l-0.1-0.1C34.6,54.2,34.3,54,34,54h-4.2l1.5-2.3l2.4-3.7h7.3
			L39.4,50.1z M20.8,60.3l3-4.8c0.2-0.3,0.2-0.7,0-1C23.7,54.2,23.4,54,23,54h-3.3l3.4-6h8.2l-4.2,6.5c-0.2,0.3-0.2,0.7,0,1
			c0.2,0.3,0.5,0.5,0.9,0.5h0.3L20.8,60.3z M57.3,24.8c0,0-0.1-0.1-0.1-0.1c-0.2-0.1-0.5-0.1-0.7-0.2s-0.4-0.1-0.6-0.2
			c-0.2-0.1-0.5-0.1-0.7-0.1l-0.4-0.1c0.3-2,0.3-4,0-6c-1.3-9.4-8.7-16.7-18-18c-9.4-1.2-18.4,3.9-22.1,12.6
			c-0.2,0.4-0.3,0.8-0.4,1.1c-0.1,0.2-0.1,0.3-0.2,0.5C5.4,16.3-0.3,24.5,0.9,33.2S9.7,48.4,18.5,48h2.4l-3.7,6.5
			c-0.2,0.3-0.2,0.7,0,1c0.2,0.3,0.5,0.5,0.9,0.5h3.2L17,62.7c-0.2,0.3-0.2,0.7,0,1c0.2,0.3,0.5,0.5,0.9,0.5c0.2,0,0.3-0.1,0.5-0.1
			l14-8h0.3l-1.7,4.9c-0.1,0.4,0,0.8,0.3,1.1c0.2,0.1,0.4,0.2,0.6,0.2c0.2,0,0.4-0.1,0.6-0.2l15.1-10.2c0.4-0.2,0.5-0.7,0.4-1.1
			c-0.1-0.4-0.5-0.7-1-0.7h-5l1.6-2h9.1c6.5,0.1,12-5,12.4-11.5C65.2,31.3,62.1,26.7,57.3,24.8z"/>
	</defs>
	<clipPath id="SVGID_30_">
		<use xlink:href="#SVGID_29_"  style="overflow:visible;"/>
	</clipPath>
	<g class="st14">
		<defs>
			<rect id="SVGID_31_" x="-1210" y="-197" width="1559" height="2256"/>
		</defs>
		<clipPath id="SVGID_32_">
			<use xlink:href="#SVGID_31_"  style="overflow:visible;"/>
		</clipPath>
		<rect x="-4.3" y="-5" class="st15" width="74.3" height="74.2"/>
	</g>
</g>
<g>
	<defs>
		<path id="SVGID_33_" d="M44.2,10c0.2-0.2,0.2-0.5,0.2-0.7c0-0.3-0.2-0.5-0.4-0.7c-0.8-0.6-1.6-1.2-2.5-1.7c-0.5-0.2-1,0-1.3,0.4
			c-0.2,0.5-0.1,1,0.4,1.3c0.8,0.4,1.5,0.9,2.2,1.5C43.2,10.5,43.9,10.4,44.2,10z"/>
	</defs>
	<clipPath id="SVGID_34_">
		<use xlink:href="#SVGID_33_"  style="overflow:visible;"/>
	</clipPath>
	<g class="st16">
		<defs>
			<rect id="SVGID_35_" x="-1210" y="-197" width="1559" height="2256"/>
		</defs>
		<clipPath id="SVGID_36_">
			<use xlink:href="#SVGID_35_"  style="overflow:visible;"/>
		</clipPath>
		<rect x="35.1" y="1.8" class="st17" width="14.3" height="13.5"/>
	</g>
</g>
<g>
	<defs>
		<path id="SVGID_37_" d="M37.4,5.4c-3.7-0.8-7.6-0.2-11,1.6c-0.5,0.3-0.7,0.9-0.4,1.4c0.3,0.5,0.9,0.7,1.4,0.4
			c2.9-1.6,6.3-2.1,9.6-1.4c0.6,0.1,1.1-0.2,1.2-0.8C38.3,6,38,5.4,37.4,5.4L37.4,5.4z"/>
	</defs>
	<clipPath id="SVGID_38_">
		<use xlink:href="#SVGID_37_"  style="overflow:visible;"/>
	</clipPath>
	<g class="st18">
		<defs>
			<rect id="SVGID_39_" x="-1210" y="-197" width="1559" height="2256"/>
		</defs>
		<clipPath id="SVGID_40_">
			<use xlink:href="#SVGID_39_"  style="overflow:visible;"/>
		</clipPath>
		<rect x="20.9" y="0" class="st19" width="22.4" height="13.8"/>
	</g>
</g>
<g>
	<defs>
		<path id="SVGID_41_" d="M14,40c-0.6,0-1,0.4-1,1v2c0,0.6,0.4,1,1,1s1-0.4,1-1v-2C15,40.4,14.6,40,14,40z"/>
	</defs>
	<clipPath id="SVGID_42_">
		<use xlink:href="#SVGID_41_"  style="overflow:visible;"/>
	</clipPath>
	<g class="st20">
		<defs>
			<rect id="SVGID_43_" x="-1210" y="-197" width="1559" height="2256"/>
		</defs>
		<clipPath id="SVGID_44_">
			<use xlink:href="#SVGID_43_"  style="overflow:visible;"/>
		</clipPath>
		<rect x="8" y="35" class="st21" width="12" height="14"/>
	</g>
</g>
<g>
	<defs>
		<path id="SVGID_45_" d="M19,40c-0.6,0-1,0.4-1,1v2c0,0.6,0.4,1,1,1s1-0.4,1-1v-2C20,40.4,19.6,40,19,40z"/>
	</defs>
	<clipPath id="SVGID_46_">
		<use xlink:href="#SVGID_45_"  style="overflow:visible;"/>
	</clipPath>
	<g class="st22">
		<defs>
			<rect id="SVGID_47_" x="-1210" y="-197" width="1559" height="2256"/>
		</defs>
		<clipPath id="SVGID_48_">
			<use xlink:href="#SVGID_47_"  style="overflow:visible;"/>
		</clipPath>
		<rect x="13" y="35" class="st23" width="12" height="14"/>
	</g>
</g>
<g>
	<defs>
		<path id="SVGID_49_" d="M29,40c-0.6,0-1,0.4-1,1v2c0,0.6,0.4,1,1,1s1-0.4,1-1v-2C30,40.4,29.6,40,29,40z"/>
	</defs>
	<clipPath id="SVGID_50_">
		<use xlink:href="#SVGID_49_"  style="overflow:visible;"/>
	</clipPath>
	<g class="st24">
		<defs>
			<rect id="SVGID_51_" x="-1210" y="-197" width="1559" height="2256"/>
		</defs>
		<clipPath id="SVGID_52_">
			<use xlink:href="#SVGID_51_"  style="overflow:visible;"/>
		</clipPath>
		<rect x="23" y="35" class="st25" width="12" height="14"/>
	</g>
</g>
<g>
	<defs>
		<path id="SVGID_53_" d="M24,40c-0.6,0-1,0.4-1,1v2c0,0.6,0.4,1,1,1s1-0.4,1-1v-2C25,40.4,24.6,40,24,40z"/>
	</defs>
	<clipPath id="SVGID_54_">
		<use xlink:href="#SVGID_53_"  style="overflow:visible;"/>
	</clipPath>
	<g class="st26">
		<defs>
			<rect id="SVGID_55_" x="-1210" y="-197" width="1559" height="2256"/>
		</defs>
		<clipPath id="SVGID_56_">
			<use xlink:href="#SVGID_55_"  style="overflow:visible;"/>
		</clipPath>
		<rect x="18" y="35" class="st27" width="12" height="14"/>
	</g>
</g>
<g>
	<defs>
		<path id="SVGID_57_" d="M39,40c-0.6,0-1,0.4-1,1v2c0,0.6,0.4,1,1,1s1-0.4,1-1v-2C40,40.4,39.6,40,39,40z"/>
	</defs>
	<clipPath id="SVGID_58_">
		<use xlink:href="#SVGID_57_"  style="overflow:visible;"/>
	</clipPath>
	<g class="st28">
		<defs>
			<rect id="SVGID_59_" x="-1210" y="-197" width="1559" height="2256"/>
		</defs>
		<clipPath id="SVGID_60_">
			<use xlink:href="#SVGID_59_"  style="overflow:visible;"/>
		</clipPath>
		<rect x="33" y="35" class="st29" width="12" height="14"/>
	</g>
</g>
<g>
	<defs>
		<path id="SVGID_61_" d="M34,40c-0.6,0-1,0.4-1,1v2c0,0.6,0.4,1,1,1s1-0.4,1-1v-2C35,40.4,34.6,40,34,40z"/>
	</defs>
	<clipPath id="SVGID_62_">
		<use xlink:href="#SVGID_61_"  style="overflow:visible;"/>
	</clipPath>
	<g class="st30">
		<defs>
			<rect id="SVGID_63_" x="-1210" y="-197" width="1559" height="2256"/>
		</defs>
		<clipPath id="SVGID_64_">
			<use xlink:href="#SVGID_63_"  style="overflow:visible;"/>
		</clipPath>
		<rect x="28" y="35" class="st31" width="12" height="14"/>
	</g>
</g>
<g>
	<defs>
		<path id="SVGID_65_" d="M44,40c-0.6,0-1,0.4-1,1v2c0,0.6,0.4,1,1,1s1-0.4,1-1v-2C45,40.4,44.6,40,44,40z"/>
	</defs>
	<clipPath id="SVGID_66_">
		<use xlink:href="#SVGID_65_"  style="overflow:visible;"/>
	</clipPath>
	<g class="st32">
		<defs>
			<rect id="SVGID_67_" x="-1210" y="-197" width="1559" height="2256"/>
		</defs>
		<clipPath id="SVGID_68_">
			<use xlink:href="#SVGID_67_"  style="overflow:visible;"/>
		</clipPath>
		<rect x="38" y="35" class="st33" width="12" height="14"/>
	</g>
</g>
<g>
	<defs>
		<path id="SVGID_69_" d="M54,40c-0.6,0-1,0.4-1,1v2c0,0.6,0.4,1,1,1s1-0.4,1-1v-2C55,40.4,54.6,40,54,40z"/>
	</defs>
	<clipPath id="SVGID_70_">
		<use xlink:href="#SVGID_69_"  style="overflow:visible;"/>
	</clipPath>
	<g class="st34">
		<defs>
			<rect id="SVGID_71_" x="-1210" y="-197" width="1559" height="2256"/>
		</defs>
		<clipPath id="SVGID_72_">
			<use xlink:href="#SVGID_71_"  style="overflow:visible;"/>
		</clipPath>
		<rect x="48" y="35" class="st35" width="12" height="14"/>
	</g>
</g>
<g>
	<defs>
		<path id="SVGID_73_" d="M49,40c-0.6,0-1,0.4-1,1v2c0,0.6,0.4,1,1,1s1-0.4,1-1v-2C50,40.4,49.6,40,49,40z"/>
	</defs>
	<clipPath id="SVGID_74_">
		<use xlink:href="#SVGID_73_"  style="overflow:visible;"/>
	</clipPath>
	<g class="st36">
		<defs>
			<rect id="SVGID_75_" x="-1210" y="-197" width="1559" height="2256"/>
		</defs>
		<clipPath id="SVGID_76_">
			<use xlink:href="#SVGID_75_"  style="overflow:visible;"/>
		</clipPath>
		<rect x="43" y="35" class="st37" width="12" height="14"/>
	</g>
</g>
<g>
	<defs>
		<path id="SVGID_77_" d="M12.5,53.1C12.2,53,12,53,11.7,53c-0.3,0.1-0.5,0.2-0.6,0.5l-3.4,5.9c-0.2,0.5-0.1,1.1,0.4,1.3
			c0.5,0.3,1.1,0.1,1.3-0.3l3.4-5.9c0.1-0.2,0.2-0.5,0.1-0.8C12.9,53.5,12.7,53.3,12.5,53.1z"/>
	</defs>
	<clipPath id="SVGID_78_">
		<use xlink:href="#SVGID_77_"  style="overflow:visible;"/>
	</clipPath>
	<g class="st38">
		<defs>
			<rect id="SVGID_79_" x="-1210" y="-197" width="1559" height="2256"/>
		</defs>
		<clipPath id="SVGID_80_">
			<use xlink:href="#SVGID_79_"  style="overflow:visible;"/>
		</clipPath>
		<rect x="2.6" y="48" class="st39" width="15.4" height="17.9"/>
	</g>
</g>
<g>
	<defs>
		<path id="SVGID_81_" d="M10,51.5c0.4,0,0.7-0.2,0.9-0.5l1-1.7c0.2-0.3,0.2-0.7,0-1c-0.2-0.3-0.5-0.5-0.9-0.5
			c-0.4,0-0.7,0.2-0.9,0.5l-1,1.7c-0.2,0.3-0.2,0.7,0,1.1C9.3,51.4,9.6,51.6,10,51.5z"/>
	</defs>
	<clipPath id="SVGID_82_">
		<use xlink:href="#SVGID_81_"  style="overflow:visible;"/>
	</clipPath>
	<g class="st40">
		<defs>
			<rect id="SVGID_83_" x="-1210" y="-197" width="1559" height="2256"/>
		</defs>
		<clipPath id="SVGID_84_">
			<use xlink:href="#SVGID_83_"  style="overflow:visible;"/>
		</clipPath>
		<rect x="3.9" y="42.8" class="st41" width="13.1" height="13.8"/>
	</g>
</g>
<g>
	<defs>
		<path id="SVGID_85_" d="M54.4,49.1c-0.2-0.1-0.5-0.2-0.8-0.1c-0.3,0.1-0.5,0.2-0.6,0.5l-3,5.2c-0.2,0.5-0.1,1.1,0.4,1.3
			s1.1,0.1,1.3-0.3l3-5.2c0.1-0.2,0.2-0.5,0.1-0.8S54.7,49.2,54.4,49.1z"/>
	</defs>
	<clipPath id="SVGID_86_">
		<use xlink:href="#SVGID_85_"  style="overflow:visible;"/>
	</clipPath>
	<g class="st42">
		<defs>
			<rect id="SVGID_87_" x="-1210" y="-197" width="1559" height="2256"/>
		</defs>
		<clipPath id="SVGID_88_">
			<use xlink:href="#SVGID_87_"  style="overflow:visible;"/>
		</clipPath>
		<rect x="44.9" y="43.9" class="st43" width="15" height="17.2"/>
	</g>
</g>
<g>
	<defs>
		<path id="SVGID_89_" d="M48.8,59.1c-0.2-0.1-0.5-0.2-0.8-0.1c-0.3,0.1-0.5,0.2-0.6,0.5L47,60.3c-0.2,0.5-0.1,1.1,0.4,1.3
			c0.5,0.3,1.1,0.1,1.3-0.3l0.5-0.9c0.1-0.2,0.2-0.5,0.1-0.8S49,59.2,48.8,59.1z"/>
	</defs>
	<clipPath id="SVGID_90_">
		<use xlink:href="#SVGID_89_"  style="overflow:visible;"/>
	</clipPath>
	<g class="st44">
		<defs>
			<rect id="SVGID_91_" x="-1210" y="-197" width="1559" height="2256"/>
		</defs>
		<clipPath id="SVGID_92_">
			<use xlink:href="#SVGID_91_"  style="overflow:visible;"/>
		</clipPath>
		<rect x="41.8" y="53.9" class="st45" width="12.5" height="12.8"/>
	</g>
</g>
</svg>
