<?xml version="1.0" encoding="UTF-8"?>
<svg xmlns:xlink="http://www.w3.org/1999/xlink" width="158px" height="127px" viewBox="0 0 158 127" version="1.1"
     xmlns="http://www.w3.org/2000/svg">
    <!-- Generator: Sketch 52.1 (67048) - http://www.bohemiancoding.com/sketch -->
    <title>Icon</title>
    <desc>Created with Sketch.</desc>
    <g id="Page-1" stroke="none" stroke-width="1" fill="none" fill-rule="evenodd">
        <g id="On-Boarding---4" transform="translate(-104.000000, -161.000000)">
            <g id="Icon" transform="translate(104.000000, 161.000000)">
                <path d="M45.7301086,13.0010743 C44.0322761,15.2200052 42.009263,16.7208917 40.1672652,17.1771424 C39.5154822,15.3949249 39.6285189,12.8784859 40.51868,10.2301086 C38.2997492,8.53227612 36.7988627,6.50926299 36.342612,4.66726523 C38.1248295,4.01548217 40.6412684,4.12851885 43.2896458,5.01868003 C44.9874783,2.79974916 47.0104914,1.2988627 48.8524891,0.842611956 C49.5042722,2.62482948 49.3912355,5.14126844 48.5010743,7.78964576 C50.7200052,9.48747825 52.2208917,11.5104914 52.6771424,13.3524891 C50.8949249,14.0042722 48.3784859,13.8912355 45.7301086,13.0010743 Z M8.27170362,56.3274637 C7.4733567,58.0856398 6.34440273,59.4108416 5.1749387,60.0044472 C4.45895598,58.9056376 4.14385405,57.1935023 4.33155338,55.2717036 C2.57337728,54.4733567 1.2481755,53.3444027 0.654569838,52.1749387 C1.75337944,51.458956 3.46551482,51.143854 5.38731346,51.3315534 C6.18566038,49.5733773 7.31461435,48.2481755 8.48407838,47.6545698 C9.2000611,48.7533794 9.51516303,50.4655148 9.32746369,52.3873135 C11.0856398,53.1856604 12.4108416,54.3146144 13.0044472,55.4840784 C11.9056376,56.2000611 10.1935023,56.515163 8.27170362,56.3274637 Z M150.850588,104.552882 C148.975498,105.146915 147.202824,105.195562 145.956355,104.714884 C146.300135,103.423934 147.381442,102.018405 148.964176,100.850588 C148.370143,98.9754975 148.321496,97.202824 148.802174,95.9563552 C150.093123,96.3001349 151.498652,97.3814424 152.666469,98.9641757 C154.54156,98.3701431 156.314234,98.3214962 157.560703,98.8021737 C157.216923,100.093123 156.135615,101.498652 154.552882,102.666469 C155.146915,104.54156 155.195562,106.314234 154.714884,107.560703 C153.423934,107.216923 152.018405,106.135615 150.850588,104.552882 Z"
                      id="Stars" fill="#FFFFFF" opacity="0.520097373"></path>
                <circle id="Oval-3" fill-opacity="0.6" fill="#FFFFFF" opacity="0.9" cx="84" cy="69" r="58"></circle>
                <path d="M118,34.6795156 C118,26.0236142 124.712064,19 133,19 C141.287936,19 148,26.0236142 148,34.6795156 C148,41.7921936 143.274574,47.4242837 136.024598,50.0341703 L125.120987,53.8338469 C123.321289,54.4610032 122.10304,53.2402224 122.688545,51.3901751 L124.00556,47.22874 C120.260081,44.2926074 118,39.6837356 118,34.6795156 Z"
                      id="Combined-Shape" fill="#FEC24C" fill-rule="nonzero"></path>
                <g transform="translate(50.000000, 40.000000)">
                    <polygon id="Fill-1" fill="#535353"
                             points="0.362463256 38.5194031 0.470566453 38.5194031 0.470566453 19.4818617 0.362463256 19.4818617"></polygon>
                    <polygon id="Stroke-2" stroke="#FEC24C" stroke-width="3.76713953" stroke-linejoin="round"
                             points="0.362463663 19.4818576 0.47056686 19.4818576 0.47056686 38.519401 0.362463663 38.519401"></polygon>
                    <polygon id="Fill-3" fill="#535353"
                             points="9.00690814 35.34375 9.11501134 35.34375 9.11501134 22.6537367 9.00690814 22.6537367"></polygon>
                    <polygon id="Stroke-4" stroke="#FEC24C" stroke-width="3.76713953" stroke-linejoin="round"
                             points="9.00690407 22.6537326 9.11500727 22.6537326 9.11500727 35.34375 9.00690407 35.34375"></polygon>
                    <polygon id="Fill-5" fill="#535353"
                             points="17.6526163 48.0350281 17.7607195 48.0350281 17.7607195 9.96245861 17.6526163 9.96245861"></polygon>
                    <polygon id="Stroke-6" stroke="#FEC24C" stroke-width="3.76713953" stroke-linejoin="round"
                             points="17.6526163 9.9624566 17.7607195 9.9624566 17.7607195 48.035026 17.6526163 48.035026"></polygon>
                    <polygon id="Fill-7" fill="#535353"
                             points="26.3008721 57.5556878 26.4089753 57.5556878 26.4089753 0.446833611 26.3008721 0.446833611"></polygon>
                    <polygon id="Stroke-8" stroke="#FEC24C" stroke-width="3.76713953" stroke-linejoin="round"
                             points="26.3008721 0.446831597 26.4089753 0.446831597 26.4089753 57.5556858 26.3008721 57.5556858"></polygon>
                    <polygon id="Fill-9" fill="#535353"
                             points="34.9465884 51.2094164 35.0546916 51.2094164 35.0546916 6.79057556 34.9465884 6.79057556"></polygon>
                    <polygon id="Stroke-10" stroke="#535353" stroke-width="3.76713953" stroke-linejoin="round"
                             points="34.9465843 6.7905816 35.0546875 6.7905816 35.0546875 51.2094184 34.9465843 51.2094184"></polygon>
                    <polygon id="Fill-11" fill="#535353"
                             points="43.5910267 44.8669311 43.6991299 44.8669311 43.6991299 13.1381117 43.5910267 13.1381117"></polygon>
                    <polygon id="Stroke-12" stroke="#535353" stroke-width="3.76713953" stroke-linejoin="round"
                             points="43.5910247 13.1381076 43.6991279 13.1381076 43.6991279 44.8669271 43.5910247 44.8669271"></polygon>
                    <polygon id="Fill-13" fill="#535353"
                             points="52.2392826 38.5194031 52.3473858 38.5194031 52.3473858 19.4818617 52.2392826 19.4818617"></polygon>
                    <polygon id="Stroke-14" stroke="#535353" stroke-width="3.76713953" stroke-linejoin="round"
                             points="52.2392805 19.4818576 52.3473837 19.4818576 52.3473837 38.519401 52.2392805 38.519401"></polygon>
                    <polygon id="Fill-15" fill="#535353"
                             points="60.8837209 41.6912781 60.9918241 41.6912781 60.9918241 16.3099867 60.8837209 16.3099867"></polygon>
                    <polygon id="Stroke-16" stroke="#535353" stroke-width="3.76713953" stroke-linejoin="round"
                             points="60.8837209 16.3099826 60.9918241 16.3099826 60.9918241 41.691276 60.8837209 41.691276"></polygon>
                    <polygon id="Fill-17" fill="#535353"
                             points="69.5294372 35.34375 69.6375404 35.34375 69.6375404 22.6537367 69.5294372 22.6537367"></polygon>
                    <polygon id="Stroke-18" stroke="#535353" stroke-width="3.76713953" stroke-linejoin="round"
                             points="69.5294331 22.6537326 69.6375363 22.6537326 69.6375363 35.34375 69.5294331 35.34375"></polygon>
                </g>
            </g>
        </g>
    </g>
</svg>