<?xml version="1.0" encoding="UTF-8"?>
<svg xmlns:xlink="http://www.w3.org/1999/xlink" width="158px" height="127px" viewBox="0 0 158 127" version="1.1"
     xmlns="http://www.w3.org/2000/svg">
    <!-- Generator: Sketch 52.1 (67048) - http://www.bohemiancoding.com/sketch -->
    <title>Icon</title>
    <desc>Created with Sketch.</desc>
    <defs>
        <linearGradient x1="1.59742086%" y1="2.01857182%" x2="80.878504%" y2="75.9058046%" id="linearGradient-1">
            <stop stop-color="#FAF7FA" offset="0%"></stop>
            <stop stop-color="#EFF0F1" offset="100%"></stop>
        </linearGradient>
        <path d="M66.6206954,36.681459 C66.6206954,34.7538285 68.1826269,33.1239117 70.1226812,33.0403646 L70.8153418,33.0105357 C74.3874908,33.0105357 76.5885585,35.9452372 77.2832897,39.3191055 C77.2832897,39.3191055 77.7464439,42.0778639 77.7464439,46.7810581 C77.7464439,51.4842523 77.2832897,53.7915181 77.2832897,53.7915181 C76.3569814,57.8426253 74.3882762,60.1000879 70.8153418,60.1000879 L70.1226812,60.1000879 C68.1885879,60.1000879 66.6206954,58.537041 66.6206954,56.6098041 L66.6206954,36.681459 Z"
              id="path-2"></path>
        <filter x="-31.5%" y="-9.2%" width="162.9%" height="125.8%" filterUnits="objectBoundingBox" id="filter-3">
            <feOffset dx="0" dy="1" in="SourceAlpha" result="shadowOffsetOuter1"></feOffset>
            <feGaussianBlur stdDeviation="1" in="shadowOffsetOuter1" result="shadowBlurOuter1"></feGaussianBlur>
            <feColorMatrix values="0 0 0 0 0   0 0 0 0 0   0 0 0 0 0  0 0 0 0.104704484 0" type="matrix"
                           in="shadowBlurOuter1"></feColorMatrix>
        </filter>
    </defs>
    <g id="Page-1" stroke="none" stroke-width="1" fill="none" fill-rule="evenodd">
        <g id="On-Boarding---2" transform="translate(-104.000000, -161.000000)">
            <g id="Icon" transform="translate(104.000000, 161.000000)">
                <circle id="Oval-3" fill-opacity="0.6" fill="#FFFFFF" opacity="0.9" cx="84" cy="69" r="58"></circle>
                <path d="M45.7301086,13.0010743 C44.0322761,15.2200052 42.009263,16.7208917 40.1672652,17.1771424 C39.5154822,15.3949249 39.6285189,12.8784859 40.51868,10.2301086 C38.2997492,8.53227612 36.7988627,6.50926299 36.342612,4.66726523 C38.1248295,4.01548217 40.6412684,4.12851885 43.2896458,5.01868003 C44.9874783,2.79974916 47.0104914,1.2988627 48.8524891,0.842611956 C49.5042722,2.62482948 49.3912355,5.14126844 48.5010743,7.78964576 C50.7200052,9.48747825 52.2208917,11.5104914 52.6771424,13.3524891 C50.8949249,14.0042722 48.3784859,13.8912355 45.7301086,13.0010743 Z M8.27170362,56.3274637 C7.4733567,58.0856398 6.34440273,59.4108416 5.1749387,60.0044472 C4.45895598,58.9056376 4.14385405,57.1935023 4.33155338,55.2717036 C2.57337728,54.4733567 1.2481755,53.3444027 0.654569838,52.1749387 C1.75337944,51.458956 3.46551482,51.143854 5.38731346,51.3315534 C6.18566038,49.5733773 7.31461435,48.2481755 8.48407838,47.6545698 C9.2000611,48.7533794 9.51516303,50.4655148 9.32746369,52.3873135 C11.0856398,53.1856604 12.4108416,54.3146144 13.0044472,55.4840784 C11.9056376,56.2000611 10.1935023,56.515163 8.27170362,56.3274637 Z M150.850588,104.552882 C148.975498,105.146915 147.202824,105.195562 145.956355,104.714884 C146.300135,103.423934 147.381442,102.018405 148.964176,100.850588 C148.370143,98.9754975 148.321496,97.202824 148.802174,95.9563552 C150.093123,96.3001349 151.498652,97.3814424 152.666469,98.9641757 C154.54156,98.3701431 156.314234,98.3214962 157.560703,98.8021737 C157.216923,100.093123 156.135615,101.498652 154.552882,102.666469 C155.146915,104.54156 155.195562,106.314234 154.714884,107.560703 C153.423934,107.216923 152.018405,106.135615 150.850588,104.552882 Z"
                      id="Stars" fill="#FFFFFF" opacity="0.520097373"></path>
                <g id="camera"
                   transform="translate(93.808639, 58.862325) rotate(-9.000000) translate(-93.808639, -58.862325) translate(45.308639, 21.362325)">
                    <path d="M15.2694611,23.9019507 L16.6167665,18.9650535 C17.1944073,16.4707662 19.5293266,14.4514925 22.0024388,14.4514925 C22.0024388,14.4514925 24.6396367,14 32.3353293,14 C40.0310219,14 42.6682198,14.4514925 42.6682198,14.4514925 C45.1465804,14.4514925 47.2842276,16.0192736 48.0538922,18.513561 L49.4011976,23.9019507"
                          id="Rectangle" fill="url(#linearGradient-1)"></path>
                    <path d="M0.81410665,30.6070843 C1.35661626,25.6742365 5.81368453,21.4045298 10.7880038,21.114678 C10.7880038,21.114678 19.760479,20.3208955 37.7245509,20.3208955 C55.6886228,20.3208955 64.6792232,21.1156567 64.6792232,21.1156567 C69.6351346,21.4247796 74.0199616,25.688281 74.3913857,30.6364056 C74.3913857,30.6364056 75,34.4945362 75,47.3136994 C75,60.1328625 74.3913857,63.9909931 74.3913857,63.9909931 C73.9834179,68.9400347 69.6354173,73.2164203 64.661098,73.4993709 C64.661098,73.4993709 55.6886228,74.2742537 37.7245509,74.2742537 C19.760479,74.2742537 10.7698786,73.4984154 10.7698786,73.4984154 C5.81396718,73.1966526 1.3079039,68.9497907 0.812796142,64.005658 C0.812796142,64.005658 1.10588622e-15,60.1328625 0,47.3136994 C0,34.4945362 0.81410665,30.6070843 0.81410665,30.6070843 Z"
                          id="Rectangle-Copy-4" fill="#535353"></path>
                    <g id="Rectangle-9-Copy-2"
                       transform="translate(72.183570, 46.555312) rotate(-180.000000) translate(-72.183570, -46.555312) ">
                        <use fill="black" fill-opacity="1" filter="url(#filter-3)" xlink:href="#path-2"></use>
                        <use fill="#FEC24C" fill-rule="evenodd" xlink:href="#path-2"></use>
                    </g>
                    <rect id="Rectangle-9-Copy-3" fill="#FFFFFF"
                          transform="translate(55.849016, 29.882862) rotate(-270.000000) translate(-55.849016, -29.882862) "
                          x="52.721343" y="24.6423241" width="6.25534645" height="10.4810768" rx="3.12767322"></rect>
                    <g id="Group-2" transform="translate(13.473054, 29.350746)">
                        <path d="M17.9640719,36.119403 C27.8853548,36.119403 35.9281437,28.0337992 35.9281437,18.0597015 C35.9281437,8.08560377 27.8853548,0 17.9640719,0 C8.04278893,0 0,8.08560377 0,18.0597015 C0,28.0337992 8.04278893,36.119403 17.9640719,36.119403 Z"
                              id="Oval-7" fill="#FFFFFF"></path>
                        <path d="M6.73652695,18.0597015 C6.73652695,20.0189895 7.23309179,21.8616811 8.10660326,23.4675215 M12.4442762,27.8910184 C14.0742863,28.8179482 15.9577211,29.3470149 17.9640719,29.3470149"
                              id="Oval-7-Copy" stroke="#CBCDD1" stroke-width="2.5" stroke-linecap="round"></path>
                    </g>
                    <path d="M70.063859,3.21360448 C70.9153925,3.21360448 71.6283839,3.85885282 71.7131146,4.70616027 L72.3150997,10.7260115 C72.4394323,11.9693374 71.532309,13.0780437 70.2889831,13.2023763 C70.2141749,13.2098571 70.1390403,13.2136045 70.063859,13.2136045 C68.8143319,13.2136045 67.8013901,12.2006626 67.8013901,10.9511356 C67.8013901,10.8759543 67.8051375,10.8008197 67.8126183,10.7260115 L68.4146034,4.70616027 C68.4993342,3.85885282 69.2123256,3.21360448 70.063859,3.21360448 Z M89.813859,1.71360448 C90.5072771,2.12965531 90.7384361,3.02521419 90.3330078,3.72489607 L84.5106114,13.7730962 C83.8526723,14.9085572 82.3988342,15.2956652 81.2633732,14.6377261 C81.2285651,14.6175566 81.1942747,14.5965064 81.1605354,14.5745959 C80.0956471,13.8830493 79.7929938,12.4591774 80.4845404,11.394289 C80.5194781,11.3404896 80.5566523,11.288176 80.5959652,11.2374855 L87.6704953,2.11551648 C88.1802026,1.45829482 89.1006734,1.28569311 89.813859,1.71360448 Z M95.438859,21.2030711 C95.6522378,22.0505928 95.193228,22.9228244 94.3738459,23.2268581 L88.5615437,25.3835268 C87.4234703,25.8058116 86.15855,25.2255504 85.7362651,24.0874769 C85.7035252,23.9992416 85.6764862,23.9089946 85.6553153,23.8172931 C85.3631617,22.5518369 86.1521794,21.2891446 87.4176356,20.996991 C87.4643547,20.9862051 87.5113927,20.9768505 87.5586837,20.9689405 L93.548956,19.9669913 C94.4047217,19.8238536 95.2270223,20.3616744 95.438859,21.2030711 Z"
                          id="Combined-Shape" fill="#535353"
                          transform="translate(81.646178, 13.500395) rotate(6.000000) translate(-81.646178, -13.500395) "></path>
                </g>
            </g>
        </g>
    </g>
</svg>