{
  "project_info": {
    "project_number": "762433308778",
    "firebase_url": "https://wordio-70046677.firebaseio.com",
    "project_id": "wordio-70046677",
    "storage_bucket": "wordio-70046677.appspot.com"
  },
  "client": [
    {
      "client_info": {
        "mobilesdk_app_id": "1:762433308778:android:967aad9756a825ff046213",
        "android_client_info": {
          "package_name": "com.aar.app.wordsearch"
        }
      },
      "oauth_client": [
        {
          "client_id": "762433308778-ms94gl8phkdjbusmc67ntkfkfoifirav.apps.googleusercontent.com",
          "client_type": 3
        }
      ],
      "api_key": [
        {
          "current_key": "AIzaSyBK1wxM2IRLht8ZSQFCCCVCuMt509ePdA4"
        }
      ],
      "services": {
        "appinvite_service": {
          "other_platform_oauth_client": [
            {
              "client_id": "762433308778-ms94gl8phkdjbusmc67ntkfkfoifirav.apps.googleusercontent.com",
              "client_type": 3
            }
          ]
        }
      }
    },
    {
      "client_info": {
        "mobilesdk_app_id": "1:762433308778:android:21a8cc1e8ac53b92046213",
        "android_client_info": {
          "package_name": "com.segas.arr.wordio"
        }
      },
      "oauth_client": [
        {
          "client_id": "762433308778-9e0p2unepjjlc84cgl30ilufbmh8tpul.apps.googleusercontent.com",
          "client_type": 1,
          "android_info": {
            "package_name": "com.segas.arr.wordio",
            "certificate_hash": "aa6f001c6cc6e5adbac10aaeddb1d132b1e34796"
          }
        },
        {
          "client_id": "762433308778-ms94gl8phkdjbusmc67ntkfkfoifirav.apps.googleusercontent.com",
          "client_type": 3
        }
      ],
      "api_key": [
        {
          "current_key": "AIzaSyBK1wxM2IRLht8ZSQFCCCVCuMt509ePdA4"
        }
      ],
      "services": {
        "appinvite_service": {
          "other_platform_oauth_client": [
            {
              "client_id": "762433308778-ms94gl8phkdjbusmc67ntkfkfoifirav.apps.googleusercontent.com",
              "client_type": 3
            }
          ]
        }
      }
    }
  ],
  "configuration_version": "1"
}