<svg width="222" height="67" viewBox="0 0 222 67" fill="none" xmlns="http://www.w3.org/2000/svg">
<rect x="0.34375" width="221.344" height="66.4032" rx="6.64032" fill="black"/>
<path d="M88.6072 49.8809H86.5354C86.303 49.8809 86.1104 49.8244 85.9577 49.7115C85.8116 49.592 85.7053 49.4459 85.6389 49.2733L84.5632 46.3349H78.5969L77.5211 49.2733C77.468 49.426 77.3618 49.5654 77.2024 49.6916C77.0497 49.8178 76.8604 49.8809 76.6347 49.8809H74.5529L80.2105 35.478H82.9496L88.6072 49.8809ZM79.2842 44.4424H83.8759L82.1229 39.6515C82.0432 39.439 81.9536 39.19 81.854 38.9044C81.761 38.6122 81.668 38.2968 81.5751 37.9582C81.4821 38.2968 81.3891 38.6122 81.2962 38.9044C81.2098 39.1966 81.1235 39.4522 81.0372 39.6714L79.2842 44.4424ZM91.3455 53.2176V39.6614H92.8495C93.0089 39.6614 93.145 39.6979 93.2579 39.771C93.3708 39.844 93.4438 39.9569 93.477 40.1096L93.6763 41.0559C94.088 40.5844 94.5594 40.2026 95.0906 39.9104C95.6285 39.6183 96.256 39.4722 96.9732 39.4722C97.531 39.4722 98.0389 39.5884 98.4971 39.8208C98.962 40.0532 99.3604 40.3918 99.6924 40.8367C100.031 41.275 100.29 41.8195 100.469 42.4703C100.655 43.1144 100.748 43.8548 100.748 44.6915C100.748 45.4551 100.645 46.1623 100.439 46.813C100.234 47.4638 99.9381 48.0282 99.5529 48.5063C99.1744 48.9844 98.7129 49.3596 98.1684 49.6318C97.6306 49.8975 97.0263 50.0303 96.3556 50.0303C95.7779 50.0303 95.2865 49.9439 94.8815 49.7713C94.4831 49.592 94.1245 49.3463 93.8057 49.0342V53.2176H91.3455ZM96.1265 41.4145C95.6152 41.4145 95.177 41.524 94.8118 41.7432C94.4532 41.9556 94.1178 42.2578 93.8057 42.6496V47.2314C94.0846 47.5767 94.3868 47.819 94.7121 47.9585C95.0442 48.0913 95.3994 48.1577 95.7779 48.1577C96.1498 48.1577 96.4851 48.088 96.7839 47.9485C97.0894 47.8091 97.345 47.5966 97.5509 47.3111C97.7634 47.0255 97.9261 46.6669 98.0389 46.2353C98.1518 45.7971 98.2083 45.2824 98.2083 44.6915C98.2083 44.0938 98.1585 43.5892 98.0589 43.1775C97.9659 42.7591 97.8298 42.4205 97.6505 42.1615C97.4712 41.9025 97.2521 41.7133 96.9931 41.5937C96.7408 41.4742 96.4519 41.4145 96.1265 41.4145ZM104.004 53.2176V39.6614H105.508C105.667 39.6614 105.803 39.6979 105.916 39.771C106.029 39.844 106.102 39.9569 106.135 40.1096L106.335 41.0559C106.746 40.5844 107.218 40.2026 107.749 39.9104C108.287 39.6183 108.914 39.4722 109.632 39.4722C110.189 39.4722 110.697 39.5884 111.155 39.8208C111.62 40.0532 112.019 40.3918 112.351 40.8367C112.689 41.275 112.948 41.8195 113.128 42.4703C113.314 43.1144 113.407 43.8548 113.407 44.6915C113.407 45.4551 113.304 46.1623 113.098 46.813C112.892 47.4638 112.596 48.0282 112.211 48.5063C111.833 48.9844 111.371 49.3596 110.827 49.6318C110.289 49.8975 109.685 50.0303 109.014 50.0303C108.436 50.0303 107.945 49.9439 107.54 49.7713C107.141 49.592 106.783 49.3463 106.464 49.0342V53.2176H104.004ZM108.785 41.4145C108.274 41.4145 107.835 41.524 107.47 41.7432C107.112 41.9556 106.776 42.2578 106.464 42.6496V47.2314C106.743 47.5767 107.045 47.819 107.371 47.9585C107.703 48.0913 108.058 48.1577 108.436 48.1577C108.808 48.1577 109.143 48.088 109.442 47.9485C109.748 47.8091 110.003 47.5966 110.209 47.3111C110.422 47.0255 110.584 46.6669 110.697 46.2353C110.81 45.7971 110.867 45.2824 110.867 44.6915C110.867 44.0938 110.817 43.5892 110.717 43.1775C110.624 42.7591 110.488 42.4205 110.309 42.1615C110.13 41.9025 109.91 41.7133 109.651 41.5937C109.399 41.4742 109.11 41.4145 108.785 41.4145ZM129.767 38.0976C129.694 38.2437 129.608 38.3466 129.508 38.4064C129.415 38.4662 129.303 38.496 129.17 38.496C129.037 38.496 128.888 38.4462 128.722 38.3466C128.556 38.2404 128.36 38.1242 128.134 37.998C127.908 37.8718 127.643 37.759 127.337 37.6594C127.038 37.5531 126.683 37.5 126.271 37.5C125.899 37.5 125.574 37.5465 125.295 37.6394C125.023 37.7258 124.79 37.8486 124.598 38.008C124.412 38.1673 124.273 38.3599 124.18 38.5857C124.087 38.8048 124.04 39.0472 124.04 39.3128C124.04 39.6515 124.133 39.9337 124.319 40.1594C124.512 40.3852 124.764 40.5778 125.076 40.7371C125.388 40.8965 125.743 41.0393 126.142 41.1654C126.54 41.2916 126.945 41.4277 127.357 41.5738C127.775 41.7133 128.184 41.8793 128.582 42.0718C128.981 42.2578 129.336 42.4968 129.648 42.789C129.96 43.0745 130.209 43.4265 130.395 43.8448C130.587 44.2632 130.684 44.7711 130.684 45.3688C130.684 46.0195 130.571 46.6304 130.345 47.2015C130.126 47.7659 129.801 48.2606 129.369 48.6856C128.944 49.1039 128.423 49.436 127.805 49.6816C127.188 49.9207 126.48 50.0402 125.684 50.0402C125.225 50.0402 124.774 49.9937 124.329 49.9008C123.884 49.8145 123.456 49.6883 123.044 49.5223C122.639 49.3563 122.257 49.1571 121.899 48.9247C121.547 48.6922 121.231 48.4333 120.952 48.1477L121.729 46.8628C121.802 46.7699 121.889 46.6935 121.988 46.6337C122.095 46.5673 122.211 46.5341 122.337 46.5341C122.503 46.5341 122.682 46.6039 122.875 46.7433C123.067 46.8761 123.293 47.0255 123.552 47.1915C123.818 47.3575 124.126 47.5103 124.478 47.6497C124.837 47.7825 125.265 47.8489 125.763 47.8489C126.527 47.8489 127.118 47.6696 127.536 47.3111C127.955 46.9458 128.164 46.4246 128.164 45.7473C128.164 45.3688 128.067 45.06 127.875 44.8209C127.689 44.5819 127.44 44.3827 127.128 44.2233C126.816 44.0573 126.461 43.9179 126.062 43.805C125.664 43.6921 125.259 43.5692 124.847 43.4364C124.435 43.3036 124.03 43.1443 123.632 42.9583C123.233 42.7724 122.878 42.53 122.566 42.2312C122.254 41.9324 122.002 41.5605 121.809 41.1156C121.623 40.6641 121.53 40.1096 121.53 39.4522C121.53 38.9277 121.633 38.4164 121.839 37.9183C122.051 37.4203 122.357 36.9787 122.755 36.5936C123.16 36.2084 123.655 35.8997 124.239 35.6673C124.824 35.4349 125.491 35.3186 126.241 35.3186C127.091 35.3186 127.875 35.4515 128.592 35.7171C129.309 35.9827 129.92 36.3545 130.425 36.8326L129.767 38.0976ZM137.34 50.0402C136.457 50.0402 135.776 49.7912 135.298 49.2932C134.82 48.7885 134.581 48.0946 134.581 47.2115V41.5041H133.545C133.412 41.5041 133.296 41.4609 133.196 41.3746C133.103 41.2883 133.057 41.1588 133.057 40.9862V40.01L134.7 39.7411L135.218 36.9522C135.245 36.8194 135.305 36.7164 135.398 36.6434C135.497 36.5703 135.62 36.5338 135.766 36.5338H137.041V39.7511H139.731V41.5041H137.041V47.0421C137.041 47.3609 137.121 47.6099 137.28 47.7892C137.44 47.9684 137.652 48.0581 137.918 48.0581C138.07 48.0581 138.197 48.0415 138.296 48.0083C138.402 47.9684 138.492 47.9286 138.565 47.8888C138.645 47.8489 138.715 47.8124 138.774 47.7792C138.834 47.7394 138.894 47.7194 138.954 47.7194C139.027 47.7194 139.086 47.7394 139.133 47.7792C139.179 47.8124 139.229 47.8655 139.282 47.9386L140.019 49.1338C139.661 49.4326 139.249 49.6584 138.784 49.8111C138.319 49.9639 137.838 50.0402 137.34 50.0402ZM147.444 39.502C148.208 39.502 148.899 39.6249 149.516 39.8706C150.14 40.1163 150.671 40.4649 151.11 40.9164C151.548 41.368 151.887 41.9191 152.126 42.5699C152.365 43.2206 152.484 43.9477 152.484 44.7512C152.484 45.5613 152.365 46.2918 152.126 46.9425C151.887 47.5933 151.548 48.1477 151.11 48.6059C150.671 49.0641 150.14 49.416 149.516 49.6617C148.899 49.9074 148.208 50.0303 147.444 50.0303C146.681 50.0303 145.987 49.9074 145.363 49.6617C144.738 49.416 144.204 49.0641 143.759 48.6059C143.321 48.1477 142.979 47.5933 142.733 46.9425C142.494 46.2918 142.374 45.5613 142.374 44.7512C142.374 43.9477 142.494 43.2206 142.733 42.5699C142.979 41.9191 143.321 41.368 143.759 40.9164C144.204 40.4649 144.738 40.1163 145.363 39.8706C145.987 39.6249 146.681 39.502 147.444 39.502ZM147.444 48.1378C148.294 48.1378 148.922 47.8522 149.327 47.2812C149.739 46.7101 149.944 45.8734 149.944 44.7711C149.944 43.6688 149.739 42.8288 149.327 42.2511C148.922 41.6734 148.294 41.3846 147.444 41.3846C146.581 41.3846 145.944 41.6767 145.532 42.2611C145.12 42.8388 144.914 43.6755 144.914 44.7711C144.914 45.8668 145.12 46.7035 145.532 47.2812C145.944 47.8522 146.581 48.1378 147.444 48.1378ZM155.798 49.8809V39.6614H157.243C157.495 39.6614 157.671 39.7079 157.771 39.8009C157.87 39.8938 157.937 40.0532 157.97 40.279L158.119 41.5141C158.484 40.8832 158.913 40.3852 159.404 40.02C159.895 39.6548 160.447 39.4722 161.057 39.4722C161.562 39.4722 161.98 39.5884 162.312 39.8208L161.994 41.6635C161.974 41.783 161.931 41.8693 161.864 41.9224C161.798 41.9689 161.708 41.9922 161.595 41.9922C161.496 41.9922 161.36 41.9689 161.187 41.9224C161.014 41.876 160.785 41.8527 160.5 41.8527C159.988 41.8527 159.55 41.9955 159.185 42.281C158.82 42.5599 158.511 42.9716 158.259 43.5161V49.8809H155.798ZM169.548 39.502C170.192 39.502 170.783 39.605 171.321 39.8108C171.865 40.0167 172.333 40.3188 172.725 40.7172C173.117 41.109 173.422 41.5937 173.642 42.1715C173.861 42.7425 173.97 43.3966 173.97 44.1337C173.97 44.3196 173.96 44.4756 173.94 44.6018C173.927 44.7213 173.897 44.8176 173.851 44.8907C173.811 44.9571 173.754 45.0069 173.681 45.0401C173.608 45.0666 173.515 45.0799 173.403 45.0799H167.088C167.161 46.1291 167.443 46.8994 167.934 47.3907C168.426 47.8821 169.076 48.1278 169.886 48.1278C170.285 48.1278 170.627 48.0813 170.912 47.9884C171.205 47.8954 171.457 47.7925 171.669 47.6796C171.889 47.5667 172.078 47.4638 172.237 47.3708C172.403 47.2779 172.563 47.2314 172.715 47.2314C172.815 47.2314 172.901 47.2513 172.974 47.2911C173.047 47.331 173.11 47.3874 173.163 47.4605L173.881 48.3569C173.608 48.6756 173.303 48.9446 172.964 49.1637C172.626 49.3762 172.27 49.5488 171.899 49.6816C171.533 49.8078 171.158 49.8975 170.773 49.9506C170.394 50.0037 170.026 50.0303 169.667 50.0303C168.957 50.0303 168.296 49.9141 167.685 49.6816C167.074 49.4426 166.543 49.094 166.092 48.6358C165.64 48.171 165.285 47.5999 165.026 46.9226C164.767 46.2386 164.637 45.4484 164.637 44.552C164.637 43.8548 164.75 43.2007 164.976 42.5898C165.202 41.9722 165.524 41.4377 165.942 40.9862C166.367 40.528 166.882 40.1661 167.486 39.9005C168.097 39.6349 168.784 39.502 169.548 39.502ZM169.598 41.265C168.88 41.265 168.319 41.4676 167.914 41.8726C167.509 42.2777 167.25 42.8521 167.137 43.5958H171.759C171.759 43.2771 171.716 42.9783 171.63 42.6994C171.543 42.4138 171.41 42.1648 171.231 41.9523C171.052 41.7398 170.826 41.5738 170.554 41.4543C170.282 41.3281 169.963 41.265 169.598 41.265Z" fill="white"/>
<path d="M83.7962 23.3653C83.7962 24.0913 83.6878 24.7443 83.4709 25.3242C83.254 25.9041 82.9485 26.3977 82.5545 26.805C82.1605 27.2123 81.6891 27.5244 81.1401 27.7413C80.5912 27.9582 79.9825 28.0667 79.314 28.0667H75.8876V18.6706H79.314C79.9825 18.6706 80.5912 18.7791 81.1401 18.996C81.6891 19.2129 82.1605 19.525 82.5545 19.9323C82.9485 20.3395 83.254 20.8331 83.4709 21.4131C83.6878 21.993 83.7962 22.6437 83.7962 23.3653ZM83.0924 23.3653C83.0924 22.7101 83.0016 22.1258 82.8201 21.6123C82.6386 21.0987 82.3819 20.6649 82.0498 20.3108C81.7223 19.9566 81.326 19.6866 80.8612 19.5006C80.3964 19.3147 79.8807 19.2217 79.314 19.2217H76.5716V27.5155H79.314C79.8807 27.5155 80.3964 27.4225 80.8612 27.2366C81.326 27.0507 81.7223 26.7806 82.0498 26.4265C82.3819 26.0723 82.6386 25.6385 82.8201 25.125C83.0016 24.6115 83.0924 24.0249 83.0924 23.3653ZM88.5742 21.3533C89.0478 21.3533 89.4706 21.4352 89.8425 21.599C90.2187 21.7583 90.5353 21.9863 90.792 22.2829C91.0488 22.5795 91.2436 22.9381 91.3764 23.3587C91.5136 23.7748 91.5822 24.2418 91.5822 24.7598C91.5822 25.2777 91.5136 25.7448 91.3764 26.1609C91.2436 26.577 91.0488 26.9334 90.792 27.23C90.5353 27.5266 90.2187 27.7546 89.8425 27.9139C89.4706 28.0733 89.0478 28.153 88.5742 28.153C88.1005 28.153 87.6755 28.0733 87.2992 27.9139C86.9274 27.7546 86.6108 27.5266 86.3497 27.23C86.0929 26.9334 85.8959 26.577 85.7587 26.1609C85.6259 25.7448 85.5595 25.2777 85.5595 24.7598C85.5595 24.2418 85.6259 23.7748 85.7587 23.3587C85.8959 22.9381 86.0929 22.5795 86.3497 22.2829C86.6108 21.9863 86.9274 21.7583 87.2992 21.599C87.6755 21.4352 88.1005 21.3533 88.5742 21.3533ZM88.5742 27.655C88.9682 27.655 89.3112 27.5885 89.6034 27.4557C89.9 27.3185 90.1457 27.1237 90.3405 26.8714C90.5397 26.6191 90.688 26.3158 90.7854 25.9617C90.8828 25.6031 90.9315 25.2025 90.9315 24.7598C90.9315 24.3215 90.8828 23.9231 90.7854 23.5645C90.688 23.2059 90.5397 22.9005 90.3405 22.6482C90.1457 22.3914 89.9 22.1944 89.6034 22.0572C89.3112 21.9199 88.9682 21.8513 88.5742 21.8513C88.1802 21.8513 87.8349 21.9199 87.5383 22.0572C87.2461 22.1944 87.0004 22.3914 86.8012 22.6482C86.6064 22.9005 86.4581 23.2059 86.3563 23.5645C86.2589 23.9231 86.2102 24.3215 86.2102 24.7598C86.2102 25.2025 86.2589 25.6031 86.3563 25.9617C86.4581 26.3158 86.6064 26.6191 86.8012 26.8714C87.0004 27.1237 87.2461 27.3185 87.5383 27.4557C87.8349 27.5885 88.1802 27.655 88.5742 27.655ZM92.7113 21.4595H93.196C93.258 21.4595 93.3089 21.4772 93.3488 21.5127C93.3886 21.5436 93.4152 21.5791 93.4284 21.6189L95.0952 26.8316C95.1261 26.9334 95.1505 27.0308 95.1682 27.1237C95.1859 27.2167 95.2036 27.3097 95.2213 27.4026C95.2435 27.3097 95.2678 27.2167 95.2944 27.1237C95.3209 27.0308 95.3519 26.9334 95.3873 26.8316L97.1603 21.5724C97.1913 21.475 97.2533 21.4263 97.3462 21.4263H97.6052C97.7026 21.4263 97.7668 21.475 97.7978 21.5724L99.5442 26.8316C99.6106 27.0308 99.6637 27.2233 99.7035 27.4093C99.7212 27.3163 99.739 27.2233 99.7567 27.1304C99.7788 27.033 99.8076 26.9334 99.843 26.8316L101.516 21.6189C101.552 21.5127 101.627 21.4595 101.742 21.4595H102.207L99.9957 28.0667H99.5309C99.4601 28.0667 99.4092 28.0202 99.3782 27.9272L97.5654 22.5618C97.5432 22.4954 97.5233 22.429 97.5056 22.3626C97.4879 22.2962 97.4724 22.2298 97.4591 22.1634C97.4458 22.2298 97.4303 22.2962 97.4126 22.3626C97.3993 22.429 97.3816 22.4954 97.3595 22.5618L95.5268 27.9272C95.5002 28.0202 95.4471 28.0667 95.3674 28.0667H94.9225L92.7113 21.4595ZM103.831 28.0667V21.4595H104.177C104.292 21.4595 104.358 21.5149 104.376 21.6255L104.435 22.6216C104.737 22.2409 105.086 21.9354 105.485 21.7052C105.888 21.4706 106.335 21.3533 106.826 21.3533C107.189 21.3533 107.508 21.4108 107.782 21.5259C108.061 21.641 108.291 21.807 108.473 22.024C108.654 22.2409 108.792 22.5021 108.885 22.8075C108.977 23.113 109.024 23.4583 109.024 23.8434V28.0667H108.393V23.8434C108.393 23.2236 108.251 22.7389 107.968 22.3892C107.685 22.035 107.251 21.858 106.667 21.858C106.233 21.858 105.83 21.9708 105.458 22.1966C105.086 22.418 104.754 22.7234 104.462 23.113V28.0667H103.831ZM112.231 18.405V28.0667H111.601V18.405H112.231ZM117.481 21.3533C117.955 21.3533 118.378 21.4352 118.75 21.599C119.126 21.7583 119.442 21.9863 119.699 22.2829C119.956 22.5795 120.151 22.9381 120.284 23.3587C120.421 23.7748 120.489 24.2418 120.489 24.7598C120.489 25.2777 120.421 25.7448 120.284 26.1609C120.151 26.577 119.956 26.9334 119.699 27.23C119.442 27.5266 119.126 27.7546 118.75 27.9139C118.378 28.0733 117.955 28.153 117.481 28.153C117.008 28.153 116.583 28.0733 116.206 27.9139C115.835 27.7546 115.518 27.5266 115.257 27.23C115 26.9334 114.803 26.577 114.666 26.1609C114.533 25.7448 114.467 25.2777 114.467 24.7598C114.467 24.2418 114.533 23.7748 114.666 23.3587C114.803 22.9381 115 22.5795 115.257 22.2829C115.518 21.9863 115.835 21.7583 116.206 21.599C116.583 21.4352 117.008 21.3533 117.481 21.3533ZM117.481 27.655C117.875 27.655 118.218 27.5885 118.511 27.4557C118.807 27.3185 119.053 27.1237 119.248 26.8714C119.447 26.6191 119.595 26.3158 119.693 25.9617C119.79 25.6031 119.839 25.2025 119.839 24.7598C119.839 24.3215 119.79 23.9231 119.693 23.5645C119.595 23.2059 119.447 22.9005 119.248 22.6482C119.053 22.3914 118.807 22.1944 118.511 22.0572C118.218 21.9199 117.875 21.8513 117.481 21.8513C117.087 21.8513 116.742 21.9199 116.445 22.0572C116.153 22.1944 115.908 22.3914 115.708 22.6482C115.514 22.9005 115.365 23.2059 115.263 23.5645C115.166 23.9231 115.117 24.3215 115.117 24.7598C115.117 25.2025 115.166 25.6031 115.263 25.9617C115.365 26.3158 115.514 26.6191 115.708 26.8714C115.908 27.1237 116.153 27.3185 116.445 27.4557C116.742 27.5885 117.087 27.655 117.481 27.655ZM126.765 28.0667C126.632 28.0667 126.55 28.0047 126.519 27.8807L126.426 27.0374C126.245 27.2145 126.063 27.3738 125.882 27.5155C125.704 27.6572 125.519 27.7767 125.324 27.8741C125.129 27.9715 124.919 28.0445 124.693 28.0932C124.467 28.1463 124.219 28.1729 123.949 28.1729C123.723 28.1729 123.504 28.1397 123.292 28.0733C123.079 28.0069 122.891 27.9051 122.727 27.7678C122.564 27.6306 122.431 27.4557 122.329 27.2433C122.232 27.0263 122.183 26.7674 122.183 26.4663C122.183 26.1874 122.263 25.9285 122.422 25.6894C122.581 25.4504 122.829 25.2423 123.166 25.0652C123.507 24.8882 123.943 24.7465 124.474 24.6402C125.009 24.534 125.651 24.472 126.399 24.4543V23.7637C126.399 23.1528 126.267 22.6836 126.001 22.356C125.74 22.024 125.35 21.858 124.832 21.858C124.514 21.858 124.241 21.9022 124.016 21.9908C123.794 22.0793 123.606 22.1767 123.451 22.2829C123.296 22.3892 123.17 22.4866 123.073 22.5751C122.975 22.6636 122.893 22.7079 122.827 22.7079C122.738 22.7079 122.672 22.6681 122.628 22.5884L122.515 22.3958C122.86 22.0505 123.223 21.7893 123.604 21.6123C123.985 21.4352 124.416 21.3467 124.899 21.3467C125.253 21.3467 125.563 21.4042 125.828 21.5193C126.094 21.63 126.313 21.7916 126.486 22.004C126.663 22.2121 126.796 22.4667 126.884 22.7677C126.973 23.0643 127.017 23.3963 127.017 23.7637V28.0667H126.765ZM124.109 27.7147C124.365 27.7147 124.6 27.6882 124.812 27.635C125.029 27.5775 125.229 27.5 125.41 27.4026C125.596 27.3008 125.769 27.1813 125.928 27.044C126.087 26.9068 126.245 26.7585 126.399 26.5991V24.8793C125.771 24.897 125.229 24.9457 124.773 25.0254C124.321 25.1006 123.947 25.2047 123.65 25.3375C123.358 25.4703 123.141 25.6297 123 25.8156C122.862 25.9971 122.794 26.2051 122.794 26.4398C122.794 26.6611 122.829 26.8537 122.9 27.0175C122.975 27.1768 123.073 27.3097 123.192 27.4159C123.312 27.5177 123.451 27.593 123.611 27.6417C123.77 27.6904 123.936 27.7147 124.109 27.7147ZM134.087 28.0667C133.976 28.0667 133.912 28.0091 133.894 27.894L133.828 26.8515C133.536 27.2499 133.192 27.5664 132.798 27.801C132.409 28.0357 131.971 28.153 131.484 28.153C130.674 28.153 130.041 27.8719 129.585 27.3097C129.133 26.7474 128.907 25.9041 128.907 24.7797C128.907 24.2972 128.969 23.8478 129.093 23.4317C129.222 23.0112 129.407 22.6482 129.651 22.3427C129.899 22.0328 130.2 21.7893 130.554 21.6123C130.913 21.4352 131.324 21.3467 131.789 21.3467C132.236 21.3467 132.624 21.4308 132.951 21.599C133.279 21.7628 133.562 22.004 133.801 22.3228V18.405H134.439V28.0667H134.087ZM131.663 27.6417C132.101 27.6417 132.497 27.5288 132.852 27.303C133.206 27.0772 133.522 26.7629 133.801 26.3601V22.8739C133.544 22.4976 133.261 22.232 132.951 22.0771C132.646 21.9221 132.298 21.8447 131.909 21.8447C131.519 21.8447 131.178 21.9155 130.886 22.0572C130.594 22.1988 130.348 22.4002 130.149 22.6614C129.954 22.9182 129.806 23.2281 129.704 23.5911C129.607 23.9497 129.558 24.3459 129.558 24.7797C129.558 25.7625 129.739 26.4863 130.102 26.9511C130.465 27.4115 130.986 27.6417 131.663 27.6417ZM141.268 28.0667H140.584V18.6706H141.268V28.0667ZM146.193 28.1729C145.746 28.1729 145.396 28.0489 145.144 27.801C144.896 27.5531 144.772 27.1702 144.772 26.6523V22.1368H143.823C143.774 22.1368 143.734 22.1236 143.703 22.097C143.672 22.0704 143.657 22.0328 143.657 21.9841V21.7384L144.785 21.6587L144.945 19.2948C144.949 19.255 144.965 19.2195 144.991 19.1885C145.022 19.1576 145.062 19.1421 145.111 19.1421H145.41V21.6654H147.488V22.1368H145.41V26.6191C145.41 26.8006 145.432 26.9577 145.476 27.0905C145.525 27.2189 145.589 27.3251 145.669 27.4093C145.753 27.4934 145.85 27.5553 145.961 27.5952C146.071 27.635 146.191 27.655 146.319 27.655C146.479 27.655 146.616 27.6328 146.731 27.5885C146.846 27.5399 146.946 27.4889 147.03 27.4358C147.114 27.3783 147.183 27.3274 147.236 27.2831C147.289 27.2344 147.331 27.21 147.362 27.21C147.397 27.21 147.433 27.2322 147.468 27.2765L147.641 27.5553C147.472 27.7413 147.258 27.8918 146.997 28.0069C146.74 28.1176 146.472 28.1729 146.193 28.1729ZM155.002 21.3533C155.476 21.3533 155.899 21.4352 156.271 21.599C156.647 21.7583 156.963 21.9863 157.22 22.2829C157.477 22.5795 157.672 22.9381 157.804 23.3587C157.942 23.7748 158.01 24.2418 158.01 24.7598C158.01 25.2777 157.942 25.7448 157.804 26.1609C157.672 26.577 157.477 26.9334 157.22 27.23C156.963 27.5266 156.647 27.7546 156.271 27.9139C155.899 28.0733 155.476 28.153 155.002 28.153C154.529 28.153 154.104 28.0733 153.727 27.9139C153.355 27.7546 153.039 27.5266 152.778 27.23C152.521 26.9334 152.324 26.577 152.187 26.1609C152.054 25.7448 151.988 25.2777 151.988 24.7598C151.988 24.2418 152.054 23.7748 152.187 23.3587C152.324 22.9381 152.521 22.5795 152.778 22.2829C153.039 21.9863 153.355 21.7583 153.727 21.599C154.104 21.4352 154.529 21.3533 155.002 21.3533ZM155.002 27.655C155.396 27.655 155.739 27.5885 156.031 27.4557C156.328 27.3185 156.574 27.1237 156.769 26.8714C156.968 26.6191 157.116 26.3158 157.213 25.9617C157.311 25.6031 157.36 25.2025 157.36 24.7598C157.36 24.3215 157.311 23.9231 157.213 23.5645C157.116 23.2059 156.968 22.9005 156.769 22.6482C156.574 22.3914 156.328 22.1944 156.031 22.0572C155.739 21.9199 155.396 21.8513 155.002 21.8513C154.608 21.8513 154.263 21.9199 153.966 22.0572C153.674 22.1944 153.428 22.3914 153.229 22.6482C153.034 22.9005 152.886 23.2059 152.784 23.5645C152.687 23.9231 152.638 24.3215 152.638 24.7598C152.638 25.2025 152.687 25.6031 152.784 25.9617C152.886 26.3158 153.034 26.6191 153.229 26.8714C153.428 27.1237 153.674 27.3185 153.966 27.4557C154.263 27.5885 154.608 27.655 155.002 27.655ZM160.069 28.0667V21.4595H160.414C160.529 21.4595 160.596 21.5149 160.614 21.6255L160.673 22.6216C160.974 22.2409 161.324 21.9354 161.722 21.7052C162.125 21.4706 162.572 21.3533 163.064 21.3533C163.427 21.3533 163.746 21.4108 164.02 21.5259C164.299 21.641 164.529 21.807 164.711 22.024C164.892 22.2409 165.029 22.5021 165.122 22.8075C165.215 23.113 165.262 23.4583 165.262 23.8434V28.0667H164.631V23.8434C164.631 23.2236 164.489 22.7389 164.206 22.3892C163.923 22.035 163.489 21.858 162.904 21.858C162.471 21.858 162.068 21.9708 161.696 22.1966C161.324 22.418 160.992 22.7234 160.7 23.113V28.0667H160.069Z" fill="white"/>
<path d="M55.4149 34.8563C55.3968 31.6826 56.9007 29.2872 59.9447 27.523C58.2415 25.1967 55.6686 23.9169 52.2712 23.6661C49.0551 23.4239 45.5399 25.4562 44.2535 25.4562C42.8945 25.4562 39.778 23.7525 37.3319 23.7525C32.2766 23.8304 26.9043 27.6008 26.9043 35.2714C26.9043 37.5372 27.3392 39.8778 28.2089 42.2935C29.3685 45.4672 33.5541 53.2503 37.9208 53.1205C40.2038 53.0686 41.8164 51.5726 44.788 51.5726C47.6689 51.5726 49.1638 53.1205 51.7095 53.1205C56.1125 53.06 59.8994 45.9861 61.0047 42.8037C55.0978 40.1488 55.4149 35.0207 55.4149 34.8563ZM50.2872 20.6566C52.7604 17.8547 52.534 15.3036 52.4615 14.387C50.2781 14.508 47.7505 15.8052 46.31 17.4051C44.7246 19.1173 43.7914 21.236 43.9907 23.6228C46.3553 23.7958 48.5115 22.637 50.2872 20.6566Z" fill="white"/>
</svg>
