<svg width="81" height="80" viewBox="0 0 81 80" fill="none" xmlns="http://www.w3.org/2000/svg">
<path d="M8.34375 72.1673L12.8438 55.834C10.0104 51.0006 8.51042 45.5006 8.51042 40.0007C8.51042 22.5007 22.6771 8.33398 40.1771 8.33398C48.6771 8.33398 56.5104 11.6673 62.5104 17.6673C68.5104 23.6673 71.8438 31.5007 71.8438 40.0007C71.8438 57.5006 57.6771 71.6673 40.1771 71.6673C34.8438 71.6673 29.6771 70.334 25.0104 67.834L8.34375 72.1673Z" fill="white"/>
<path d="M8.34768 73C8.18101 73 7.84768 72.8333 7.68101 72.8333C7.51435 72.6667 7.34768 72.3333 7.51435 72L11.8477 55.8333C9.18101 51 7.68101 45.5 7.68101 39.8333C7.68101 22 22.3477 7.5 40.181 7.5C48.8477 7.5 57.0143 10.8333 63.181 17C69.3477 23.1667 72.681 31.3333 72.681 40C72.681 57.8333 58.181 72.5 40.181 72.5C34.8477 72.5 29.681 71.1667 25.0143 68.6667L8.51435 73H8.34768Z" fill="white"/>
<path d="M40.1797 8.33268C48.6797 8.33268 56.513 11.666 62.513 17.666C68.513 23.666 71.8464 31.4993 71.8464 39.9993C71.8464 57.4993 57.6797 71.666 40.1797 71.666C34.8464 71.666 29.6797 70.3327 25.013 67.8327L8.34635 72.166L12.8464 55.8327C10.013 50.9993 8.51302 45.4993 8.51302 39.9993C8.51302 22.4993 22.6797 8.33268 40.1797 8.33268ZM40.1797 6.66602C21.8464 6.66602 6.84635 21.666 6.84635 39.9993C6.84635 45.666 8.17969 51.166 11.013 55.9993L6.67969 71.666C6.51302 72.166 6.67969 72.8327 7.17969 73.3327C7.51302 73.666 7.84635 73.8327 8.34635 73.8327C8.51302 73.8327 8.67969 73.8327 8.84635 73.8327L25.013 69.666C29.6797 72.166 35.013 73.3327 40.3464 73.3327C58.6797 73.3327 73.6797 58.3327 73.6797 39.9993C73.6797 31.166 70.1797 22.666 64.013 16.4993C57.513 10.166 49.1797 6.66602 40.1797 6.66602Z" fill="#CFD8DC"/>
<path d="M58.8477 21.3327C53.8477 16.3327 47.3477 13.666 40.181 13.666C25.681 13.666 13.8477 25.4993 13.8477 39.9993C13.8477 44.9993 15.181 49.8327 17.8477 53.9993L18.5143 54.9993L15.8477 64.666L25.8477 61.9993L26.8477 62.4993C30.8477 64.8327 35.5143 66.166 40.181 66.166C54.681 66.166 66.5143 54.3327 66.5143 39.8327C66.5143 32.9993 63.8477 26.3327 58.8477 21.3327Z" fill="#40C351"/>
<path fill-rule="evenodd" clip-rule="evenodd" d="M32.3451 26.6673C31.6784 25.334 31.1784 25.334 30.5117 25.334C30.0117 25.334 29.5117 25.334 29.0117 25.334C28.5117 25.334 27.6784 25.5007 26.8451 26.334C26.1784 27.1673 24.0117 29.0006 24.0117 33.0006C24.0117 37.0006 26.8451 40.6673 27.1784 41.1673C27.5117 41.6673 32.6784 50.0007 40.6784 53.1673C47.3451 55.834 48.6784 55.334 50.1784 55.1673C51.6784 55.0006 54.8451 53.334 55.5117 51.334C56.1784 49.5006 56.1784 47.834 56.0117 47.5006C55.8451 47.1673 55.3451 47.0006 54.5117 46.5006C53.6784 46.0006 49.8451 44.1673 49.1784 44.0006C48.5117 43.6673 47.8451 43.6673 47.3451 44.334C46.8451 45.1673 45.3451 46.834 44.8451 47.5006C44.3451 48.0006 43.8451 48.1673 43.1784 47.6673C42.3451 47.334 39.8451 46.5007 36.8451 43.6673C34.5117 41.5007 32.8451 39.0006 32.5117 38.1673C32.0117 37.334 32.5117 37.0006 32.8451 36.5006C33.1784 36.1673 33.6784 35.5007 34.0117 35.1673C34.3451 34.6673 34.5117 34.334 34.8451 33.834C35.1784 33.334 35.0117 32.834 34.8451 32.5007C34.5117 32.1673 33.0117 28.334 32.3451 26.6673Z" fill="white"/>
</svg>
