<?xml version="1.0" encoding="UTF-8"?>
<svg width="256px" height="256px" viewBox="0 0 256 256" version="1.1" xmlns="http://www.w3.org/2000/svg" xmlns:xlink="http://www.w3.org/1999/xlink">
    <!-- Generator: Sketch 46.2 (44496) - http://www.bohemiancoding.com/sketch -->
    <title>account-switch / avatar-placeholder-male</title>
    <desc>Created with Sketch.</desc>
    <defs></defs>
    <g id="Avatar" stroke="none" stroke-width="1" fill="none" fill-rule="evenodd">
        <g id="account-switch-/-avatar-placeholder-male">
            <g>
                <g id="colors-/-blue-/-blue-tint-90">
                    <g id="colors-/-blue-/-blue" fill="#0064FE">
                        <rect id="blue" x="0" y="0" width="256" height="256"></rect>
                    </g>
                    <rect id="tint" fill-opacity="0.9" fill="#FFFFFF" x="0" y="0" width="256" height="256"></rect>
                </g>
                <path d="M181.666161,111.668392 C181.714245,111.668177 181.762334,111.667962 181.810427,111.667746 C184.253064,111.465561 186.616782,113.947686 185.139458,125.930651 C183.368594,140.284866 178.841342,143.543122 176.028171,143.807733 C170.790649,162.073345 163.049856,170.703018 163.737991,170.703018 C164.750463,170.703018 163.679595,189.984215 163.679595,189.984215 L175.553695,192.925683 C175.553695,192.925683 173.190939,197.500472 175.553695,203.383408 C177.916451,209.265412 180.279207,211.553738 180.279207,211.553738 C180.279207,211.553738 191.7571,216.782601 222.138965,229.854756 C236.713945,236.126223 250.507435,245.708123 256,256 L8.25806452,256 C13.7506299,245.708123 27.5431574,236.126223 42.1190997,229.854756 C72.5009648,216.782601 83.9778953,211.553738 83.9778953,211.553738 C83.9778953,211.553738 86.3406512,209.265412 88.7034071,203.383408 C91.0671255,197.500472 88.7034071,192.925683 88.7034071,192.925683 L100.577507,189.984215 C100.577507,189.984215 99.5066394,170.703018 100.519112,170.703018 C101.208209,170.703018 93.4597166,162.067755 88.2231565,143.789098 C85.4022858,143.430383 80.9943746,140.053797 79.2523834,125.930651 C77.7527096,113.776222 80.2053958,111.390473 82.6851753,111.672683 C82.6320411,110.477434 82.5989526,109.274245 82.5863936,108.06382 C78.207455,100.065713 75.4528506,90.0444396 74.3225806,78 C72.9462366,63.3333333 74.8387097,48.3333333 80,33 C85.1612903,37.6666667 95.655914,37.3333333 111.483871,32 C135.225806,24 165.16129,24 172.387097,35 C177.204301,42.3333333 178.580645,48.6666667 176.516129,54 C189.591398,62.6666667 194.408602,73.6666667 190.967742,87 C188.547921,96.3768066 185.447394,104.599604 181.666161,111.668392 Z" id="shape" fill="#97C0FF"></path>
            </g>
        </g>
    </g>
</svg>