<?xml version="1.0" encoding="UTF-8"?>
<svg width="256px" height="256px" viewBox="0 0 256 256" version="1.1" xmlns="http://www.w3.org/2000/svg" xmlns:xlink="http://www.w3.org/1999/xlink">
    <!-- Generator: Sketch 46.2 (44496) - http://www.bohemiancoding.com/sketch -->
    <title>account-switch / avatar-placeholder-female</title>
    <desc>Created with Sketch.</desc>
    <defs></defs>
    <g id="Avatar" stroke="none" stroke-width="1" fill="none" fill-rule="evenodd">
        <g id="account-switch-/-avatar-placeholder-female">
            <g>
                <g id="colors-/-blue-/-blue-tint-90">
                    <g id="colors-/-blue-/-blue" fill="#0064FE">
                        <rect id="blue" x="0" y="0" width="255" height="256"></rect>
                    </g>
                    <rect id="tint" fill-opacity="0.9" fill="#FFFFFF" x="0" y="0" width="255" height="256"></rect>
                </g>
                <path d="M229.794931,236.381148 C209.208086,226.072103 174.011557,210.443574 173.679282,210.443574 C172.683404,191.822066 161.062302,188.496323 161.062302,188.496323 L160.387339,180.232211 C184.627315,176.673249 199.246465,166.881836 199.246465,166.881836 C199.246465,166.881836 191.942096,164.221621 184.304506,138.949574 C176.667863,113.677528 189.949394,78.7610157 164.714486,50.49599 C151.345863,35.5225609 137.791697,33.1477072 127.999527,34.2256348 C118.207356,33.1477072 104.65319,35.5225609 91.2845676,50.49599 C66.0487131,78.7610157 79.3311902,113.677528 71.6936002,138.949574 C64.0569569,164.221621 56.7516418,166.881836 56.7516418,166.881836 C56.7516418,166.881836 71.3707918,176.673249 95.6117148,180.232211 L94.9367518,188.496323 C94.9367518,188.496323 83.3156493,191.822066 82.3188246,210.443574 C81.9874963,210.443574 46.7909674,226.072103 26.2041219,236.381148 C14.6786313,242.152849 9.81567893,250.110742 8,256 L247.999053,256 C246.183374,250.110742 241.320422,242.152849 229.794931,236.381148" id="shape" fill="#97C0FF"></path>
            </g>
        </g>
    </g>
</svg>