{
  "orders": [
    {
      "orderNumber": 20162525,
      "supplier": {
        "supplierName": "samsung"
      }
    },
    {
      "orderNumber": 2016558987,
      "supplier": {
        "supplierName": "toshiba"
      }
    },
    {
      "orderNumber": 201565545,
      "supplier": {
        "supplierName": "nokia"
      }
    }
  ]
}
