(module POWERPAK_SO8_SINGLE (layer F.Cu) (tedit 0)
  (fp_text reference U$4 (at 0 0) (layer F.SilkS) hide
    (effects (font (size 1.27 1.27) (thickness 0.15)))
  )
  (fp_text value SI7461DP (at 0 0) (layer F.SilkS) hide
    (effects (font (size 1.27 1.27) (thickness 0.15)))
  )
  (fp_poly (pts (xy 2.09 -0.255) (xy 5.59 -0.255) (xy 5.59 0) (xy 6.61 0)
    (xy 6.61 -0.61) (xy 5.9 -0.61) (xy 5.9 -1.27) (xy 6.61 -1.27)
    (xy 6.61 -1.88) (xy 5.9 -1.88) (xy 5.9 -2.54) (xy 6.61 -2.54)
    (xy 6.61 -3.15) (xy 5.9 -3.15) (xy 5.9 -3.81) (xy 6.61 -3.81)
    (xy 6.61 -4.42) (xy 5.59 -4.42) (xy 5.59 -4.165) (xy 2.09 -4.165)) (layer Dwgs.User) (width 0))
  (fp_poly (pts (xy 1.963 -0.128) (xy 5.463 -0.128) (xy 5.463 0.127) (xy 6.737 0.127)
    (xy 6.737 -0.737) (xy 6.027 -0.737) (xy 6.027 -1.143) (xy 6.737 -1.143)
    (xy 6.737 -2.007) (xy 6.027 -2.007) (xy 6.027 -2.413) (xy 6.737 -2.413)
    (xy 6.737 -3.277) (xy 6.027 -3.277) (xy 6.027 -3.81) (xy 6.61 -3.81)
    (xy 6.61 -4.42) (xy 5.59 -4.42) (xy 5.59 -4.292) (xy 1.963 -4.292)) (layer F.Mask) (width 0))
  (fp_poly (pts (xy 2.09 -0.255) (xy 5.59 -0.255) (xy 5.59 0) (xy 6.61 0)
    (xy 6.61 -0.61) (xy 5.9 -0.61) (xy 5.9 -1.27) (xy 6.61 -1.27)
    (xy 6.61 -1.88) (xy 5.9 -1.88) (xy 5.9 -2.54) (xy 6.61 -2.54)
    (xy 6.61 -3.15) (xy 5.9 -3.15) (xy 5.9 -3.81) (xy 6.61 -3.81)
    (xy 6.61 -4.42) (xy 5.59 -4.42) (xy 5.59 -4.165) (xy 2.09 -4.165)) (layer F.Paste) (width 0))
  (fp_text user >Name (at 0 1.778) (layer F.SilkS)
    (effects (font (size 1.2065 1.2065) (thickness 0.1016)) (justify left bottom))
  )
  (fp_text user >Value (at 0 3.429) (layer F.Fab)
    (effects (font (size 1.2065 1.2065) (thickness 0.1016)) (justify left bottom))
  )
  (fp_line (start 0.36 -4.699) (end 0.381 -4.699) (layer F.SilkS) (width 0.2032))
  (fp_line (start 0.381 -4.699) (end 6.223 -4.699) (layer F.SilkS) (width 0.2032))
  (fp_line (start 6.223 -4.699) (end 6.25 -4.699) (layer F.SilkS) (width 0.2032))
  (fp_line (start 6.223 -4.699) (end 6.223 0.254) (layer F.SilkS) (width 0.2032))
  (fp_line (start 6.223 0.254) (end 0.381 0.254) (layer F.SilkS) (width 0.2032))
  (fp_line (start 0.381 0.254) (end 0.381 -4.699) (layer F.SilkS) (width 0.2032))
  (pad P$1 smd rect (at 0.635 -0.3175) (size 1.27 0.635) (layers F.Cu F.Paste F.Mask)
    (solder_mask_margin 0.1016))
  (pad P$2 smd rect (at 0.635 -1.5875) (size 1.27 0.635) (layers F.Cu F.Paste F.Mask)
    (solder_mask_margin 0.1016))
  (pad P$3 smd rect (at 0.635 -2.8575) (size 1.27 0.635) (layers F.Cu F.Paste F.Mask)
    (solder_mask_margin 0.1016))
  (pad P$4 smd rect (at 0.635 -4.1275) (size 1.27 0.635) (layers F.Cu F.Paste F.Mask)
    (solder_mask_margin 0.1016))
  (pad P$5 smd rect (at 6.096 -4.1275) (size 1.02 0.635) (layers F.Cu F.Paste F.Mask)
    (solder_mask_margin 0.1016))
)
