(module 0805 (layer F.Cu) (tedit 0)
  (fp_text reference R2 (at -0.889 -1.016) (layer F.SilkS)
    (effects (font (size 1.2065 1.2065) (thickness 0.1016)) (justify left bottom))
  )
  (fp_text value 10k (at -0.889 2.286) (layer F.Fab)
    (effects (font (size 1.2065 1.2065) (thickness 0.1016)) (justify left bottom))
  )
  (fp_line (start -0.381 -0.66) (end 0.381 -0.66) (layer F.Fab) (width 0.1016))
  (fp_line (start -0.356 0.66) (end 0.381 0.66) (layer F.Fab) (width 0.1016))
  (fp_line (start -0.2032 -0.6096) (end 0.2032 -0.6096) (layer F.SilkS) (width 0.254))
  (fp_line (start -0.2032 0.6096) (end 0.2032 0.6096) (layer F.SilkS) (width 0.254))
  (fp_poly (pts (xy -1.0921 0.724) (xy -0.3418 0.724) (xy -0.3418 -0.7263) (xy -1.0921 -0.7263)) (layer F.Fab) (width 0))
  (fp_poly (pts (xy 0.3555 0.724) (xy 1.1058 0.724) (xy 1.1058 -0.7263) (xy 0.3555 -0.7263)) (layer F.Fab) (width 0))
  (fp_poly (pts (xy -0.1002 0.4002) (xy 0.1002 0.4002) (xy 0.1002 -0.4002) (xy -0.1002 -0.4002)) (layer F.Adhes) (width 0))
  (fp_poly (pts (xy -0.4065 -0.4571) (xy 0.4319 -0.4571) (xy 0.4319 -0.7367) (xy -0.4065 -0.7367)) (layer F.Fab) (width 0))
  (fp_poly (pts (xy -0.4319 0.7366) (xy 0.4319 0.7366) (xy 0.4319 0.4824) (xy -0.4319 0.4824)) (layer F.Fab) (width 0))
  (pad 1 smd rect (at -0.9 0) (size 1.1 1.5) (layers F.Cu F.Paste F.Mask)
    (solder_mask_margin 0.1016))
  (pad 2 smd rect (at 0.9 0) (size 1.1 1.5) (layers F.Cu F.Paste F.Mask)
    (solder_mask_margin 0.1016))
)
