/Users/macbookpro/IdeaProjects/Driverry/src/test/java/automation/step_definitions/Hook.java
/Users/macbookpro/IdeaProjects/Driverry/src/test/java/automation/step_definitions/LoginStepDefinitions.java
/Users/macbookpro/IdeaProjects/Driverry/src/test/java/automation/pages/loginPage.java
/Users/macbookpro/IdeaProjects/Driverry/src/test/java/automation/runners/CukesRunner.java
/Users/macbookpro/IdeaProjects/Driverry/src/test/java/automation/pages/homePage.java
/Users/macbookpro/IdeaProjects/Driverry/src/test/java/automation/utilities/autoReceiveDevice.java
/Users/macbookpro/IdeaProjects/Driverry/src/test/java/automation/utilities/autoReceiveOSver.java
/Users/macbookpro/IdeaProjects/Driverry/src/test/java/automation/utilities/Driver.java
/Users/macbookpro/IdeaProjects/Driverry/src/test/java/automation/utilities/ConfigurationReader.java
