{
    "button_hints": "শুদ্ধ করে কুরআন পড়তে শেখার অনলাইন কোর্সটি ইনশাআল্লাহ শুরু হবে ১৩ জুন!",
    "button_text": "কোর্সের বিস্তারিত দেখুন",
    "button_url": "https://www.facebook.com/groups/muslimsday/permalink/857146888126721",
    "content_message": "আজ ১৪৪১ হিজরির রমাদান মাসের সর্বশেষ জুম'আ। আল্লাহর রহমত ও মাগফিরাতের এই মহিমান্বিত মাসের একদম শেষ প্রান্তে আমরা এসে পড়েছি। নিজের কাছে প্রশ্নটা চলেই আসে, \"আমি কি আমাকে এই রমাদানে ক্ষমা বা মাফ করিয়ে নিতে পেরেছি?\" উত্তরটাতেও অন্তরাত্মা কেঁপে ওঠে! কিছুই তো করতে পারি নি...\n\nআজ জুম'আর দিনের যেই আমলগুলো রয়েছে তার মধ্যে অন্যতম হচ্ছে সূরা কাহফ তিলাওয়াত করা। গোসল করা। সুগন্ধি লাগানো। বেশি বেশি দরুদ পড়া। আগে আগে মসজিদে গিয়ে ইমামের কাছাকাছি বসে মনোযোগ দিয়ে খুতবা শোনা। এগুলোর মধ্যে বেশি সংখ্যক আমল আমরা করার চেষ্টা করি।\n\nএকই সাথে আজ ২৮ রমাদান। মাগরিবের মধ্য দিয়ে ২৯ রমাদান শুরু হবে ইনশাআল্লাহ। এটি একটি বিজোড় রাত। এই রাতটিও সম্ভাব্য লাইলাতুল ক্বদরের রাত। আমরা অনেক সময়ই ২৭ রাতের পর লাইলাতুল ক্বদরের অনুসন্ধান করা থেকে নিজেকে গুটিয়ে নিই। আজকের রাতটিও কিন্তু লাইলাতুল ক্বদর হওয়ার সম্ভাবনা রাখে। তাই এই রাতেও কিয়ামুল লাইল, তাহাজ্জুদ, কুরআন তিলাওয়াত ও দুআ করি। সাধ্য মত দান করি। সাদাকাতুল ফিতর আদায় না করে থাকলে তা বেশি মূল্য দিয়ে আদায়ের নিয়ত করে ফেলি। ফিতরা মানেই মুখস্থ ৭০ টাকা নয়। ফিতরা সম্পর্কে বিস্তারিত জানা যাবে আমার এই ব্লগ পোস্ট থেকেঃ https://hellohasan.com/2020/05/05/ফিতরা-কত-টাকা-বিধান ।\n\nকুরআন মানব জীবনের জন্য আল্লাহ প্রদত্ত গাইডলাইন। এজন্য আমাদের অ্যাপ থেকে বরাবরই আমরা কুরআন তিলাওয়াত ও অর্থ বুঝে কুরআন পড়ার ব্যাপারে উৎসাহ দিয়ে এসেছি। অনেক ভাইয়েরা কষ্টের কথা শেয়ার করেছেন আমাদের সাথে যে আরবি পড়তে না জানার কারণে তারা কুরআন পড়তে পারছেন না। তাদের প্রত্যেকের মনোকষ্ট আমাকে সফটওয়্যার ইঞ্জিনিয়ারিংয়ের পাশাপাশি তাজবীদ সহ কুরআন শিক্ষা দেয়ার কোর্স করানোর কাজে টেনে নিয়ে এসেছিল। রমাদান শুরু হওয়ার আগে এই অ্যাপের বেশ কয়েক জন ইউজার ও অন্যান্য কিছু ভাইদের নিয়ে আমি অনলাইনে কুরআন শিক্ষার কোর্স চালু করি। আলহামদুলিল্লাহ, এটি এখন শেষের পথে। আগামী ১৩ জুন থেকে দ্বিতীয় ব্যাচের ক্লাস শুরু করার ইচ্ছা আছে ইনশাআল্লাহ।\n\nআপনার জন্য কুরআন শুদ্ধ করে পড়তে পারা ফরজ। পড়তে না পারলে বা বাংলা উচ্চারণ দেখে পড়লে কঠিনতম গুনাহের মুখোমুখি হতে হবে। তাই যারা তাজবীদ সহ শুদ্ধ রূপে কুরআন পড়তে এখনো পারি না তারা আজকেই নিয়ত করে ফেলি মসজিদের ইমাম সাহেব বা মুয়াজ্জিন সাহেবের সাথে বসে কুরআন পড়া শেখার জন্য। কারণ সামনে বসে না পড়লে ১০০% শেখা সম্ভব হয় না। লকডাউনের জন্য বা অন্য কোনো কারণে আপনার মসজিদের ইমাম-মুয়াজ্জিন সাহেবদের বা অন্য কোনো আলেমের থেকে যদি কুরআন শেখা শুরু করা সম্ভব না হয়। তাহলে নির্ভরযোগ্য মনে হলে আমাদের এখানকার অনলাইন কোর্সটি করতে পারেন। নিচের ডিটেইলস বাটনে ক্লিক করলে সেখানে পুরো কোর্সের আউটলাইন, সময়কাল ও প্রথম ব্যাচের ক্লাসগুলোর রেকর্ড পাওয়া যাবে। অর্থাৎ আপনি কোর্সটি না করতে পারলেও প্রথম ব্যাচের ক্লাসগুলোর মাধ্যমে নিজে নিজে শেখার চেষ্টা করতে পারবেন ইনশাআল্লাহ।\n\nআল্লাহ আমাদের সকলকে কুরআনের ছাত্র বানিয়ে দিন। মৃত্যুর দিন পর্যন্ত আমাদেরকে কুরআনের ছাত্র হিসাবে কবুল করুন। আমীন।",
    "content_title": "জুম'আতুল বিদা - আজ রাতটিও হতে পারে লাইলাতুল ক্বদর"
}