{
    "button_hints": "শাওয়ালের ৬টি রোজা সম্পর্কে বিস্তারিত হুকুম, ফজিলত, দলিল ও প্রাসঙ্গিক জিজ্ঞাসা সম্পর্কে জানতে আমার ব্লগ পোস্টটি পড়তে পারেন",
    "button_text": "ব্লগ পোস্ট পড়ুন",
    "button_url": "https://hellohasan.com/2020/05/30/শাওয়াল-ছয়-রোজা-সাক্ষী?utm_source=Muslims%20Day&utm_medium=push&utm_campaign=blog%20post%20promotion",
    "content_message": "আজ ১৮ শাওয়াল (১১ জুন)। অর্থাৎ শাওয়াল মাসের আরো অন্তত ১১-১২ দিন বাকি আছে। এ মাসের ছয়টি রোজার ফজিলতের কথা আমরা সকলেই জানি। তাই যারা এখনো এই ৬ টি রোজা রাখতে পারি নাই, তারা চেষ্টা করি আগামী দিনগুলোর মধ্যে ৬টি নফল রোজা রাখার।\n\nআমাদের দেশে শাওয়ালের ৬টি রোজাকে অনেকে \"সাক্ষী রোজা\" বলে থাকেন। এধরণের টার্ম কুরআন-সুন্নাহ থেকে পাওয়া যায় না। মানুষের মনগড়া একটা পরিভাষা এই \"সাক্ষী রোজা\"।\n\nযারা এটাকে সাক্ষী রোজা নামে ডাকেন তারা মনে করেন \"এই ৬টি রোজা রাখলে এরাই কিয়ামতের দিন পুরো রমজানে রোজা রাখার ব্যাপারে সাক্ষ্য দিবে\"। প্রসিদ্ধ কোনো ইসলামিক স্কলার বা হাদীস গ্রন্থে এরকম কোনো বক্তব্য পাওয়া যায় না। তাই আমাদের উচিত মনগড়া, ভিত্তিহীন এসব কথা দিয়ে এই রোজার ফজিলত বর্ণনা না করা। বরং হাদীস হতে প্রাপ্ত ফজিলতগুলোই বর্ণনা করা উচিত।\n\n\"যে ব্যক্তি রমজানের রোজা রাখল এরপর শাওয়াল মাসে ছয়টি রোজা রাখল সে যেন গোটা বছর রোজা রাখল।\" [সহিহ মুসলিম, সুনানে আবু দাউদ, জামে তিরমিজি, সুনানে নাসায়ী ও সুনানে ইবনে মাজাহ]\n\nআবু আইয়ুব আনসারি রাদিআল্লাহু আনহু থেকে বর্ণিত, রাসূলুল্লাহ সাল্লাল্লাহু আলাইহি ওয়া সাল্লাম ইরশাদ করেন, যে ব্যক্তি রমজানের রোজা রাখবে অতপর শাওয়ালে ছয়টি রোজা পালন করবে সে যেন যুগভর রোজা রাখল। (মুসলিম)\n\nহযরত মুসলিম কারশী রাঃ হতে বর্ণিত আছে, তিনি বলেন একদা আমি রাসূলুল্লাহ (সাঃ) কে জিজ্ঞেস করলাম সারা বছর রোজা রাখা সম্পর্কে; রাসূলুল্লাহ সাঃ বললেন তোমার উপর তোমার পরিবার-পরিজনের হক রয়েছে। অতঃএব তুমি রমাদান মাস ও এর পরবর্তী মাস তাতে রোজা রাখবে এবং প্রত্যেক বুধবার, বৃহস্পতি বার রোজা রাখবে। আর যখনই এরূপ করলে যেন সারা বছর রোজা রাখলে। (আবু দাউদ, তিরমিযি। এ হাদীসের বর্ণনা সূত্র যয়ীফ বা দুর্বল)\n\nপ্রসঙ্গত উল্লেখ্য, শাওয়ালের ৬টি রোজা ফরজ বা ওয়াজিব নয়। এগুলো আমাদের জন্য বাধ্যতামূলক করা হয় নি। অনেকের মাঝে ভুল ধারণা রয়েছে যে এই রোজাগুলো না রাখলে গুনাহ হবে, এই ধারণাটা ভুল। এই রোজাগুলো রাখলে সারা বছর রোজা রাখার সওয়াব হবে কিন্তু কেউ যদি ছেড়ে দেয় তাহলে গুনাহ হবে না। আমাদের সকলের এই রোজাগুলো রাখা উচিত। কেননা, মানবিক ত্রুটির কারণে রমাদানের ফরজ রোজাগুলোতে ভুল হয়ে থাকলে আল্লাহ নফল রোজার মাধ্যমে তা ব্যালেন্স করে দিতে পারেন।\n\nঅনেকে মনে করেন ঈদের পর দিন থেকেই টানা ছয় দিন এ রোজা রাখতে হবে। এটাও সঠিক নয়। ঈদের পর দিন থেকে শাওয়ালের শেষ পর্যন্ত যে কোনো ছয়দিন টানা বা ভেঙে ভেঙে রোজা রাখলেই তা আদায় হয়ে যাবে।\n\nআল্লাহ আমাদের সবাইকে শাওয়াল মাসের ৬টি রোজা আদায় করার তাওফিক দান করুন। আল্লাহ আমাদেরকে বিদআতমুক্ত আমল করার তাওফিক দান করুন। আমীন।",
    "content_title": "শাওয়ালের ৬ রোজা রাখছেন তো?"
}