{
  "button_hints": "অ্যাপ সম্পর্কে আপনার মতামত জানিয়ে আমাদের অনুপ্রাণিত করতে 5 star রেটিং দিন ও অ্যাপের কার্যক্রম চালিয়ে নিতে আর্থিক সহযোগিতা করুন",
  "button_text": "অ্যাপ আপডেট করুন ও রেটিং দিন",
  "button_url": "https://play.google.com/store/apps/details?id=theoaktroop.appoframadan",
  "content_message": "বাংলাদেশের আকাশে আজ (শুক্রবার) কোথাও জুমাদিউল আউয়াল মাসের চাঁদ দেখা যায়নি। তাই রবিউস সানী মাসটি ৩০ দিন পূর্ণ হবে। আর জুমাদিউল আউয়াল মাস শুরু হবে আগামী ২৯ ডিসেম্বর, ২০১৯ রবিবার থেকে।\n\nশুক্রবার সন্ধ্যায় অনুষ্ঠিত হওয়া জাতীয় চাঁদ দেখা কমিটির বৈঠক থেকে এ সিদ্ধান্ত জানানো হয়েছে।",
  "content_title": "জুমাদিউল আউয়াল মাসের চাঁদ দেখা যায় নি"
}