{
  "button_hints": "জিলহজ্জ মাসের আমল, কুরবানির করণীয় ও বর্জনীয় এবং বিভিন্ন মাসআলা জানতে নিচের বাটনে ক্লিক করুন",
  "button_text": "কুরবানি সম্পর্কে জানুন",
  "button_url": "https://hellohasan.com/2016/09/02/কুরবানি-ভুল-সঠিক-ধারণা",
  "content_message": "আজ শুক্রবার বাংলাদেশের আকাশে পবিত্র জিলহজ্জ মাসের চাঁদ দেখা গেছে। ঈদুল আযহা উদযাপিত হবে ১২ আগস্ট ২০১৯ (সূত্রঃ সময় টিভি)\n\nআল্লাহু আকবার আল্লাহু আকবার; লা ইলাহা ইল্লাল্লাহু আল্লাহু আকবার আল্লাহু আকবার; ওয়ালিল্লাহিল হামদ\n",
  "content_title": "জিলহজ্জ মাসের চাঁদ দেখা গেছে - ১২ আগস্ট ঈদুল আযহা"
}