{
  "button_hints": "আমাদের অ্যাপের 5.0.9 ভার্সনে হিজরি তারিখ বিষয়ে কিছু ইমপ্রুভমেন্ট আনা হয়েছে।\n\nইতমধ্যে আপডেট করে না থাকলে, প্লেস্টোর থেকে আপডেট করুন ও ৫ স্টার রেটিং দিন",
  "button_text": "অ্যাপ আপডেট করুন ও রেটিং দিন",
  "button_url": "https://play.google.com/store/apps/details?id=theoaktroop.appoframadan",
  "content_message": "মৃত ব্যক্তির খাটিয়া বহনের সময় অধিকাংশ এলাকায় উচ্চস্বরে কালিমা পড়তে দেখা যায়। এটি একটি ভুল আমল।\n\nরাসূল (সা) এবং সাহাবায়ে কেরাম জানাযা বহনের সময় চুপ থাকতেন। আখেরাতের বিষয়ে চিন্তামগ্ন থাকতেন। ইবনু জুরাইজ রাহ. বলেন- \"নবী কারীম সাল্লাল্লাহু আলাইহি ওয়াসাল্লাম যখন জানাযার পিছনে চলতেন তখন অধিক চুপ থাকতেন এবং চিন্তায় পূর্ণ মগ্ন থাকতেন\" (মুসান্নাফে আবদুর রাযযাক, হাদীস ৬২৮২; মুসান্নাফে ইবনে আবী শাইবা, হাদীস ১১৩১৫)\n\nহযরত আবু হুরায়রা রা. থেকে বর্ণিত, নবী (সা) বলেনঃ \"জানাযার পিছনে যেন শব্দ না করা হয় এবং আগুন না নেওয়া হয়\" (সুনানে আবু দাউদ, হাদীস ৩১৬৩; মুসনাদে আহমাদ, হাদীস ৯৫১৫)\n\nসুনানে কুবরা বায়হাকী ও ইবনুল মুনযিরের আলআওসাতের এক বর্ণনা থেকে জানা যায়, সাহাবায়ে কেরামের আমল ব্যাপকভাবে এমনি ছিল; তাঁরা জানাযার পিছনে যাওয়ার সময় কোনো আওয়াজ করতেন না। [সুনানে কুবরা, বায়হাকী ৪/৭৪; আলআওসাত, ইবনুল মুনযির ৫/৪২২ (৩০৩৪)]\n\nএ সমস্ত হাদীস ও আছারের আলোকে ফকীহগণ বলেছেন, জানাযার পিছনে চলার সময় মূল কাজ হল আখেরাতের ফিকিরে থাকা। যিকির করতে চাইলে তা হবে অনুচ্চ স্বরে। এক্ষেত্রে যিকির করতে গিয়ে আওয়াজ উঁচু করা ঠিক নয়। (বাদায়েউস সানায়ে ২/৪৬; ফাতাওয়া তাতারখানিয়া ৩/৩৭)\n\nReference:\nমাসিক আলকাউসার\nhttps://www.alkawsar.com/bn/article/2448/",
  "content_title": "মৃত ব্যক্তির খাটিয়া বহনের সময় উচ্চস্বরে কালিমা পাঠ করা সুন্নাহ পরিপন্থী কাজ"
}
