{
  "button_text": "রেটিং দিন",
  "button_hints": "অ্যাপ সম্পর্কে আপনার মতামত জানিয়ে আমাদের অনুপ্রাণিত করতে 5 star রেটিং দিন ও অ্যাপের কার্যক্রম চালিয়ে নিতে আর্থিক সহযোগিতা করুন",
  "button_url": "https://play.google.com/store/apps/details?id=theoaktroop.appoframadan",
  "content_message": "হাদীসের আলোকে জানা যায় যে, কিছু কঠিন পাপ আছে যেগুলির শাস্তি শুধু আখেরাতেই নয়, দুনিয়াতেও ভোগ করতে হয়। বিশেষত যে পাপগুলি মানুষের অধিকারের সাথে জড়িত এবং যে পাপের ফলে অন্য মানুষ কষ্ট পায় বা সমাজের ক্ষতি হয়।\n\nরাসূল (সাঃ) বলেছেনঃ\n\n(১) যখন কোনো সম্প্রদায়ের মধ্যে অশ্লীলতা এমনভাবে ছড়িয়ে পড়ে যে তারা প্রকাশ্যে অশ্লীলতায় লিপ্ত হতে থাকে, তখন তাদের মধ্যে এমন সব রোগব্যাধি ছড়িয়ে পড়ে যা তাদের পূর্বপুরুষদের মধ্যে প্রসারিত ছিল না\n\n(২) যখন কোনো সম্প্রদায়ের মানুষেরা ওজনে কম বা ভেজাল দিতে থাকে, তখন তারা  দুর্ভিক্ষ, জীবনযাত্রার কাঠিন্য ও প্রশাসনের বা ক্ষমতাশীলদের অত্যাচারের শিকার হয়\n\n(৩) যদি কোনো সম্প্রদায়ের মানুষেরা যাকাত প্রদান না করে, তাহলে তারা অনাবৃষ্টির শিকার হয়। যদি পশুপাখি না থাকত তাহলে তারা বৃষ্টি থেকে একেবারেই বঞ্চিত হত\n\n(৪) যখন কোনো সম্প্রদায়ের মানুষ আল্লাহ ও আল্লাহর রাসূলের ওয়াদা বা আল্লাহর নামে প্রদত্ত ওয়াদা ভঙ্গ করে, তখন আল্লাহ তাদের কোনো বিজাতীয় শত্রুকে তাদের উপর ক্ষমতাবান করে দেন, যারা তাদের কিছু সম্পদ নিয়ে যায়\n\n(৫) আর যদি কোনো সম্প্রদায়ের শাসকবর্গ ও নেতাগণ আল্লাহর কিতাব (পবিত্র কুরআন) অনুযায়ী বিচার শাসন না করেন এবং আল্লাহর বিধানের সঠিক ও ন্যায়ানুগ প্রয়োগের জন্য সাধ্যমত চেষ্টা না করেন তখন আল্লাহ তাদের মধ্যে পরস্পর শত্রুতা ও মতবিরোধ সৃষ্টি করে দেন, তারা তাদের বীরত্ব একে অপরকে দেখাতে থাকে (ইবনু মাজাহ ৪০১৯ - http://ihadis.com/books/ibn-majah/hadis/4019)\n\nলেখাটি সংগ্রহ করা হয়েছে ড. আবদুল্লাহ জাহাঙ্গীর (রাহিমাহুল্লাহ) রচিত \"রামাদানের সওগাত\" বই থেকে\nবইটির সারাংশ ও ছোট রিভিউ পাওয়া যাবে এই লিংকেঃ https://hellohasan.com/2020/05/03/রামাদানের-সওগাত-abdullah-jahangir",
  "content_title": "হাদীসের আলোকে ৫টি পাপের শাস্তি দুনিয়াতেই হবে"
}
