{
    "button_hints": "আমাদেরকে উৎসাহিত করতে ৫ স্টার রেটিং দিন ও অ্যাপের ডেভেলপমেন্ট চালিয়ে নিতে আর্থিক সহযোগিতা করুন",
    "button_text": "অ্যাপ আপডেট করুন ও রেটিং দিন",
    "button_url": "https://play.google.com/store/apps/details?id=theoaktroop.appoframadan",
    "content_message": "গরু যবেহের পর দ্রুত মৃত্যু নিশ্চিত করার জন্য কসাই ও অন্যান্যরা প্রায় সময়ই ছুরি দিয়ে গরুর গলায় খোচা দেয়। এটা সাধারণত মেরুদণ্ড বরাবর হয়ে থাকে। এছাড়াও গরুর পায়ের রগ কেটে দেয়া হয়। এই কাজগুলো প্রথমত অমানবিক দ্বিতীয়ত অবৈজ্ঞানিক।\n\nযবেহের পর যখন কাটা অংশ দিয়ে মেরুদণ্ড বরাবর জোরে খোচা দেয়া হয় তখন গরুর স্ট্রোকের মত হয়। এই খোচা বা পায়ের রগ কেটে দেয়ার ফলে গরুর sudden death বা হঠাৎ মৃত্যু ঘটে। তখন গরুর হার্ট বন্ধ হয়ে যায়। ফলে রক্ত পাম্প করার কাজটাও বন্ধ হয়ে যায়। এতে সমস্যা কী? সমস্যাটা ভয়াবহ! \n\nগরু যবেহের পর স্বাভাবিক মৃত্যু নিশ্চিত হতে ১৫ মিনিট সময় লাগতে পারে। এ সময় গরু পা ছুড়তে থাকে এবং এ সময় হার্টও ব্লাড পাম্প করতে থাকে। পা ছুড়াছুড়ি ও শরীরের তীব্র ঝাকুনির ফলে গরুর সারা দেহের বেশিরভাগ রক্তই বের হয়ে যায়। এতে গোশতটা হয় বেশি স্বাস্থ্যকর। কিন্তু গরুর sudden death বা হঠাৎ মৃত্যু ঘটলে হার্ট বন্ধ হয়ে যাওয়ায় মাংসের মধ্যে অনেক রক্ত থেকে যায়। সব রক্ত স্বাভাবিক ভাবে বের হয়ে আসে না। আর রক্ত বাহিত রোগজীবাণুগুলোও মাংসের মধ্যে থেকে যায়।\n\nতাই কুরবানির পশুর উপর জুলুম না করে তাকে ঠান্ডা হতে ১০-১৫ মিনিট সময় দিন। এই ১০-১৫ মিনিটের ধৈর্য্য আপনার পরিবার ও আত্মীয় স্বজনদের জন্য আরো নিরাপদ ও স্বাস্থ্যকর গোশত পাওয়ার ক্ষেত্রে সহায়ক হবে ইনশাআল্লাহ।\n\nকুরবানীর বিভিন্ন মাসআলা ও প্রচলিত ভুল ধারণাগুলো সম্পর্কে জানতে ভিজিট করুনঃ https://hellohasan.com/2016/09/02/কুরবানি-ফজিলত-আমল-মাসআলা/",
    "content_title": "কুরবানির পশুর গোশত স্বাস্থ্যকর রাখার একটি টিপস"
}