{
  "button_hints": "আপনার কুরবানি থেকে গরীব মানুষদের অন্তত ঈদের দিনে মাংস খাওয়ার সুযোগ করে দিতে",
  "button_text": "এখনই কিনুন",
  "button_url": "https://shorobor.biz/product/udhiya?utm_source=muslims-day&utm_medium=notification&utm_campaign=udhiya",
  "content_message": "উদহিয়া বা কুরবানি প্রজেক্ট সরোবরের একটি সামাজিক ব্যবসা যেখানে গরু বা গরুর ভাগ বিক্রি করা হয়। \n\nএই গরুগুলো ঈদুল আদহার প্রথম এবং দ্বিতীয় দিনে ক্রেতাদের পক্ষ হতে চর, পাহাড়, উপকূলীয় অঞ্চল, বন্যা উপদ্রুত এলাকা, মঙ্গাপীড়িত জেলাসহ দেশের বিভিন্ন প্রত্যন্ত অঞ্চলে কুরবানি করা হয়। \n\nতারপর সেই পশুগুলোর গোশত এমন মানুষদের মধ্যে বিতরণ করে দেওয়া হয় যারা কিনতে অক্ষম। এমন অনেক মানুষ সরোবরের তালিকাতে থাকেন যারা বছরে এই একটি বারই গরুর মাংস খেতে পারেন। \n \nউল্লেখ্য যে, সরোবরের বিক্রি করা গরুগুলোর কোনো অংশ ক্রেতারা পাচ্ছেন না, বরং পুরোটাই তাদের পক্ষ হতে দরিদ্রদের মাঝে বিতরণ করা হবে।\n\nএকটি ভাগের দাম ৮০০০ টাকা (সমস্ত খরচ সহ)\nএকটি গরুর দাম ৫৬,০০০ টাকা (সমস্ত খরচ সহ) \n\nসরোবরের ওয়েব সাইট থেকে সরাসরি কিনতে  - https://shorobor.biz/product/udhiya/ \n\nওয়েব সাইট থেকে কিনতে অসুবিধা মনে হলে সরোবরের গুগল ফর্ম পূরণ করলে  আপনার সাথে যোগাযোগ করা হবে ইন শা আল্লাহ। ফর্ম লিংক - https://forms.gle/PreraKAuKn3vajpK6\n\nকোনো জিজ্ঞাসা থাকলে যোগাযোগ করুন shorobor.customercare@gmail.com এই মেইলে।  \n\nঅথবা ফেসবুক মেসেনজারে সরোবরের পেইজে মেসেজ পাঠাতে পারেন।  \nঅথবা হোয়াটস অ্যাপে মেসেজ করতে পারেন 01861005555 কিংবা  01750180055 নম্বরে।  \n\nআল্লাহ আমাদের সৎ নিয়তগুলোকে কবুল করুন।",
  "content_title": "সরোবর উদহিয়া / কুরবানি প্রজেক্ট"
}
