{
    "button_hints": "আমাদেরকে উৎসাহ দিতে প্লে স্টোরে ৫ স্টার রেটিং দিন এবং অ্যাপের কার্যক্রম চালিয়ে নেয়ার জন্য আর্থিক সহায়তা করুন",
    "button_text": "রেটিং দিন",
    "button_url": "https://play.google.com/store/apps/details?id=theoaktroop.appoframadan",
    "content_message": "গত রাতে (২০ জুলাই ২০২০) সৌদী আরব ও মধ্যপ্রাচ্যের দেশগুলোতে পবিত্র জিলহজ্জ মাসের চাঁদ দেখা যায় নি। তাই সে সকল দেশগুলোতে জিলক্বদ মাস ৩০ দিন পূর্ণ হবে। সে হিসাবে মক্কায় পবিত্র হজ্জের দিন বা আরাফাতের দিবস হবে ৩০ জুলাই। আর সেখানে ঈদুল আযহা পালিত হবে ৩১ জুলাই শুক্রবার।\n\nসূত্রঃ\nআরব নিউজ\nhttps://www.arabnews.com/node/1707491/saudi-arabia\n\nপ্রসঙ্গত উল্লেখ্য, সৌদী আরবের চাঁদ দেখা যাওয়ার সাথে বাংলাদেশের ঈদের সরাসরি সম্পর্ক নাই। বাংলাদেশে আজ ২১ জুলাই সন্ধ্যায় চাঁদ দেখা কমিটির বৈঠক অনুষ্ঠিত হবে। দেশের কোথাও চাঁদ দেখা গেলে সাক্ষী সহ তা চাঁদ দেখা কমিটিকে অভিহিত করতে হবে। এরপর রাষ্ট্রীয় ভাবে চাঁদ দেখা যাওয়ার যে ঘোষণা আসবে সে হিসাবে দেশে ঈদ পালিত হবে। এমনটা বললে ভুল হবে যে, \"সৌদীর পরের দিন বাংলাদেশে ঈদ\"। হ্যাঁ, বেশির ভাগ সময় সৌদীর পরদিন বাংলাদেশে ঈদ হয়ে থাকে। কিন্তু সব সময় এমনটা নাও হতে পারে।\n\nইসলামিক ফাউন্ডেশন থেকে বাংলাদেশের আকাশে চাঁদ দেখা যাওয়ার ঘোষণা আসলে তা অ্যাপের মাধ্যমে জানিয়ে দেয়া হবে ইনশাআল্লাহ। হিজরি মাসের তারিখ চাঁদ দেখার উপর নির্ভরশীল। তাই ১ বছর আগে প্রিন্ট করা কাগজের ক্যালেন্ডারের হিজরি তারিখের সাথে অ্যাপের তারিখ না মিললে \"অ্যাপে ভুল আছে\" এমনটা বলাটা বোকামী। হিজরি তারিখ মিলিয়ে নেয়ার জন্য কাগজে প্রিন্টেড ক্যালেনডার নয় বরং প্রসিদ্ধ অনলাইন নিউজ পেপারের সাথে মিলাতে পারেন।\n\nআল্লাহ আমাদের সবাইকে সঠিক বুঝ দান করুন। আমীন।\n\nজিলহজ্জ মাসের আমল ও কুরবানি বিষয়ক বিভিন্ন মাসআলা জানা যাবে এখান থেকেঃ https://hellohasan.com/2016/09/02/কুরবানি-ফজিলত-আমল-মাসআলা/",
    "content_title": "সৌদী আরবে জিলহজ্জ মাসের চাঁদ দেখা যায় নি"
}