{
    "button_hints": "শাওয়াল মাস সহ সারা বছরের নামাজের সময় ও সাহরি-ইফতারের সময় জানা যাবে এই অ্যাপের মাধ্যমেই। অ্যাপের 5.0.6 ভার্সনে আপডেট করুন ও ৫ স্টার রেটিং দিন",
    "button_text": "আপডেট করুন ও রেটিং দিন",
    "button_url": "https://play.google.com/store/apps/details?id=theoaktroop.appoframadan",
    "content_message": "আসছে ঈদুল ফিতর। ঈদের আগের দিন থেকে নিয়ে ঈদের দিন পর্যন্ত কিছু সুন্নাহ আমল রয়েছে। আমাদের উচিত সেগুলো আদায় করা।\n\n॥ তাকবীর তাশরীক ॥\nঈদের চাঁদ দেখা যাওয়ার পর সন্ধ্যা থেকে পর দিন ঈদের নামাজের আগ পর্যন্ত তাকবীর দেওয়া মুস্তাহাব। রমযান মাসের সর্বশেষ দিনের সূর্যাস্ত থেকে শুরু করে ঈদের নামাযের ইমাম ঈদগাহে হাযির হওয়া পর্যন্ত। তাকবীরের শব্দাবলী হচ্ছে নিম্নরূপঃ\n\nاللَّهُ أَكْبَرُ اللَّهُ أَكْبَرُ لَا إلَهَ إلَّا اللَّهُ وَاَللَّهُ أَكْبَرُ اللَّهُ أَكْبَرُ وَلِلَّهِ الْحَمْد\n\nঅর্থঃ আল্লাহ মহান, আল্লাহ মহান। আল্লাহ ছাড়া সত্য কোন উপাস্য নেই। আল্লাহ মহান, আল্লাহ মহান। সমস্ত প্রশংসা আল্লাহর জন্য।\n\n॥ সাদাকাতুল ফিতর আদায় করা ॥\nঈদের নামাজের আগেই সাদকাতুল ফিতর আদায় করা। যেন গরীব মানুষদের ঈদের দিন খাদ্যের খোঁজে মানুষের কাছে হাত পাততে না হয়। ফিতরার পরিমাণ ও বিস্তারিত বিধান জানা যাবে এখান থেকেঃ https://hellohasan.com/2020/05/05/ফিতরা-কত-টাকা-বিধান\n\n॥ মিসওয়াক করা ॥\nঈদের নামাজের আগে মেসওয়াক করা, গোসল করা, সুগন্ধি ব্যবহার করা।\n\n॥ উত্তম পোশাক পরা ॥\nসামর্থ্য অনুযায়ী উত্তম পোশাক পরিধান করা।\n\n॥ সুগন্ধি ব্যবহার করা ॥\nঈদের দিনের গুরুত্বপূর্ণ একটি সুন্নাহ হচ্ছে সুগন্ধি ব্যবহার করা। মহিলাদের জন্য যদি ঈদগাহে নামাজের ব্যবস্থা থাকে তাহলে মহিলারা সুগন্ধি ব্যবহার করা ছাড়া ঈদগাহে নামাজ পড়তে যাবে।\n\n॥ দ্রুত ঈদগাহে উপস্থিত হওয়া ॥\nফজরের নামাজের পর অতি শিগগিরই ঈদগাহে উপস্থিত হওয়া\n\n॥ খেজুর খাওয়া ॥\nঈদুল ফিতরের দিনে ঈদগাহে যাওয়ার আগে বেজোড় সংখ্যায় খেজুর খাওয়া\n\n॥ খোলা মাঠে ঈদের সালাত আদায় করা ॥\nকোনো অসুবিধা না থাকলে ঈদের নামাজ মসজিদে না পড়ে (ঈদগায়ে) ময়দানে পড়া\n\n॥ খুতবা শোনা ॥\nঈদের নামাজে শামিল হওয়া ও নামাজের পরে সম্পূর্ণ খুতবা শোনা\n\n॥ ঈদগাহে যাওয়া আসার পথ ভিন্ন করা ॥\nঈদগাহে একপথে যাওয়া এবং অন্যপথে ফিরে আসা\n\n॥ একে অন্যকে অভিনন্দন বা মুবারবাদ জানানো ॥\nঈদের দিন একে অপরকে অভিনন্দন জানানো। হাদীস শরীফে পাওয়া যায় সাহাবারা অভিনন্দন জানানোর জন্য এই দুয়া পড়তেনঃ\n\nتَقَبَّلَ اللهُ مِنَّا وَمِنكُم\n\nঅর্থঃ আল্লাহ আমাদের পক্ষ থেকে এবং আপনার পক্ষ থেকে কবুল করুন\n\nএই বাক্যটি পড়লে একটা সুন্দর দুয়া করা হলো এবং আল্লাহর রাসূলের (সা) একটা সুন্নাহের উপর আমল হল। এটা না বলে প্রচলিত \"ঈদ মুবারক\" বা \"ঈদের শুভেচ্ছা\" বলাও জায়েজ আছে। কোনো অসুবিধা নাই।\n\nআল্লাহ আমাদেরকে সুন্নাহের উপর আমল করার তাওফিক দান করুন। শাওয়াল মাসের ৬ টি রোজা রাখার মাধ্যমে যুগভর রোজা রাখার সওয়াব হাসিল করার তাওফিক দান করুন। সারা মাস কষ্ট করে রোজা রেখে সালাত আদায় করে ঈদের চাঁদ ওঠার সাথে সাথে গান বাজনা এবং আগের পাপকর্মে লিপ্ত হওয়া থেকে রক্ষা করুন। রমাদানের মত বাকি ১১ টি মাস অশ্লীলতা, বেপর্দা (পুরুষ-নারী উভয়ের জন্য) ও সকল প্রকার হারাম থেকে আল্লাহ আমাদের রক্ষা করুন। আমীন।",
    "content_title": "ঈদের দিন যে কাজগুলো করা সুন্নাহ"
}