{
  "button_hints": "অ্যাপের নতুন ভার্সন 5.2 তে আপডেট না করে থাকলে অনুগ্রহ করে আপডেট করে নিন। পাশাপাশি আমাদেরকে উৎসাহিত করতে ৫ স্টার রেটিং দিন",
  "button_text": "আপডেট করুন ও ৫ স্টার রেটিং দিন",
  "button_url": "https://play.google.com/store/apps/details?id=theoaktroop.appoframadan",
  "content_message": "আলহামদুলিল্লাহ। সমস্ত প্রশংসা একমাত্র আল্লাহর জন্য, যিনি জগতসমূহের রব।\nআল্লাহর অশেষ রহমতে আমরা প্রায় ৫ মাস পর অ্যাপের নতুন ভার্সন 5.2 এর রিলিজ করতে পেরেছি। এই ৫ মাস আমাদের টিমের সদস্যগণ নিরলস ভাবে কাজ করে নতুন ভার্সনটি প্রস্তুত করেছেন। আশা করি নতুন ভার্সনের ফিচারগুলো আপনাদের উপকারে আসবে।\n\n5.2 ভার্সনে যা কিছু নতুন\n-----------------------------------\nঅ্যাপের নতুন ভার্সনের উল্লেখযোগ্য কয়েকটি পরিবর্তন নিচে তুলে ধরা হলোঃ\n\n- অডিও কুরআনের অফলাইন সাপোর্ট\n- আর্টিকেল, মাসআলা ও মাসনূন আমল নামের তিনটি অপশন নতুন যুক্ত হয়েছে\n- দুআ এবং অন্যান্য কন্টেন্টগুলো সার্চ করা যাবে\n- নোটিফিকেশন, দুআ এবং অন্যান্য কনটেন্ট পড়ার সময় ডানে-বামে স্লাইড করে আগে-পরের লেখাগুলো পড়া যাবে\n- হোমপেজে থাকা নফল সালাতের ওয়াক্ত এবং অন্যান্য কিছু স্থানের UI improve করা হয়েছে\n- লোকেশন সেটিংস থেকে GPS সেট করার পর ফোনের GPS বন্ধ থাকলে, সর্বশেষ সেভ থাকা লোকেশন অনুযায়ী সালাত ও সাওমের সময় দেখাবে। এক্ষেত্রে প্রতিদিন সর্বোচ্চ একবার হোমপেজের টপে একটা ওয়ার্নিং দেখাবে\n- এছাড়াও আরো কিছু UI improvement এবং বাগ ফিক্স করা হয়েছে\n\nআমরা বিগত প্রায় ২ মাস আপনাদের সহায়তায় অ্যাপের টেস্টিং করেছি। এরপরেও এখানে কিছু ভুলভ্রান্তি ও ত্রুটি বিচ্যুতি থাকা অসম্ভব নয়। এরকম কোনো সমস্যা নজরে আসলে অনুগ্রহ করে আমাদেরকে ইমেইল করে জানাবেন। অথবা অ্যাপের ডেভেলপার পেজ থেকে আমাদের ফেসবুকের মাধ্যমেও সমস্যার রিপোর্ট করতে পারেন।\n\nপরবর্তী পরিকল্পনাঃ\n-------------------\nআমরা অত্যন্ত আনন্দের সাথে জানাচ্ছি যে, ইতমধ্যেই আমরা আইফোনের জন্য মুসলিমস ডে অ্যাপের ডেভেলপমেন্ট শুরু করেছি। দীর্ঘদিন ধরে আমরা iOS অ্যাপের জন্য অনুরোধ পেয়ে আসছি। এরই প্রেক্ষিতে আমরা বিগত রমজান মাস থেকে আইফোনের অ্যাপের জন্য কাজ শুরু করেছি।\nএরই মধ্যে উক্ত অ্যাপের জন্য নতুন ভাবে ডিজাইন করা হচ্ছে। যা প্রায় শেষের দিকে। ইনশাআল্লাহ আমরা খুব শিঘ্রই আপনাদের এই অ্যাপটিকে অ্যাপল স্টোরে আপলোড করতে পারব।\n\nআপনি নিশ্চয়ই অবগত আছেন যে অ্যান্ড্রয়েডের তুলনায় আইফোনের অ্যাপ ডেভেলপমেন্ট অনেক বেশি ব্যয়বহুল। এর অন্যতম কারণ হচ্ছে আইফোনের অ্যাপ বানানোর জন্য সাধারন কম্পিউটার ব্যবহার করা যায় না, বরং Mac এর প্রয়োজন হয়। যার মূল্য অন্যান্য ল্যাপটপের তুলনায় অনেক বেশি। এছাড়াও অ্যাপল স্টোরে অ্যাপ রাখার জন্য তাদেরকে প্রতি বছর ১০০ ডলার করে সার্ভিস চার্জ দিতে হবে।\n\nঅপর দিকে আপনি এও জানেন যে আমরা এই অ্যাপে গুগলের কোনো বিজ্ঞাপন দেখাই না। তাই আমাদের অ্যাপ ডেভেলপমেন্টের খরচ নির্বাহের জন্য অনেকাংশেই আপনাদের ডোনেশনের উপর নির্ভর করতে হয়। তাই আপনি যদি এই অ্যাপটি দ্বারা উপকৃত হয়ে থাকেন এবং ভবিষ্যতে এই অ্যাপের ডেভেলপমেন্ট চালিয়ে নিয়ে যাওয়ার জন্য সহযোগিতা করতে চান। তাহলে আমাদের অ্যাপের ডেভেলপমেন্টের জন্য আর্থিক অনুদান দিতে পারেন।\n\nঅনুদান দেয়ার জন্য অ্যাপের নেভিগেশন ড্রয়ার (হোম পেজের উপরের বামপাশের মেনু) ওপেন করুন। মেনু থেকে ২য় অপশন \"আর্থিক অনুদান দিন\" এ যান। সেখানে আমাদের অ্যাপের জন্য অনুদান পাঠানোর নাম্বারগুলো পাওয়া যাবে। \nআপনার এই সাদকায়ে জারিয়ার মাধ্যমে ইনশাআল্লাহ অ্যাপটি অনেক দূর এগিয়ে যাবে।\n\nআল্লাহ আমাদের কাজগুলোকে সহজ করে দিন। আমাদের সকলের দুনিয়া ও আখিরাতকে কল্যানময় করুন। আমীন।",
  "content_title": "App update 5.2"
}
