{
  "button_hints": "অ্যাপ সম্পর্কে আপনার মতামত জানিয়ে আমাদের অনুপ্রাণিত করতে 5 star রেটিং দিন ও অ্যাপের কার্যক্রম চালিয়ে নিতে আর্থিক সহযোগিতা করুন",
  "button_text": "আপডেট করুন ও রেটিং দিন",
  "button_url": "https://play.google.com/store/apps/details?id=theoaktroop.appoframadan",
  "content_message": "শিশুর জন্য মায়ের বুকের দুধ অন্যতম শ্রেষ্ঠ নেয়ামত। এই দুধে একজন শিশুর জন্য প্রয়োজনীয় সকল উপাদান সুষম ভাবে বন্টিত রয়েছে। কিন্তু আল্লাহর জমিনে অনেক শিশুই এই নেয়ামত থেকে বঞ্চিত হয়। বাচ্চার মায়ের মৃত্যু বা অসুস্থ্যতার জন্য এমন পরিস্থিতি তৈরি হতে পারে। আবার অনেক মা এমন রয়েছেন যাদের বুকে বাচ্চার জন্য পর্যাপ্ত হয় এই পরিমানের দুধ নাই। তখনও বাচ্চাকে বিকল্প খাবারের উপর নির্ভর করতে হয়। যদিও আমরা সকলেই জানি \"মায়ের দুধের বিকল্প নাই\"। অন্য দিকে এমন মাও রয়েছেন যাদের বুকে প্রয়োজনের চেয়ে বেশি দুধ আল্লাহ দান করেছেন। এক দিকে রয়েছে দুধের অভাব আরেক দিকে রয়েছে এর উদ্বৃত্ততা। একে ব্যালেন্স করার জন্য আল্লাহ এক মায়ের দুধ অন্য মায়ের সন্তানকে দান করাকে জায়েজ করেছেন, অন্য শিশুকে দুধপান করানোকে অত্যন্ত সওয়াব ও মর্যাদা দান করেছেন। এবং এ সম্পর্কে স্পষ্ট বিধি বিধানও দিয়েছেন।\n\n\nস্বয়ং রাসূল (সা) শিশু অবস্থায় হালিমা (রা) এর দুধ পান করে বড় হয়েছেন। এজন্য হালিমাকে (রা) তিনি চূড়ান্ত রকমের সম্মান করতেন তাঁর দুধ মাতা হিসাবে। দুধ মায়ের সাথে শিশুর পর্দার বিধান তার নিজ মায়ের মতই। অর্থাৎ কোনো ছেলে যদি তার মা ব্যতীত অন্য কোনো নারীর দুধ পান করে তাহলে তার সাথে ঐ ছেলের দেখা দেয়া জায়েজ। ঐ নারীর সাথে বিয়ে হওয়া হারাম। ঐ নারীর কন্যার সাথে ঐ ছেলের বিয়ে হওয়াও হারাম। ঐ দুগ্ধদানকারী নারীর সন্তানেরা ঐ ছেলের দুধ ভাই ও দুধ বোন বলে স্বীকৃত হবে। তাদের সাথেও দেখা দেয়া জায়েজ। জন্ম সূত্রে যাদের সাথে বিবাহ হারাম (যেমনঃ দাদা-দাদী, নানা-নানী, খালা, মামা, ফুফু, চাচা) দুধ পানের সূত্রেও এদের সাথে বিয়ে হওয়া হারাম। অর্থাৎ কোনো ছেলের দুধ মায়ের মেয়ে, দুধ মায়ের বোন, দুধ মায়ের নাতনী এদের সাথেও বিয়ে হারাম।\n\nসম্প্রতি ঢাকার মাতুয়াইলে হিউম্যান মিল্ক ব্যাংক বা মাতৃদুগ্ধ সংগ্রহশালা খোলা হয়েছে। এর উদ্দেশ্য হচ্ছে সংকটাপন্ন শিশুদের জন্য মাতৃদুগ্ধের অভাব মেটানো। কোনো শিশুর মা মারা গেলে বা মায়ের বুকে পর্যাপ্ত দুধ না থাকলে এই মিল্ক ব্যাংক থেকে তারা অন্য কোনো মায়ের দান করা প্যাকেটজাত মাতৃদুগ্ধ সংগ্রহ করতে পারবে। প্রথমত বলতে হবে শিশুদের দুধের অভাব মেটানোর উদ্যোগ অবশ্যই ভাল। কিন্তু যেই প্রকৃয়ায় কাজটা হচ্ছে সেটাকে ইসলামিক স্কলারগণ অনুমোদন দেন না। এধরণের মিল্ক ব্যাংক কোনো ইসলাম প্রধান দেশেই চালু নাই। সকল দেশের আলেমরাই এই ফরমেটের মিল্ক ব্যাংককে বৈধ বলেন না। সকল আমেল এ ধরণের মিল্ক ব্যাংককে হারাম বলে ঘোষণা দিয়েছেন। তুরষ্কে এ ধরনের মিল্ক ব্যাংক চালু হয়েছিল কিন্তু সেটাও বন্ধ করে দেয়া হয়েছে। কারণ এই মিল্ক ব্যাংকগুলো নিশ্চিত করে না যে কোন ডোনারের দুধ কোন বাচ্চা পান করছে। \n\nএকজন বাচ্চা যদি এক বছর এখান থেকে দুধ পান করে তাহলে অসংখ্য মায়ের দুধ ঐ বাচ্চা পান করবে। ফলে ঐ প্রত্যেক মা এই বাচ্চার দুধমাতা বলে স্বীকৃতি পাবেন এবং এই দুধ মায়ের সন্তানরা-নাতি-পুতিরাও ঐ দুধ পান করা বাচ্চার জন্য মাহরাম হয়ে যাবে। এবং তাদের সাথে বিয়ের সম্পর্ক হারাম হয়ে যাবে। যদি সঠিক ভাবে প্রতিটা ডোনারের দুধ কোন বাচ্চাগুলো পাচ্ছে এবং কোন বাচ্চা কোন কোন মায়ের দুধ পান করছে এটা শতভাগ নিশ্চিত হয়ে তথ্য সংরক্ষণ ও সরবরাহ না করা হয় তাহলে সম্ভাবনা আছে ভবিষ্যত প্রজন্মের মধ্যে অসংখ্য বিয়ে হবে নিজ দুধ ভাই দুধ বোনের মধ্যে।\n\nআধুনিক বিজ্ঞান বলে, ভাই - বোনের মধ্যে বিবাহ হলে জেনেটিক সমস্যা দেখা যায়। যেটাকে অটোসমাল রিসেসিভ বলে। অর্থাৎ সন্তান বিকলাঙ্গ হবার সম্ভাবনা খুবই বেশি। ১৯৭০ -এ মায়ের দুধে রেট্রোভাইরাসের মতো একটা উপাদান আবিস্কৃত হয়। যেটাকে বলে মাইক্রোভেসিকেল। কিন্তু তা কীভাবে কাজ করে অজানা ছিলো। ২০০০ সালে বিজ্ঞান আমাদেরকে জানায় - মায়ের দুধের এপিথেলিয়াল সেল ' এমএফজি '( মিল্ক ফ্যাট গ্লোবিউলস) নামক একটা ফর্ম গঠন করে। এইটার ভেতরেই মাইক্রোভেসিক্যলটা লুকানো থাকে। এই মাইক্রোভেসিক্যল হচ্ছে রেট্রোভাইরাসের রিভার্স ট্রান্সক্রিপটস।\nমাইক্রোভেসিক্যল কী কাজ করে?\nমায়ের দুধের সঙ্গে তা শিশুর পেটে যায়। যেহেতু এইটা লং লাস্টিং জিনিস, পাকস্থলীর এসিড এইটাকে হজম করতে পারে না। মাইক্রোভেসিক্যালে থাকা এমআরএনএ (মেসেঞ্জার অব আরএনএ, যেটা ফ্যামিলির জেনেটিক ইনফরমেশন বহন করে) এবং রিভার্স ট্রান্সক্রিপট এনজাইম বা প্রোটিন পাকস্থলীর ইন্টেস্টেন বা অন্ত্রে পৌঁছে যায় অক্ষত। যেহেতু মাইক্রোভেসিক্যলের সাইজ ছোট (৫৫ এনএম) তা ক্যাভিউলার এন্ডোসাইটোসিসের মাধ্যমে রক্তে মিশে যায়। সেখান থেকে যায় এন্ডোপ্লাজমিক রেটিকিউলামে । তা থেকে নিউক্লিয়াস সেলে। তারপর মাইক্রোভেসিক্যালে থাকা এমআরএনএ এবং রিভার্স ট্রান্সক্রিপট এনজাইম ডিএনএ তৈরী করে। সেই সাথে এমআরএনএ ব্যবহার করে নতুন জিন প্রস্তুত করে ডিএনএ 'র উভয় স্ট্র্যান্ডসের জন্যে। এই মাইক্রোভেসিক্যলকে বলে মিল্ক ট্রান্সক্রিপ্টম। এতে থাকে ১৪০০০ এক্টিভ জিন।\nঅর্থাৎ দুধের মাধ্যমে শিশুর জিন পরিবর্তন হয়ে যায়।\nফলে যে নারী অন্যের শিশুকে দুধ পান করায়, সেই সন্তান শুধু দুধের সম্পর্কে সন্তান হয়ে থাকে না। বায়োলজিক্যালিও নিজ সন্তান হয়ে যায়। গর্ভধারণ না করেও।\nসুতরাং দুধ সন্তানের সঙ্গে নিজ সন্তানের বিয়ে হলে, তাদের সন্তান বিকলাঙ্গ হবার সম্ভাবনা সবচেয়ে বেশি। মহাজ্ঞানী স্রষ্টা জানেন এতে আমাদের অমঙ্গল রয়েছে।\n\nতাই আলেমগণের অভিমত হচ্ছে যেই মায়েরা দুধ ডোনেট করতে চান আর যেই পরিবার তাদের শিশুর জন্য দুধ সংগ্রহ করতে চান এই দুই পরিবারকে কানেক্টেড করে দেয়া। যেন একজন বাচ্চা একজন মায়ের থেকে সরাসরি দুধ পান করতে পারে। এতে দুই পরিবারের মধ্যে হৃদ্যতার সম্পর্ক তৈরি হবে। তাদের মধ্যে জানাশোনা থাকবে। পরবর্তীতে বিয়ের সময়ও দুই পরিবারের মধ্যে বিষয়টা মাথায় থাকবে। এরকম উদ্যোগ হওয়া উচিত যেই প্রতিষ্ঠান এরকম ২ পরিবারের মধ্যে ব্রিজলাইন হিসাবে কাজ করবে। রক্ত দাতা ও রক্তগ্রহিতার মধ্যে যোগাযোগ করিয়ে দেন এমন অনেক স্বেচ্ছাসেবী সংগঠন রয়েছে। যাদের কাজ হচ্ছে রক্তদাতা ও রক্তগ্রহিতাদের মধ্যে কানেক্ট করে দেয়া। মাতৃদুগ্ধের ক্ষেত্রেও এমন উদ্যোগ নেয়া হলে মুসলিম সমাজ অনেক অবৈধ বিবাহ থেকে বেঁচে যাবে এবং সমাজের শিশুরাও মাতৃদুগ্ধের অভাব থেকে বাঁচবে। একই সাথে ইসলাম দুগ্ধ দানকারী নারী যদি পারিশ্রমিক চায় সেটাকেও জায়েজ করেছে। এই উদ্যোগের ফলে হয়ত আর্থিক ভাবে অসচ্ছল মায়েরা দুধ পান করিয়ে কিছুটা সচ্ছল হতে পারবে।\n\nকোনো একটা ইসলামী বিধান যখন হারাম-হালালের পর্যায়ে পৌঁছে যায়। তখন সেই হারাম কাজের আশংকা যত ক্ষুদ্রই হোক সেটাকে সমর্থন করা কোনো মুসলিমের জন্য বৈধ হতে পারে না। প্রতিষ্ঠিত হওয়া এই হিউম্যান মিল্ক ব্যাংকের মাধ্যমে আশংকা আছে অনেক বিয়েই হারাম হওয়া সত্ত্বেও হবে। একটা বিয়ে হারাম হওয়া মানে নারী-পুরুষের হারাম সহ-অবস্থান। তাদের সন্তান জন্মদান! সব মিলিয়ে একটা জটিল ও কঠিন বিষয়। তাই কর্তৃপক্ষের উচিত হবে এমন উদ্যোগ চালুর পূর্বে হক্ব আলেমদের সাথে আলোচনা করে তাদের নির্দেশনা অনুযায়ী সিদ্ধান্ত নেয়া। প্রশ্নটা যেখানে হালাল আর হারামের, মুসলিম সমাজে তাই এমন উদ্যোগ নেয়ার আগে আলেমদের ভেরিফিকেশন অবশ্যই লাগবে!\n\nআল্লাহ আমাদেরকে সঠিক বুঝ দান করুন। সকল ধরনের হারাম থেকে বেঁচে থাকার তাওফিক দান করুন। আমীন।\n\n[এ বিষয়ে শায়খ আহমাদুল্লাহ এর আলোচনার ভিডিও দেখা যাবে এখানেঃ https://www.facebook.com/sheikhahmadullahofficial/posts/1077687249232999]",
  "content_title": "হিউম্যান মিল্ক ব্যাংক সম্পর্কে ইসলামের বিধান"
}