{
    "button_hints": "আমাদেরকে উৎসাহ দিতে প্লে স্টোরে ৫ স্টার রেটিং দিন এবং অ্যাপের কার্যক্রম চালিয়ে নেয়ার জন্য আর্থিক সহায়তা করুন",
    "button_text": "রেটিং দিন",
    "button_url": "https://play.google.com/store/apps/details?id=theoaktroop.appoframadan",
    "content_message": "আজ বাংলাদেশের আকাশে কোথাও পবিত্র জিলহজ্জ মাসের চাঁদ দেখা যায় নি। তাই জিলক্বদ মাস ৩০ দিন পূর্ণ হবে। সে মোতাবেক বাংলাদেশে আগামী ২৩ জুলাই ২০২০ ইং তারিখ রোজ বৃহস্পতিবার ১৪৪১ হিজরির পবিত্র জিলহজ্জ মাস শুরু হবে। পবিত্র ঈদুল আযহা উদযাপিত হবে ১ আগস্ট, ২০২০ ইং তারিখ রোজ শনিবার।\n\n\nইসলামিক ফাউন্ডেশনের চাঁদ দেখা কমিটির সভা শেষে উক্ত সিদ্ধান্ত জানানো হয়েছে।\n\nসূত্রঃ সময় টিভি\nhttps://www.somoynews.tv/pages/details/225341/চাঁদ-দেখা-যায়নি-ঈদ-১-আগস্ট\n\nজিলহজ্জ মাসের প্রথম দশ দিনের আমলের চেয়ে উত্তম আমল আর খুব একটা নাই। তাই আমাদের সকলের উচিত এই দশ দিন বেশি বেশি নেক আমল করা ও গুনাহ থেকে বেঁচে থাকা। সাধ্য মত জিলহজ্জের প্রথম নয় দিন রোজা রাখার চেষ্টা করি। অন্তত ঈদের আগের দিন, ৯ জিলহজ্জ অবশ্যই রোজা রাখি। কারণ এটি বছরের শ্রেষ্ঠতম দিন। আল্লাহ আমাদেরকে জিলহজ্জ মাসে বেশি বেশি আমল করার তাওফিক দান করুন। আমীন।\n\nজিলহজ্জ মাসের আমল, কুরবানী বিষয়ে করণীয় ও বর্জনীয় বিভিন্ন বিষয়ে বিস্তারিত জানা যাবে এখান থেকেঃ https://hellohasan.com/2016/09/02/কুরবানি-ফজিলত-আমল-মাসআলা",
    "content_title": "জিলহজ্জ মাসের চাঁদ দেখা যায় নি - ১ আগস্ট ঈদ"
}