{
  "button_hints": "নির্ভুল সময়সূচী ও বাগ ফ্রি অ্যাপের জন্য 4.9.13 ভার্সনটি প্লে স্টোর থেকে আপডেট করে নিন",
  "button_text": "Update From Play Store",
  "button_url": "https://play.google.com/store/apps/details?id=theoaktroop.appoframadan",
  "content_message": "ইফতারের পূর্ব মুহূর্ত দুয়া কবুলের সময়। গল্পগুজব বা অহেতুক কাজ করে সময় অপচয় করা উচিত নয়।\n\n\nআবূ হুরায়রাহ্ (রাঃ)] থেকে বর্ণিতঃ\n\nতিনি বলেন, রসূলুল্লাহ সাল্লাল্লাহু আলাইহি ওয়াসাল্লাম বলেছেনঃ তোমাদের কেউ যেন আল্লাহর কাছে দু‘আ করার সময় এ কথা না বলে যে, হে আল্লাহ! তোমার ইচ্ছা হলে আমাকে ক্ষমা করে দাও। তুমি যদি ইচ্ছা কর আমার প্রতি দয়া করো। তুমি যদি ইচ্ছা কর আমাকে রিযক দান করো। বরং সে দৃঢ়তার সাথে দু‘আ করবে (চাইবে)। তিনি যা ইচ্ছা তা-ই প্রদান করেন। তাঁকে দিয়ে জোরপূর্বক কোন কিছু করাতে সক্ষম নয় বা তাকে বাধা দেয়ার কেউ নেই। (বুখারী)\n\nআবূ হুরাইরাহ্ (রাঃ) থেকে বর্ণিতঃ\n\nতিনি বলেন, রাসূলুল্লাহ (সাল্লাল্লাহু ‘আলাইহি ওয়া সাল্লাম) বলেছেনঃ আল্লাহ তা‘আলার কাছে যে লোক চায় না, আল্লাহ তা‘আলা তার উপর নাখোশ হন।\n\nহাসানঃ ইবনু মাজাহ (হাঃ ৩৮২৭)",
  "content_title": "নিজের জন্য, পরিবারের জন্য, বন্ধুদের জন্য দুয়া করুন"
}