{
  "button_hints": "তাইবাহ একাডেমির ইসলামিক স্টাডিজ কোর্সটির বিষয়ে বিস্তারিত জানতে পারেন এখান থেকে",
  "button_text": "কোর্সের বিস্তারিত",
  "button_url": "https://taibahacademy.com/diploma-in-islamic-studies?utm_source=muslims-day&utm_medium=notification&utm_campaign=islamic-studies",
  "content_message": "আমরা অনেকেই চাই ইসলাম নিয়ে প্রাতিষ্ঠানিকভাবে পড়াশোনা করতে। কেননা ফরজ-ওয়াজিব, হালাল-হারাম ইত্যাদি বিষয়ে নূন্যতম ইলম অর্জন করা প্রত্যেক মুসলিমের জন্য ফরজ। একমাত্র দ্বীনী জ্ঞান অর্জনের মাধ্যমেই মুত্তাক্বী তথা আল্লাহ ভীরুতার পথ প্রশস্ত হয়।\n\nআল্লাহ সুবহানাহু ওয়া তা‘আলা ইসলামী জ্ঞান শিক্ষাকারীদের সম্পর্কে বলেনঃ\n\nإِنَّمَا يَخْشَى اللَّهَ مِنْ عِبَادِهِ الْعُلَمٰٓؤُا\n\nআল্লাহর বান্দাদের মধ্যে জ্ঞানীরাই তাঁকে ভয় করে থাকে। [সূরা ফাত্বির : ২৮]\n\nআল্লাহকে ভয় করা ও তাঁর আদেশ-নিষেধ মেনে চলার মধ্যেই দুনিয়া ও আখিরাতের যাবতীয় কল্যান নিহিত। ইসলামের প্রকৃত জ্ঞান অন্বেষণ ও সে অনুযায়ী আমলের মাধ্যমেই কেবল দুনিয়া ও আখিরাতের মঙ্গল-কল্যান লাভ করা সম্ভব।\n\nরসূলুল্লাহ সাল্লাল্লাহু আলাইহি ওয়াসাল্লাম বলেছেন, \n“আল্লাহ যার মঙ্গল চান, তাকেই দ্বীনের জ্ঞান দান করেন।” [বুখারী]\n\n\nকিন্তু জেনারেল শিক্ষিত ছাত্র-ছাত্রী, গৃহিণী কিংবা চাকুরিজীবীদের জন্য ইসলাম নিয়ে প্রাতিষ্ঠানিক শিক্ষার ব্যবস্থা আমাদের সমাজে নেই বললেই চলে।\n\nএজন্য তাইবাহ একাডেমি এমনই জ্ঞানপিপাষু তালেবে ইলমদের জন্য অনলাইনে ইসলাম নিয়ে পড়াশোনার ব্যবস্থা করতে চেয়েছে, যাতে একজন তালেবে ইলম তার সুবিধামত সময়ে যেকোনো স্থান থেকে দ্বীনের জন্য অপরিহার্য জ্ঞান লাভ করতে পারে। তাই তাদের কথা চিন্তা করে ডিজাইন করা হয়েছে \"অনলাইন ডিপ্লোমা ইন ইসলামিক স্টাডিজ\" কোর্স।\n\n---\nতাইবাহ একাডেমি ফেসবুক পেজঃ https://www.facebook.com/taibahacademy.bd",
  "content_title": "ইসলামিক স্টাডিজে ডিপ্লোমা করার সুযোগ"
}
