{
  "button_hints": "অ্যাপ সম্পর্কে আপনার মতামত জানিয়ে আমাদের অনুপ্রাণিত করতে 5 star রেটিং দিন ও অ্যাপের কার্যক্রম চালিয়ে নিতে আর্থিক সহযোগিতা করুন",
  "button_text": "৫ স্টার রেটিং দিন",
  "button_url": "https://play.google.com/store/apps/details?id=theoaktroop.appoframadan",
  "content_message": "আবূ হুরাইরাহ্ (রাযিঃ)-এর সূত্রে নাবী (সাঃ) থেকে বর্ণিতঃ তিনি বলেন, \n\nএকদিন এক লোক কোন এক মরুপ্রান্তরে সফর করছিলেন। এমন সময় অকস্মাৎ মেঘের মধ্যে একটি আওয়াজ শুনতে পেলেন যে, অমুকের বাগানে পানি দাও। সাথে সাথে ঐ মেঘ খণ্ডটি একদিকে সরে যেতে লাগল। এরপর এক প্রস্তরময় ভূমিতে বৃষ্টি বর্ষিত হল। ঐ স্থানের নালাসমূহের একটি নালা ঐ পানিতে সম্পূর্ণরূপে পূর্ণ হয়ে গেল। তখন সে লোকটি পানির অনুগমন করে চলল। চলার পথে সে এক লোককে দাঁড়ানো অবস্থায় দেখতে পেল যিনি কোদাল দিয়ে পানি বাগানে সবদিকে ছড়িয়ে দিচ্ছে। এ দেখে সে তাকে বলল, হে আল্লাহর বান্দা! তোমার নাম কি? সে বলল, আমার নাম অমুক, যা তিনি মেঘখণ্ডের মাঝে শুনতে পেয়েছিলেন। তারপর বাগানের মালিক তাকে জিজ্ঞেস করল, হে আল্লাহর বান্দা! তুমি আমার নাম জানতে চাইলে কেন? উত্তরে সে বলল, যে মেঘের এ পানি, এর মাঝে আমি এ আওয়াজ শুনতে পেয়েছি, তোমার নাম নিয়ে বলছে যে, অমুকের বাগানে পানি দাও। এরপর বলল, তুমি এ বাগানের ব্যাপারে কি করো? মালিক বলল, যেহেতু তুমি জিজ্ঞেস করছ তাই বলছি, \n\nপ্রথমে আমি এ বাগানের উৎপন্ন ফসলের হিসাব করি। অতঃপর এর এক তৃতীয়াংশ সদাকাহ্ করি, এক তৃতীয়াংশ আমি ও আমার পরিবার-পরিজনের জন্য রাখি এবং এক তৃতীয়াংশ বাগানের উন্নয়নের কাজে খরচ করি।\n\nরেফারেন্সঃ সহীহ মুসলিম - ৭৩৬৩  http://ihadis.com/books/muslim/hadis/7363\n\nআল্লাহ আমাদের সবাইকে নিয়মিত ভাবে উপার্জনের একটি অংশ সাদাকাহ করার তাওফিক দান করুন। আমীন।",
  "content_title": "একটি বাগান ও অলৌকিক ঘটনা"
}
