{
    "button_hints": "আসলাফ অ্যাকাডেমি আয়োজন করছে অনলাইনে আরবি ভাষা শিখে বুঝে কুরআন পড়ার কোর্স!",
    "button_text": "কোর্সের বিস্তারিত দেখুন",
    "button_url": "https://www.facebook.com/story.php?story_fbid=1324066071134592&id=776232985917906",
    "content_message": "রমজানের সিয়াম পালনের পর শাওয়াল মাসে ছয়টি রোজা রাখা সুন্নত বা মুস্তাহাব। শাওয়াল মাসে ছয়দিন রোজা রাখার অনেক ফজিলত, মর্যাদা ও সওয়াব রয়েছে। যে ব্যক্তি এ রোজাগুলো পালন করবে সে যেন গোটা বছর রোজা রাখল। রমাদানের এটাও একটা শিক্ষা যে, বান্দা সারা বছরই সাধ্য মত কিছু কিছু নফল রোজা রাখবে।\n\n\"যে ব্যক্তি রমজানের রোজা রাখল এরপর শাওয়াল মাসে ছয়টি রোজা রাখল সে যেন গোটা বছর রোজা রাখল।\"[সহিহ মুসলিম, সুনানে আবু দাউদ, জামে তিরমিজি, সুনানে নাসায়ী ও সুনানে ইবনে মাজাহ]\n\nআবু আইয়ুব আনসারি রাদিআল্লাহু আনহু থেকে বর্ণিত, রাসূলুল্লাহ সাল্লাল্লাহু আলাইহি ওয়া সাল্লাম ইরশাদ করেন, যে ব্যক্তি রমজানের রোজা রাখবে অতপর শাওয়ালে ছয়টি রোজা পালন করবে সে যেন যুগভর রোজা রাখল। (মুসলিম)\n\nহযরত মুসলিম কারশী রাঃ হতে বর্ণিত আছে, তিনি বলেন একদা আমি রাসূলুল্লাহ (সাঃ) কে জিজ্ঞেস করলাম সারা বছর রোজা রাখা সম্পর্কে; রাসূলুল্লাহ সাঃ বললেন তোমার উপর তোমার পরিবার-পরিজনের হক রয়েছে। অতঃএব তুমি রমাদান মাস ও এর পরবর্তী মাস তাতে রোজা রাখবে এবং প্রত্যেক বুধবার, বৃহস্পতি বার রোজা রাখবে। আর যখনই এরূপ করলে যেন সারা বছর রোজা রাখলে। \n(আবু দাউদ, তিরমিযি। এ হাদীসটির বর্ণনা সূত্র যয়ীফ বা দুর্বল। ইমাম তিরমিযি এটিকে গরীব বলেছেন)\n\nপ্রসঙ্গত উল্লেখ্য, শাওয়ালের ৬টি রোজা ফরজ বা ওয়াজিব নয়। এগুলো আমাদের জন্য বাধ্যতামূলক করা হয় নি। অনেকের মাঝে ভুল ধারণা রয়েছে যে এই রোজাগুলো না রাখলে গুনাহ হবে, এই ধারণাটা ভুল। অনেকে মনে করেন এই রোজা না রাখলে রমজানের রোজা কবুল হবে না, এটাও ভ্রান্ত ধারণা। কেউ কেউ একে \"সাক্ষী রোজা\" বলে থাকেন। ইসলামী শরীয়তের একে সাক্ষী রোজা বলে অভিহিত করা হয় নাই। যারা একে সাক্ষী রোজা বলেন তারা মনে করেন, এই রোজা রমজানের রোজার ব্যাপারে সাক্ষী দিবে। এগুলো সবই মনগড়া বানোয়াট কথা। কুরআন-হাদীসের সাথে এর কোনো সম্পর্ক নাই। এই রোজাগুলো রাখলে সারা বছর রোজা রাখার সওয়াব হবে বা যুগভর রোজা রাখার সওয়াব হবে। কিন্তু কেউ যদি ছেড়ে দেয় তাহলে গুনাহ হবে না। আমাদের সকলের এই রোজাগুলো রাখা উচিত। কেননা, মানবিক ত্রুটির কারণে রমাদানের ফরজ রোজাগুলোতে ভুল হয়ে থাকলে আল্লাহ নফল রোজার মাধ্যমে তা ব্যালেন্স করে দিতে পারেন।\n\nঅনেকে মনে করেন ঈদের পর দিন থেকেই টানা ছয় দিন এ রোজা রাখতে হবে। এটাও সঠিক নয়। ঈদের পর দিন থেকে শাওয়ালের শেষ পর্যন্ত যে কোনো ছয়দিন রোজা রাখলেই তা আদায় হয়ে যাবে। আমরা চাইলে শাওয়ালের ১৩, ১৪ ও ১৫ তারিখ এবং অন্য যে কোনো সোম ও বৃহস্পতিবার রোজা রাখতে পারি। তাহলে একই রোজার মাধ্যমে বাড়তি সওয়াব লাভ হবে ইনশাআল্লাহ। কারণ হিজরি মাসের ১৩, ১৪, ১৫ এবং সোম-বৃহস্পতি রোজা রাখা এমনিতেই সুন্নাহ। শাওয়ালের ৬টি রোজা একটু বুদ্ধি করে এই দিনগুলোতে রাখলে ইনশাআল্লাহ উভয় সুন্নতের উপর আমলের জন্য ডাবল সওয়াব পাওয়া যাবে।\n\n** শাওয়াল মাস সহ সারা বছরের সাহরি-ইফতার ও নামাজের সময়সূচী আমাদের অ্যাপের মাধ্যমেই জানা যাবে।",
    "content_title": "শাওয়ালের রোজার ফজিলত সংক্রান্ত কয়েকটি হাদীস"
}