{
  "button_text": "৫ স্টার রেটিং দিন",
  "button_hints": "অ্যাপ সম্পর্কে আপনার মতামত জানিয়ে আমাদের অনুপ্রাণিত করতে 5 star রেটিং দিন ও অ্যাপের কার্যক্রম চালিয়ে নিতে আর্থিক সহযোগিতা করুন",
  "button_url": "https://play.google.com/store/apps/details?id=theoaktroop.appoframadan",
  "content_message": "নামাজের ওয়াজিবগুলোর মধ্যে অন্যতম দুটি ওয়াজিব কাজ হচ্ছে রুকু থেকে উঠে সোজা হয়ে দাঁড়ানো এবং দুই সিজদাহর মাঝে সোজা হয়ে বসা। আমরা জানি নামাজে কোনো ওয়াজিব ছুটে গেলে সহু সিজদাহ করতে হয়। অন্যথায় নামাজ নষ্ট হয়ে যায়। আমরা অনেকেই রুকু থেকে কোনো রকম কোমর উঠিয়েই সিজদায় চলে যাই। প্রথম সিজদাহ থেকে উঠে সোজা হয়ে স্থির হয়ে বসার আগেই দ্বিতীয় সিজদায় চলে যাই। আমরা যারা নিয়মিত এরকম করে নামাজ পড়ছি আল্লাহই ভাল জানেন আমাদের সকল নামাজ নষ্ট হয়ে যাচ্ছে কিনা। আমরা যারা কষ্ট করে নামাজ পড়ছিই, তারা একটু সচেতন হলেই এই ভয়ংকর গুনাহ থেকে বেঁচে যেতে পারি। এই দুটি ওয়াজিব আদায়ের জন্য ৩ থেকে ৪ সেকেন্ড সময় ব্যয় করাই যথেষ্ট! তবুও আমরা তাড়াহুড়া করি। আল্লাহর রাসূলের (সা) সামনে এভাবে কেউ নামাজ পড়লে তিনি ঐ নামাজ আবার পড়ার জন্য নির্দেশ দিতেন।\n\nযারা এরকম ত্বরিঘড়ি করে নামাজ পড়ে তাদের ব্যাপারে রাসূল (সা) বলেছেনঃ\n\n“ঐ সলাত হলো মুনাফিকের সলাত যে বসে বসে সূর্যের প্রতি তাকাতে থাকে আর যখন তা অস্তপ্রায় হয়ে যায় তখন উঠে গিয়ে চারবার ঠোকর মেরে আসে।এভাবে সে আল্লাহকে কমই স্মরণ করতে পারে” (মুসলিম ১২৯৯ http://ihadis.com/books/muslim/hadis/1299)\n\nঅন্য হাদীসে এরকম দ্রুত রুকু সিজদাহকারীকে তুলনা করা হয়েছে রক্তে কাকের ঠোকর মারার সাথে।\n\nরাসূল (সা) যখন ইমাম হয়ে নামাজ পড়াতেন তখন রুকু থেকে দাঁড়ানোর পর সাহাবিরা মনে করতেন আল্লাহর রাসূল (সা) হয়ত সিজদায় যেতে ভুলেই গেছেন! অর্থাৎ তিনি রুকু থেকে দাঁড়িয়ে অনেক লম্বা সময় ধরে দুয়া পড়তেন।\n\nসাবিত (রহঃ) থেকে বর্ণিতঃ তিনি বলেন, \nআনাস ইব্‌নু মালিক (রাঃ) আমাদেরকে নবী (সাল্লাল্লাহু ‘আলাইহি ওয়া সাল্লাম)-এর সালাতের বর্ণনা দিলেন। অতঃপর তিনি সালাত আদায় করে দেখালেন। তিনি যখন রুকূ‘ হতে মাথা উঠালেন, তখন (এতক্ষণ) দাঁড়িয়ে রইলেন যে, আমরা মনে করলাম, তিনি (সিজদার কথা) ভুলে গেছেন।\n(বুখারী ৮০০ - http://ihadis.com/books/bukhari/hadis/800)\n\nআমাদের অন্তত \"সামিয়াল্লাহু লিমান হামিদাহ - রব্বানা লাকাল হামদ\" পুরো বাক্য ধীরস্থির ভাবে উচ্চারণ করে আস্তেধীরে সিজদায় যাওয়া। রুকু থেকে \"সামিয়াল্লাহু লিমান হামিদাহ\" বলার পর আমরা এই দুআটি পড়তে পারিঃ\n رَبَّنَا وَلَكَ الْحَمْدُ حَمْدًا كَثِيرًا طَيِّبًا مُبَارَكًا فِيهِ \n(মুয়াত্তা - ৪৭৯ http://ihadis.com/books/muatta-malik/hadis/479)\n\nদুই সিজদার মাঝে রাসূল (সা) অত্যন্ত চমৎকার একটা দুয়া পড়তেন। এত সুন্দর একটা দুয়া! এই দুয়ার মাঝে দুনিয়া আখিরাতের সকল চাওয়াই চলে আসে।\n\nاللّٰهُمَّ اغْفِرْ لِي، وَارْحَمْنِي، وَاهْدِنِي، وَاجْبُرْنِي، وَعَافِنِي، وَارْزُقْنِي، وَارْفَعْنِيْ \n\nঅর্থঃ হে আল্লাহ! আপনি আমাকে ক্ষমা করুন, আমার প্রতি দয়া করুন, আমাকে সঠিক পথে পরিচালিত করুন, আমার সমস্ত ক্ষয়ক্ষতি পূরণ করে দিন, আমাকে নিরাপত্তা দান করুন, আমাকে রিযিক দান করুন এবং আমার মর্যাদা বৃদ্ধি করুন\n\n(হাদীসটি নাসাঈ ব্যতীত সুনান গ্রন্থগারগণ সবাই সংকলন করেছেন। আবূ দাউদ, ১/২৩১, নং ৮৫০; তিরমিযী, নং ২৮৪, ২৮৫; ইবন মাজাহ, নং ৮৯৮। আরও দেখুন, সহীহুত তিরমিযী, ১/৯০; সহীহ ইবন মাজাহ ১/১৪৮)\n\nআরো একটি ছোট দুয়া হাদীসে পাওয়া যায়। এ দুয়াটিও দুই সিজদাহ এর মাঝে বসে পাঠ করতে পারি।\n\n\nرَبِّ اغْفِرْ لِي، رَبِّ اغْفِرْ لِيْ \n\nঅর্থঃ হে আমার রব্ব! আপনি আমাকে ক্ষমা করুন। হে আমার রব্ব! আপনি আমাকে ক্ষমা করুন।\n\n(আবূ দাউদ ১/২৩১, নং ৮৭৪; ইবন মাজাহ নং ৮৯৭। আরও দেখুন, সহীহ ইবন মাজাহ, ১/১৪৮)\n\nচলুন পরবর্তী সকল নামাজে আরো কয়েক সেকেন্ড বেশি ব্যয় করে এই দুয়াগুলো নিয়মিত পড়ি। অ্যাপের দুআ সেকশনে নামাজের দুআগুলো অর্থ সহ পাওয়া যাবে। অর্থ বুঝে বুঝে দুয়াগুলো পড়লে আস্তে আস্তে আমাদের নামাজের সৌন্দর্য বৃদ্ধি পাবে। নামাজে মনযোগ ও আন্তরিকতা বাড়বে। নামাজ তখন প্রকৃত ভাবেই আল্লাহর স্মরণের মাধ্যম হয়ে উঠবে। আল্লাহ আমাদের সকলের নামাজকে সুন্দর করার তাওফিক দান করুন। আমীন।",
  "content_title": "রুকু থেকে উঠে স্থির হয়ে দাঁড়ানো ও দুই সিজদার মাঝে সোজা হয়ে বসা ওয়াজিব"
}
