{
    "button_hints": "আমাদেরকে উৎসাহিত করতে ৫ স্টার রেটিং দিন ও অ্যাপের ডেভেলপমেন্ট চালিয়ে নিতে আর্থিক সহযোগিতা করুন",
    "button_text": "অ্যাপ আপডেট করুন ও রেটিং দিন",
    "button_url": "https://play.google.com/store/apps/details?id=theoaktroop.appoframadan",
    "content_message": "আমাদের দেশে প্রচলিত আছে যে কুরবানীর দিনগুলোতে হাঁস-মুরগি বা এ জাতীয় \"দো পায়া জানোয়ার\" জবাই করে খাওয়া জায়েজ নাই। এই কথাটি সম্পূর্ণ মিথ্যা ও বানোয়াট কথা। ইসলামী শরীয়তে এর কোনো ভিত্তি নাই।\n\nযে সকল পশু-পাখি বছরের অন্য সময় আল্লাহর নামে জবাই করে খাওয়া হালাল, জিলহজ্জ মাসে বা কুরবানীর দিনগুলোতেও ঐ পশু-পাখি জবাই করে খাওয়া হালাল। জিলহজ্জ মাসের চাঁদ দেখা যাওয়ার পর বা কুরবানীর ৩ দিন হাঁস-মুরগি বা এ জাতীয় কিছু জবাই করে খেতে কোনো নিষেধাজ্ঞা নাই।\n\nআমাদের দেশে কোথাও কোথাও প্রচলন আছে যে, যারা কুরবানী দিতে পারছে না। তারা কুরবানীর নিয়তে \"মোরগ জবাই\" দেয়। তারা মনে করে তার যেহেতু সামর্থ্য নাই তাই এই মোরগ জবাইয়ের মাধ্যমে কুরবানী আদায় হবে বা কুরবানীর সওয়াব হবে। এটা সম্পূর্ণ ভুল ধারণা। কুরবানীর উদ্দেশ্যে হাঁস-মুরগি জবাই করলে তা জায়েজ হবে না। কুরবানী দেয়ার সামর্থ্য না থাকলে তিনি কুরবানী দিবেন না। কুরবানী না দেয়ায় তাকে আল্লাহ পাকড়াও করবেন না। যে কেউ কুরবানী দিতে চাইলে চার পা বিশিষ্ট গৃহপালিত পশু যেমন গরু, মহিষ, উট, দুম্বা, ছাগল, ভেড়া ইত্যাদি পশু কুরবানীর নিয়তে জবাই করতে হবে।\n\nপ্রসঙ্গত উল্লেখ্য, কুরবানীর নিয়তে নয় শুধু গোশত খাওয়ার জন্য কুরবানির দিন হাঁস-মুরগি, গরু-ছাগল যে কোনো কিছু জবাই করে খাওয়াও হালাল। অর্থাৎ কিছু মানুষ একত্রিত হয়ে যদি বছরের অন্যান্য সময়ের মত শুধু গোশত খাওয়ার নিয়তে নিজেরা গরু কিনে গোশতের ভাগা দেয় তাহলে সেটা জায়েজ আছে। বাজার থেকে গরু-ছাগল, হাঁস-মুরগি কিনে ঈদের দিনগুলোতে খাওয়াও জায়েজ আছে।\n\nআল্লাহ আমাদেরকে ইসলামকে সহজ ভাবে বুঝার তাওফিক দান করুন। মনগড়া বিষয়াদি দিয়ে জটিল ও কঠিন হিসাবে ইসলামকে উপস্থাপন করা থেকে বিরত রাখুন। আমীন।\n\nতথ্যসূত্রঃ\n১। https://ahlehaqmedia.com/7671-2/\n২। https://youtu.be/a6fwuAuYgwk\n\nকুরবানীর মাসআলা ও জিলহজ্জ মাসের বিভিন্ন আমল সম্পর্কে বিস্তারিত জানা যাবে এখান থেকেঃ https://hellohasan.com/2016/09/02/কুরবানি-ফজিলত-আমল-মাসআলা/",
    "content_title": "কুরবানীর দিনগুলোতে হাঁস-মুরগি জবাই করা যাবে কি?"
}