{
  "button_text": "রেটিং দিন",
  "button_hints": "চলতি মাসে অনুদান দিয়েছেন কি?\n\nআমাদেরকে অনুপ্রাণিত করতে আপনার মূল্যবান ৫ স্টার রেটিং দিন এবং অ্যাপের ডেভেলপমেন্ট চালিয়ে নিতে আর্থিক অনুদান দিন",
  "button_url": "https://play.google.com/store/apps/details?id=theoaktroop.appoframadan",
  "content_message": "বাংলাদেশের আকাশে আজ শুক্রবার কোথাও ১৪৪২ হিজরি সালের পবিত্র রজব মাসের চাঁদ দেখা যায়নি। ফলে শনিবার জমাদিউস সানি মাস ৩০ দিন পূর্ণ হবে এবং রবিবার (১৪ ফেব্রুয়ারি) থেকে পবিত্র রজব মাস গণনা করা হবে।\n\nসূত্রঃ\nদৈনিক কালের কন্ঠ (অনলাইন) - https://www.kalerkantho.com/online/national/2021/02/12/1004320\n\nরজব মাসের আইয়ামে বীজের ৩ টি রোজা রাখতে হবে যথাক্রমে ২৬, ২৭ ও ২৮ ফেব্রুয়ারি (শুক্র, শনি ও রবিবার)। প্রতি হিজরি মাসের ১৩, ১৪ ও ১৫ তারিখের রোজাকে আইয়ামে বীজের রোজা বলা হয়। এটি খুব মর্যাদাপূর্ণ একটি আমল। যা নবীজি (সা) সব সময় পালন করতেন।\n\nআমাদের দেশে নির্দিষ্ট করে ২৬ রজব দিবাগত রাতকেই সন্দেহাতীত ভাবে শবে মিরাজ হিসাবে পালন করা হয়ে থাকে। সে হিসাবে আগামী ২৬ রজব ১৪৪২ হিজরী, ২৬ ফাল্গুন ১৪২৭ বঙ্গাব্দ, ১১ মার্চ দিবাগত রাতে পবিত্র শবে মেরাজ পালিত হবে।\n\nএ রাতকে লাইলাতুল মিরাজ বা শবে মিরাজ বলা হয়ে থাকে। কোনো কোনো পুস্তক-পুস্তিকায় স্পষ্টভাবে লেখা রয়েছে এবং সাধারণ জনগণের মাঝে তা প্রসিদ্ধ যে, মিরাজের ঘটনা রজব মাসের ২৭ তারিখে সংঘটিত হয়েছিল। এ কথাটি শুধু ইতিহাসের একটি বর্ণনার ভিত্তিতে প্রসিদ্ধি লাভ করেছে যার সনদ সহীহ নয়। অন্যথায় এটি কোনো নির্ভরযোগ্য ইতিহাস দ্বারাও প্রমাণিত নয়, হাদীস শরীফ কিংবা কোনো সাহাবীর উক্তি দ্বারা তো নয়ই। নির্ভরযোগ্য সূত্রে শুধু এটুকুই পাওয়া যায় যে, মিরাজের ঘটনা হিজরতের এক বা দেড় বছর আগে সংঘটিত হয়েছিল। কিন্তু মাস, দিন, তারিখের ব্যাপারে নির্ভরযোগ্য কোনো দলীল নেই।\n\nঅনেক আলেম বলেছেন, মিরাজের রাত নিঃসন্দেহে একটি বরকতময় রাত ছিল কিন্তু এই রাতে যেহেতু বিশেষ কোনো আমল বা ইবাদত উম্মতের জন্য বিধিবদ্ধ হয়নি তাই  এর দিন-তারিখ সুনির্দিষ্টভাবে সংরক্ষিত থাকেনি। -আলমাওয়াহিবুল লাদুন্নিয়াহ ও শরহুল মাওয়াহিবিল লাদুন্নিয়্যাহ ৮/১৮-১৯; আলবিদায়া ওয়াননিহায়া, ইমাম ইবনে কাছীর ২/৪৭১; লাতাইফুল মাআরিফ, ইমাম ইবনে রজব ১৩৪; ইসলাহি খুতুবাত, আল্লামা মুহাম্মাদ তাকী উসমানী ১/৪৬-৪৮\n\nরজব মাস যেহেতু কুরআনে বর্ণিত চার সম্মানিত মাসের একটি সুতরাং এর পুরোটাই বরকতময়। তাই এ মাসের সবকটি দিন ও সবকটি রাতেই ইবাদাত বন্দেগীর ব্যাপারে যত্নবান হওয়া উচিৎ। কিন্তু এর ২৭ তারিখ যেহেতু শবে মিরাজ হিসেবে প্রমাণিত নয় তাই এ রাতকে বিশেষ ইবাদাতের জন্য নির্দিষ্ট না করা এবং এর সাথে সংশ্লিষ্ট রসম রেওয়াজও ত্যাগ করা উচিত।\n\nরজব মাস যেহেতু কুরআনে বর্ণিত চার সম্মানিত মাসের একটি সুতরাং এর পুরোটাই বরকতময়। তাই এ মাসের সবকটি দিন ও সবকটি রাতেই ইবাদাত বন্দেগীর ব্যাপারে যত্নবান হওয়া উচিৎ। কিন্তু এর ২৭ তারিখ যেহেতু শবে মিরাজ হিসেবে প্রমাণিত নয় তাই এ রাতকে বিশেষ ইবাদাতের জন্য নির্দিষ্ট না করা এবং এর সাথে সংশ্লিষ্ট রসম রেওয়াজও ত্যাগ করা উচিত। (রেফারেন্সঃ https://www.alkawsar.com/bn/article/779 )",
  "content_title": "রজব মাসের চাঁদ দেখা যায় নি"
}
