{
  "button_hints": "কুরবানির করণীয় ও বর্জনীয় এবং বিভিন্ন মাসআলা জানতে নিচের বাটনে ক্লিক করুন",
  "button_text": "কুরবানি সম্পর্কে জানুন",
  "button_url": "https://hellohasan.com/2016/09/02/কুরবানি-ভুল-সঠিক-ধারণা",
  "content_message": "আজ শুক্রবার, ২৯ যিলক্বদ ১৪৪০। যদি আজ সন্ধ্যায় যিলহজ্জ মাসের নতুন চাঁদ দেখা যায় তাহলে যিলহজ্জ মাস শুরু হয়ে যাবে। যিলহজ্জ মাসের প্রথম দশ দিনের আমল খুবই সওয়াবের।\n\n‘জিলহজ মাসের প্রথম দশ দিনের আমল আল্লাহর কাছে যতটা প্রিয় তা অন্য কোনো সময়ে নয়। সাহাবারা প্রশ্ন করেন, আল্লাহর পথের জেহাদ থেকেও প্রিয়? তিনি বললেন, হ্যাঁ। তবে কোনো ব্যক্তি যদি জান-মাল নিয়ে আল্লাহর পথে বের হয়ে আর ফিরে না আসে তার কথা ভিন্ন।’ (সহিহ বুখারি)\n\nকুরবানি দাতার জন্য যিলহজ্জ মাসের একটি সুন্নাহ হল \"যিলহজ্জ মাসের চাঁদ দেখা গেলে কুরবানি দাতা কুরবানি দেয়ার আগ পর্যন্ত চুল, নখ, দাড়ি বা অন্যান্য পশম কাটবেন না\"।\n\nতাই যারা কুরবানি দেয়ার নিয়ত করেছি তারা আজ সন্ধ্যার আগেই উপরের কাজগুলো প্রয়োজন মত সেরে নিই।",
  "content_title": "যিলহজ্জের চাঁদ দেখা গেলে কুরবানি করার আগ পর্যন্ত কুরবানরি দাতার জন্য নখ, চুল ইত্যাদি পশম কাটা থেকে বিরত থাকা সুন্নাহ"
}