{
    "button_hints": "আমাদেরকে উৎসাহ দিতে প্লে স্টোরে ৫ স্টার রেটিং দিন। অ্যাপের কার্যক্রম চালিয়ে নেয়ার জন্য আর্থিক সহযোগিতা করুন",
    "button_text": "৫ স্টার রেটিং দিন",
    "button_url": "https://play.google.com/store/apps/details?id=theoaktroop.appoframadan",
    "content_message": "মুহাররম মাসে পৃথিবীর বহু ঐতিহাসিক ঘটনা সংঘটিত হয়েছে। এদিনে আল্লাহ তাআলা তাঁর কুদরত প্রকাশ করেছেন। বনি ইসরাইলের জন্য সমুদ্রে রাস্তা বের করে দিয়েছেন এবং তাদেরকে নিরাপদে পার করে দিয়েছেন। আর একই রাস্তা দিয়ে ফেরাউন ও তার অনুসারীদেরকে ডুবিয়ে মেরেছেন।-সহীহ বুখারী ১/৪৮১\n\nতবে এ দিনের গুরুত্ব প্রকাশ করতে গিয়ে অনেকে নানা ভিত্তিহীন কথাও বলে থাকেন। যেমন, এদিন হযরত ইউসুফ আ. জেল থেকে মুক্তি পেয়েছেন। হযরত ইয়াকুব আ. চোখের জ্যোতি ফিরে পেয়েছেন। হযরত ইউনুস আ. মাছের পেট থেকে মুক্তি পেয়েছেন। হযরত ইদরীস আ.কে আসমানে উঠিয়ে নেওয়া হয়। অনেকে বলে, এদিনেই কিয়ামত সংঘটিত হবে। এসব কথার কোনো ভিত্তি নেই।-আল আসারুল মারফূআ, আবদুল হাই লাখনেবী ৬৪-১০০; মা ছাবাহা বিসসুন্নাহ ফী আয়্যামিস সানাহ ২৫৩-২৫৭\n\nএ মাসের একটি ঘটনা শাহাদাতে হুসাইন রা.। বলাবাহুল্য যে, উম্মতের জন্য এই শোক সহজ নয়। কিন্তু  নবী সাল্লাল্লাহু আলাইহি ওয়াসাল্লাম-এরই তো শিক্ষা-‘নিশ্চয়ই চোখ অশ্রুসজল হয়, হৃদয় ব্যথিত হয়, তবে আমরা মুখে এমন কিছু উচ্চারণ করি না যা আমাদের রবের কাছে অপছন্দনীয়।’\n\nঅন্য হাদীসে নবী কারীম সাল্লাল্লাহু আলাইহি ওয়াসাল্লাম ইরশাদ করেন, ‘তাদের সঙ্গে আমাদের কোনো সম্পর্ক নেই যারা মুখ চাপরায়, কাপড় ছিড়ে এবং জাহেলী যুগের কথাবার্তা বলে।’\n\nঅতএব শাহাদাতে হুসাইন রা.কে কেন্দ্র করে কোনো ধরনের অনৈসলামিক কর্মকাণ্ডে লিপ্ত না হওয়া এবং সব ধরনের জাহেলী রসম-রেওয়াজ থেকে দূরে থাকা প্রত্যেক মুসলিমের অবশ্য কর্তব্য।\n\nএ মাসে যেসব অনৈসলামিক কাজকর্ম ঘটতে দেখা যায় তার মধ্যে তাজিয়া, শোকগাঁথা পাঠ, শোক পালন, মিছিল বের করা, শোক প্রকাশার্থে শরীরকে রক্তাক্ত করা ইত্যাদি অন্তর্ভুক্ত। এসব রসম-রেওয়াজের কারণে এ মাসটিকেই অশুভ মাস মনে করার একটা প্রবণতা অনেক মুসলমানের মধ্যেও লক্ষ করা যায়।\n\nএজন্য অনেকে এ মাসে বিয়ে-শাদী থেকেও বিরত থাকে। বলাবাহুল্য এগুলো অনৈসলামিক ধারণা ও কুসংস্কার।\n\nমোটকথা, এ মাসের করণীয় বিষয়গুলো যখা, তওবা-  ইস্তেগফার, নফল রোযা এবং অন্যান্য নেক আমল। এসব বিষয়ে যত্নবান হওয়া এবং সব ধরনের কুসংস্কার ও গর্হিত রসম-রেওয়াজ থেকে বেঁচে কুরআন-সুন্নাহ মোতাবেক চলাই মুসলমানের একান্ত কর্তব্য। আল্লাহ তাআলা আমাদেরকে তাওফীক দান করুন। আমীন।\n\nসম্পূর্ণ লেখাটি পড়া যাবে মাসিক আলকাউসারের এই লিংক থেকেঃ https://www.alkawsar.com/bn/article/316/",
    "content_title": "মুহাররম ও আশুরার ব্যাপারে কিছু কুসংস্কার ও জাল হাদীস"
}