{
    "button_hints": "অ্যাপ আপডেট করুন ও অ্যাপ সম্পর্কে আপনার মতামত জানিয়ে আমাদের অনুপ্রাণিত করতে আপনার মূল্যবান রেটিং ও ফিডব্যাক দিন",
    "button_text": "আপডেট করুন ও রেটিং দিন",
    "button_url": "https://play.google.com/store/apps/details?id=theoaktroop.appoframadan",
    "content_message": "আজ ২৫ মার্চ বুধবার বাংলাদেশের আকাশে কোথাও শাবান মাসের চাঁদ দেখা যাওয়ার খবর পাওয়া যায় নি। তাই ১৪৪১ হিজরি সালের শাবান মাস শুরু হবে ২৭ মার্চ, ২০২০ ইং তারিখ রোজ শুক্রবার।\n\nসে হিসাবে এ মাসের আইয়ামে বীজের রোজা রাখতে হবে ৮, ৯ ও ১০ এপ্রিল, ২০২০। রাসূল (সা) শাবান মাসের প্রায় পুরো মাসই রোজা রাখতেন। তাই চলুন আমরা এ মাসের আইয়ামে বীজের রোজার সাথে প্রতি সোম-বৃহস্পতি রোজা রাখি। সোম-বৃহস্পতির সবগুলো না রাখতে পারলেও কিছু অন্তত রাখি। একেবারেই অক্ষম হলে আইয়ামে বীজের ৩টা দিন অন্তত রোজা রাখি। নবী (সা) তাঁর দেশে থাকতে অথবা দূর দেশে সফরে থাকা অবস্থাতেও কখনো আইয়ামে বীজের রোজা ছেড়ে দেন নি।\n\nশাবান মাসে একটি বিশেষ রাত্রি রয়েছে। তা হচ্ছে লাইলাতুন নিসফ মিন শাবান বা মধ্য শাবানের রজনী (যা শবে বরাত নামে প্রচলিত)। এটি পালিত হবে ৯ এপ্রিল বৃহস্পতিবার দিবাগত রাতে।\n\nপবিত্র রমাদান মাস আসতে আর একটি মাস বাকি। আমরা সঠিক ভাবে প্রস্তুতি নিচ্ছি তো? রোজাদানের দুআ আল্লাহ কবুল করেন। চলুন আমরা বেশি বেশি রোজা রেখে করোনা ভাইরাসের প্রকোপ থেকে আল্লাহর কাছে মুক্তি চাই।\nআগামীকাল বৃহস্পতিবার। চলুন রোজা রেখে সাহরির সময়ে, ইফতারের পূ্র্বে দুআ করিঃ\n\n\"হে মালিক! আমি তো কখনো তোমাকে ডেকে ব্যর্থ হইনি।\" \n- (সুরা মারইয়াম :৪)",
    "content_title": "শাবান মাসের চাঁদ দেখা যায় নি"
}