{
  "button_hints": "চলতি মাসে আর্থিক অনুদান দিয়েছেন কি?\n\nঅ্যাপ সম্পর্কে আপনার মতামত জানিয়ে আমাদের অনুপ্রাণিত করতে 5 star রেটিং দিন ও অ্যাপের কার্যক্রম চালিয়ে নিতে আর্থিক সহযোগিতা করুন",
  "button_text": "৫ স্টার রেটিং দিন",
  "button_url": "https://play.google.com/store/apps/details?id=theoaktroop.appoframadan",
  "content_message": "রমজানের শেষ ১০ দিনের পর জিলহজ্জ মাসের প্রথম ১০ দিনের আমল আল্লাহর কাছে সবচেয়ে পছন্দের। তাই এই দশদিন আমরা সাধ্য মত যত বেশি পারা যায় নফল রোজা, নফল নামাজ, তাসবীহ-তাহলীল, কুরআন তিলাওয়াত ইত্যাদি নেক আমলগুলো পালন করার চেষ্টা করি।\n\nইব্‌নু ‘আব্বাস (রাঃ) থেকে বর্ণিতঃ নবী (সাল্লাল্লাহু ‘আলাইহি ওয়া সাল্লাম) বলেছেনঃ\n\nযিলহাজ্জ মাসের প্রথম দশ দিনের ‘আমলের চেয়ে অন্য কোন দিনের ‘আমলই উত্তম নয়। তাঁরা জিজ্ঞেস করলেন, জিহাদও কি (উত্তম) নয়? নবী (সাল্লাল্লাহু ‘আলাইহি ওয়া সাল্লাম) বললেনঃ জিহাদও নয়। তবে সে ব্যক্তির কথা ছাড়া যে নিজের জান ও মালের ঝুঁকি নিয়েও জিহাদে যায় এবং কিছুই নিয়ে ফিরে আসে না। (বুখারী ৯৬৯)\n\nনিচে জিলহজ্জ মাসের প্রথম দশ দিনের কয়েকটি আমল উল্লেখ করা হলো।\n\n# সুন্নাহ অনুসরণ করে আল্লাহর যিকির বা স্মরণ করা। সকল কাজের মাসনূন দুয়া বা বিসমিল্লাহ বলাও আল্লাহর যিকিরের অন্তর্ভুক্ত\n\n# বেশি বেশি নেক আমল করা (কুরআন তিলাওয়াত, নফল নামাজ, ১ম ৯ দিন নফল রোজা, দান-সদকা ইত্যাদি)\n\n# গুনাহ থেকে বেঁচে থাকা\n\n# হজ্জ করা (যাদের উপর হজ্জ ফরজ)\n\n# কুরবানি আদায় করা (যাদের নিসাব পরিমান সম্পদ আছে)\n\n# যারা কুরবানির নিয়ত করেছে তাদের জন্য জিলহজ্জ মাসের চাঁদ দেখা যাওয়ার পর থেকে ঈদের দিন পশু কুরবানির আগ পর্যন্ত চুল-নখ ও অন্যান্য পশম না কাটা। জিলহজ্জের চাঁদ দেখা যাওয়ার আগেই প্রয়োজনীয় চুল-নখ কেটে পরিচ্ছন্ন হয়ে নেয়া উচিত। আর কুরবানি হয়ে \n\n# যাওয়ার পর আবার প্রয়োজনীয় চুল-নখ কাটা।\n\n# জিলহজ্জ মাসের প্রথম ১০ দিনই বেশি বেশি তাকবির-তাহমিদ-তাহলিল পাঠ করা (اَللهُ أَكْبَرُ، اَللهُ أَكْبَرُ، لَاإِلٰهَ إِلاَّ اللهُ، وَاللهُ أَكْبَرُ، اللهُ أَكْبَرُ وَلِلهِ الحَمْدُ)। চলতে ফিরতে বা অবসর সময়ে পুরুষের জন্য সম্ভব হলে উচ্চস্বরে আর নারীরা নিচু স্বরে এটা পাঠ করবে\nআইয়ামে তাশরিকের দিনগুলোর (৯ জিলহজ্জ থেকে ১৩ জিলহজ্জ) ফরজ নামাজের পর অন্তত একবার উপরে বর্ণিত তাকবির-তাহমিদ-তাহলিল পাঠ করা। এর নিয়মটি হচ্ছে, ৯ জিলহজ্জ ফজর থেকে ১৩ জিলহজ্জ আসর পর্যন্ত প্রত্যেক ফরজ সালাতের পর একবার তাকবির-তাহমিদ-তাহলিল পাঠ করা ওয়াজিব। এই তাকবির পাঠ না করলে গুনাহ হবে। অনেকে ফরজ নামাজের পর ৩ বার তাকবির বলাকে সুন্নত বলে প্রচার করে থাকেন। আসলে এই তাকবিরটি সারা দিনই পড়া যায়। কিন্তু নামাজের পর ৩ বার পড়াকে সুন্নত মনে করলে সেটা ভুল হবে। কারণ হাদীস দ্বারা নামাজের পর ৩ বার এই দুআ পাঠ করার প্রমাণ পাওয়া যায় না। আমরা ইচ্ছা মত ১ বার, ২ বার, ৩ বার, ৫ বার, ১০ বার পড়তে পারি। কিন্তু হাদীসের দলীল ছাড়া ভিত্তিহীন কথা বলে ৩ সংখ্যাটিকে সুন্নত মনে করা যাবে না।\n\n# আরাফার দিন রোজা রাখা। এদিন রোজা রাখলে আগের ও পরের এক বছরের গুনাহ আল্লাহ মাফ করে দেন। হাদীসে বলা হয়েছে \"আরাফার দিন\" রোজা রাখার জন্য। হজ্জের সময় আরাফায় উপস্থিত থাকতে হয় ৯ জিলহজ্জ। ৯ জিলহজ্জ রোজা রাখলে আমরা কি বাংলাদেশের চাঁদ দেখে ৯ জিলহজ্জ রাখব নাকি মক্কার সাথে মিলিয়ে আরাফার দিন রাখব? উভয়টার পক্ষেই মত পাওয়া যায়। যেহেতু জিলহজ্জের প্রথম ১০ দিন নেক আমলের সওয়াব অনেক বেশি, তাই কনফিউশন না রেখে আমাদের দেশের চাঁদ অনুযায়ী ৮ ও ৯ জিলহজ্জ উভয় দিনই রোজা রাখার পরামর্শ দেন অনেক আলেম। তাতে হাজীদের আরাফায় অবস্থানের দিন এবং আমাদের দেশের হিসাবে ৯ জিলহজ্জ রোজা রাখা দুইটাই হয়। বাংলাদেশে এ বছর ৮ ও ৯ তারিখ যথাক্রমে ১৯ ও ২০ জুলাই। আমরা চেষ্টা করি উভয় দিনই রোজা রাখার। নাহলে অন্তত ২০ জুলাই অর্থাৎ ঈদের আগের দিন ৯ জিলহজ্জ রোজা রাখি।\n\n# ঈদের দিন ঈদের নামাজ পড়া\n\n# ঈদের দিন মিসওয়াক করে অযু সহ উত্তম রূপে গোসল করা, সুগন্ধি ব্যবহার করা, ঈদের নামাজ মাঠে বা খোলা স্থানে অর্থাৎ ঈদগাহে পড়া, এক রাস্তা দিয়ে ঈদগাহে যাওয়া ও অন্য রাস্তা দিয়ে ফিরে আসা\n\n# ঈদুল ফিতরের দিন কিছু খেয়ে ঈদের নামাজে যাওয়া। ঈদুল আযহার দিন কিছু না খেয়ে ঈদের নামাজে যাওয়া। নামাজ থেকে ফিরে এসে কুরবানি করার পর কুরবানির গোশত দিয়ে দিনের খাওয়া শুরু করা মুস্তাহাব।\n\n# ঈদের নামাজের পর কুরবানি করা। ঈদের নামাজের আগে কুরবানি করলে কুরবানি আদায় হবে না।\n\nকুরবানির বিভিন্ন মাসআলা, করণীয় ও বর্জনীয় আমল সম্পর্কে জানা যাবে এখান থেকেঃ\nhttps://hellohasan.com/2016/09/02/কুরবানি-ফজিলত-আমল-মাসআলা\n\nরমজানে আমাদের জীবনে কিছুটা হলেও পরিবর্তন আসে। আমরা অন্যান্য সময়ের তুলনায় আরো বেশি আল্লাহমুখী হই। কিন্তু সেই তুলনায় জিলহাজ্জের এই ফজিলতপূর্ণ সময়ের ব্যাপারে আমরা গাফেল থাকি। জিলহজ্জ মাস আসলেই আমরা কুরবানি নিয়ে এত ব্যস্ত হয়ে পড়ি যে অন্য কোনো দিকে খেয়াল থাকে না। আসুন এই ১০ দিন আমরা ইবাদতের পরিমাণ আরো বাড়িয়ে দেই।",
  "content_title": "জিলহজ্জ মাসের আমল"
}
