{
    "button_hints": "\nজানুয়ারি মাসে অনুদান দিয়েছেন কি?\n\nআমাদেরকে অনুপ্রাণিত করতে 5 star রেটিং দিন ও অ্যাপের কার্যক্রম চালিয়ে নিতে আর্থিক সহযোগিতা করুন",
  "button_text": "অ্যাপ আপডেট করুন ও রেটিং দিন",
  "button_url": "https://play.google.com/store/apps/details?id=theoaktroop.appoframadan",
    "content_message": "আমাদের সমাজে একটা কথা প্রচলিত আছে যে \"খাওয়ার পর মিষ্টি খাওয়া সুন্নত\"। বিশেষ কোনো কোনো দাওয়াতে গেলে খাওয়ার পর ডেজার্ট আইটেম থাকলে সেটা খেতে উৎসাহ দেয়ার সময় উক্ত কথাটি বারবার সামনে আসে। আসলেও কি খাওয়ার পর ডেজার্ট বা মিষ্টি জাতীয় খাবার খাওয়া সুন্নত?\n\nপ্রথমত রাসূল (সা) পেট ভরে খাবার খেতেন না। খুব সীমিত ছিল তাঁর পানাহার। দিনের পর দিন এমন হত যে তাঁর বাড়িতে চুলা জ্বলত না। শুধু খেজুর আর পানির উপরই সে সময়গুলো নির্ভর করতে হত। এমতাবস্থায় আলাদা ভাবে খাবার খাওয়া এবং এরপর আবার মিষ্টি জাতীয় খাবার খাওয়া রাসূল (সা) এর অভ্যাসের সাথে সামঞ্জস্যপূর্ণ নয়।\n\nএছাড়াও খাওয়ার পর মিষ্টি জাতীয় খাবার খাওয়া সুন্নত হবার পক্ষে কোনো হাদীসের দলীল পাওয়া যায় না। অতএব, উক্ত কথাটি একটি মিথ্যা, জাল ও বানোয়াট কথা। যে বা যারা এই কথা প্রচার করে থাকেন তারা রাসূলের (সা) নামে একটি মিথ্যা কথা প্রচার করেন। নিজেদের ভোগ বিলাসিতার সাফাই গাওয়ার জন্য হয়ত এমন ঘৃণ্য পন্থা তারা অবলম্বন করেছেন।\n\nআল্লাহ আমাদেরকে হাদীসের নামের জালিয়াতির মত জঘন্য গুনাহ থেকে হেফাজত করুন।\n\nরেফারেন্সঃ\nআহলে হক্ব মিডিয়া\nমুফতি লুৎফর রহমান ফরায়েজী\nhttps://ahlehaqmedia.com/8674-2",
    "content_title": "খাওয়ার পর মিষ্টি খাওয়া কি সুন্নত?"
}
