{
  "description": "Ce fichier contient les résultats de certification (référentiel 2021-2025) par objectif des établissements de santé",
  "fields": [
    {
      "constraints": {
        "required": true
      },
      "description": "Année de production de la donnée",
      "name": "annee",
      "title": "Année",
      "type": "integer"
    },
    {
      "constraints": {
        "pattern": "^\\w{9}",
        "required": true
      },
      "description": "Numéro FINESS de l'établissement géographique ou de l'entité juridique lié(e) à la donnée",
      "name": "finess",
      "title": "Numéro FINESS",
      "type": "string"
    },
    {
      "constraints": {
        "enum": [
          "geo",
          "jur"
        ],
        "required": true
      },
      "description": "Type de FINESS correspondant : \"geo\" pour un établissement géographique, \"jur\" pour une entité juridique",
      "name": "finess_type",
      "title": "Type de FINESS",
      "type": "string"
    },
    {
      "constraints": {
        "enum": [
          "certification_ref_2021_score_objectif_1.1",
          "certification_ref_2021_score_objectif_1.2",
          "certification_ref_2021_score_objectif_1.3",
          "certification_ref_2021_score_objectif_1.4",
          "certification_ref_2021_score_objectif_2.1",
          "certification_ref_2021_score_objectif_2.2",
          "certification_ref_2021_score_objectif_2.3",
          "certification_ref_2021_score_objectif_2.4",
          "certification_ref_2021_score_objectif_3.1",
          "certification_ref_2021_score_objectif_3.2",
          "certification_ref_2021_score_objectif_3.3",
          "certification_ref_2021_score_objectif_3.4",
          "certification_ref_2021_score_objectif_3.5",
          "certification_ref_2021_score_objectif_3.6",
          "certification_ref_2021_score_objectif_3.7"
        ],
        "required": true
      },
      "name": "key",
      "title": "Identifiant de l'objectif",
      "type": "string"
    },
    {
      "description": "Score obtenu par l'établissement pour cet objectif",
      "name": "value_float",
      "type": "number"
    }
  ],
  "produit": "Certification (référentiel 2021-2025)",
  "title": "Fichier historisé des résultats de certification (référentiel 2021-2025) par objectif des établissements de santé"
}
