{
  "fields": [
    {
      "constraints": {
        "required": true
      },
      "description": "Nom de la clé de donnée, correspondance avec le champ \"key\" de la table clé-valeur",
      "name": "name",
      "title": "Nom de la clé",
      "type": "string"
    },
    {
      "constraints": {
        "required": true
      },
      "description": "Titre de la clé de donnée, doit être compréhensible par l'humain",
      "name": "title",
      "title": "Titre de la clé",
      "type": "string"
    },
    {
      "description": "Description de la clé de donnée",
      "name": "description",
      "title": "Description de la clé",
      "type": "string"
    },
    {
      "constraints": {
        "enum": [
          "boolean",
          "integer",
          "string",
          "number",
          "classe",
          "int-string",
          "float",
          "float-string",
          "int",
          "date"
        ]
      },
      "description": "Type primitif de la clé de donnée : boolean, string, integer, number, float, etc",
      "name": "type",
      "title": "Type primitif de la clé",
      "type": "string"
    },
    {
      "constraints": {
        "enum": [
          "Certification v2014",
          "Certification v2021",
          "IQSS questionnaire patient",
          "IQSS questionnaire établissement",
          "IQSS dossier patient",
          "IQSS PMSI",
          "SAE",
          "Activités ET"
        ],
        "required": true
      },
      "description": "Provenance de la variable",
      "name": "source",
      "type": "string"
    },
    {
      "name": "indicateur",
      "type": "string"
    },
    {
      "constraints": {
        "enum": [
          "MCO",
          "HAD",
          "SSR",
          "PSY",
          "MHS",
          "TCH"
        ]
      },
      "name": "secteur",
      "type": "string"
    },
    {
      "constraints": {
        "enum": [
          "DIA",
          "IDM",
          "DPA",
          "AVC",
          "HPP",
          "ETEORTHO",
          "IAS",
          "ISOORTHO",
          "CA",
          "RCP",
          "DAN",
          "48h"
        ]
      },
      "name": "theme",
      "type": "string"
    },
    {
      "name": "acronyme",
      "type": "string"
    },
    {
      "name": "version",
      "type": "integer"
    },
    {
      "name": "variable",
      "type": "string"
    },
    {
      "name": "annee",
      "type": "integer"
    },
    {
      "name": "ancienne_variable",
      "type": "string"
    },
    {
      "name": "url_rapport",
      "type": "string"
    },
    {
      "constraints": {
        "enum": [
          "resultat",
          "denominateur",
          "positionnement",
          "evolution",
          "classe",
          "score",
          "intervalle_haut",
          "intervalle_bas",
          "status",
          "controle",
          "obligatoire",
          "resultat_min",
          "resultat_strict",
          "effectif_cible",
          "effectif_observe",
          "effectif_attendu",
          "capacite",
          "volumetrie",
          "ratio"
        ]
      },
      "name": "type_metier",
      "type": "string"
    },
    {
      "constraints": {
        "required": true
      },
      "description": "Type de finess de la clé de donnée : géographique, juridique, mixte",
      "name": "finess_type",
      "title": "Type de finess de la clé",
      "type": "string"
    }
  ],
  "primaryKey": [
    "name"
  ],
  "title": "Fichier de métadonnées documentant le fichier clé-valeur de la base BQSS"
}
