{
  "description": "Ce fichier contient les résultats de certification (référentiel 2021-2025) des établissements de santé",
  "fields": [
    {
      "constraints": {
        "required": true
      },
      "description": "Année de production de la donnée",
      "name": "annee",
      "title": "Année",
      "type": "integer"
    },
    {
      "constraints": {
        "pattern": "^\\w{9}",
        "required": true
      },
      "description": "Numéro FINESS de l'établissement géographique ou de l'entité juridique lié(e) à la donnée",
      "name": "finess",
      "title": "Numéro FINESS",
      "type": "string"
    },
    {
      "constraints": {
        "enum": [
          "geo",
          "jur"
        ],
        "required": true
      },
      "description": "Type de FINESS correspondant : \"geo\" pour un établissement géographique, \"jur\" pour une entité juridique",
      "name": "finess_type",
      "title": "Type de FINESS",
      "type": "string"
    },
    {
      "constraints": {
        "enum": [
          "certification_ref_2021_decision",
          "certification_ref_2021_id_demarche",
          "certification_ref_2021_date_decision"
        ],
        "required": true
      },
      "description": "Clé de donnée",
      "name": "key",
      "title": "Clé de donnée",
      "type": "string"
    },
    {
      "constraints": {
        "required": false
      },
      "description": "Valeurs des variables numériques",
      "name": "value_integer",
      "type": "integer"
    },
    {
      "constraints": {
        "required": false
      },
      "description": "Valeurs des variables temporelles",
      "name": "value_date",
      "type": "date"
    }
  ],
  "produit": "Certification (référentiel 2021-2025)",
  "title": "Fichier historisé des résultats de certification (référentiel 2021-2025) par établissement"
}
