{
  "description": "Ce référentiel historisé d'e-satis est construit à partir des exports mis à disposition en Open Data. Le détail des sources de données est accessible dans le dossier `resources`.",
  "fields": [
    {
      "constraints": {
        "pattern": "^\\w{9}"
      },
      "description": "Numéro finess de l'entité juridique",
      "indicateur": "",
      "name": "finess_ej",
      "secteur": "",
      "theme": "",
      "title": "Numéro du finess juridique",
      "type": "string",
      "type_metier": ""
    },
    {
      "constraints": {
        "pattern": "^\\w{9}"
      },
      "description": "Numéro finess du site géographique",
      "indicateur": "",
      "name": "finess_geo",
      "secteur": "",
      "theme": "",
      "title": "Numéro du finess géographique",
      "type": "string",
      "type_metier": ""
    },
    {
      "description": "Nombre de réponses concernant la satisfaction globale des patients",
      "indicateur": "score_all_rea",
      "name": "nb_rep_score_all_rea_ajust",
      "secteur": "MCO",
      "theme": "48h",
      "title": "Nombre de réponses - satisfaction globale des patients",
      "type": "number",
      "type_metier": "effectif_observe"
    },
    {
      "description": "Note ajustée de satisfaction globale classement des patients",
      "indicateur": "score_all_rea",
      "name": "score_all_rea_ajust",
      "secteur": "MCO",
      "theme": "48h",
      "title": "Note - satisfaction globale des patients",
      "type": "number",
      "type_metier": "score"
    },
    {
      "description": "Classement en 6 classes {A: >=77.3, B: [74-77.3[, C: [70.7-74[, D: <70.7, DI: données insuffisantes(min de 30 questionnaires exploitables), NR: non répondants}",
      "enum": [
        "A",
        "B",
        "C",
        "D",
        "DI",
        "NR"
      ],
      "indicateur": "48h",
      "name": "classement_48h",
      "secteur": "MCO",
      "theme": "48h",
      "title": "Classement en MCO +48h",
      "type": "string",
      "type_metier": "classe"
    },
    {
      "description": "Changement de classe d'une année à l'autre",
      "indicateur": "48h",
      "name": "evolution_48h",
      "secteur": "MCO",
      "theme": "48h",
      "title": "Changement de classe en MCO +48h",
      "type": "string",
      "type_metier": "evolution"
    },
    {
      "description": "Nombre de réponses concernant la satisfaction de l'accueil",
      "indicateur": "score_accueil",
      "name": "nb_rep_score_accueil_rea_ajust",
      "secteur": "MCO",
      "theme": "48h",
      "title": "Nombre de réponses - satisfaction de l'accueil",
      "type": "number",
      "type_metier": "effectif_observe"
    },
    {
      "description": "Note ajustée concernant la satisfaction de l'accueil",
      "indicateur": "score_accueil",
      "name": "score_accueil_rea_ajust",
      "secteur": "MCO",
      "theme": "48h",
      "title": "Note ajustée - satisfaction de l'accueil",
      "type": "number",
      "type_metier": "score"
    },
    {
      "description": "Nombre de réponses concernant la satisfaction de la prise en charge infirmiers/aides-soignants",
      "indicateur": "score_pecinf",
      "name": "nb_rep_score_pecinf_rea_ajust",
      "secteur": "MCO",
      "theme": "48h",
      "title": "Nombre de réponses - Satisfaction de la prise en charge infirmiers/aides-soignants",
      "type": "number",
      "type_metier": "effectif_observe"
    },
    {
      "description": "Note ajustée de satisfaction de la prise en charge infirmiers/aides-soignants",
      "indicateur": "score_pecinf",
      "name": "score_pecinf_rea_ajust",
      "secteur": "MCO",
      "theme": "48h",
      "title": "Note ajustée - satisfaction de la prise en charge infirmiers/aides-soignants",
      "type": "number",
      "type_metier": "score"
    },
    {
      "description": "Nombre de réponses concernant la satisfaction de la prise en charge par les médecins/chirurgiens",
      "indicateur": "score_pecmed",
      "name": "nb_rep_score_pecmed_rea_ajust",
      "secteur": "MCO",
      "theme": "48h",
      "title": "Nombre de réponses - satisfaction de la prise en charge par les médecins/chirurgiens",
      "type": "number",
      "type_metier": "effectif_observe"
    },
    {
      "description": "Note ajustée de satisfaction de la prise en charge par les médecins/chirurgiens",
      "indicateur": "score_pecmed",
      "name": "score_pecmed_rea_ajust",
      "secteur": "MCO",
      "theme": "48h",
      "title": "Note ajustée - satisfaction de la prise en charge par les médecins/chirurgiens",
      "type": "number",
      "type_metier": "score"
    },
    {
      "description": "Nombre de réponses concernant la satisfaction de la chambre",
      "indicateur": "score_pecmed",
      "name": "nb_rep_score_chambre_rea_ajust",
      "secteur": "MCO",
      "theme": "48h",
      "title": "Nombre de réponses - satisfaction de la chambre",
      "type": "number",
      "type_metier": "effectif_observe"
    },
    {
      "description": "Note ajustée de satisfaction de la chambre",
      "indicateur": "score_chambre",
      "name": "score_chambre_rea_ajust",
      "secteur": "MCO",
      "theme": "48h",
      "title": "Note ajustée - satisfaction de la chambre",
      "type": "number",
      "type_metier": "score"
    },
    {
      "description": "Nombre de réponses concernant la satisfaction des repas",
      "indicateur": "score_repas",
      "name": "nb_rep_score_repas_rea_ajust",
      "secteur": "MCO",
      "theme": "48h",
      "title": "Nombre de réponses - satisfaction des repas",
      "type": "number",
      "type_metier": "effectif_observe"
    },
    {
      "description": "Note ajustée de satisfaction des repas",
      "indicateur": "score_repas",
      "name": "score_repas_rea_ajust",
      "secteur": "MCO",
      "theme": "48h",
      "title": "Note ajustée - satisfaction des repas",
      "type": "number",
      "type_metier": "score"
    },
    {
      "description": "Nombre de réponses concernant la satisfaction de la sortie",
      "indicateur": "score_sortie",
      "name": "nb_rep_score_sortie_rea_ajust",
      "secteur": "MCO",
      "theme": "48h",
      "title": "Nombre de réponses - Satisfaction de la sortie",
      "type": "number",
      "type_metier": "effectif_observe"
    },
    {
      "description": "Note ajustée de satisfaction de la sortie",
      "indicateur": "score_sortie",
      "name": "score_sortie_rea_ajust",
      "secteur": "MCO",
      "theme": "48h",
      "title": "Note ajustée - Satisfaction de la sortie",
      "type": "number",
      "type_metier": "score"
    },
    {
      "description": "Pourcentage de patients recommandant certainement l’établissement",
      "indicateur": "48h",
      "name": "taux_reco_brut_48h",
      "secteur": "MCO",
      "theme": "48h",
      "title": "Pourcentage de patients recommandant certainement l’établissement",
      "type": "number",
      "type_metier": "score"
    },
    {
      "description": "Nombre de patients recommandant certainement l’établissement",
      "indicateur": "48h",
      "name": "nb_reco_brut_48h",
      "secteur": "MCO",
      "theme": "48h",
      "title": "Nombre de patients recommandant certainement l’établissement",
      "type": "number",
      "type_metier": "effectif_observe"
    },
    {
      "description": "Année du recueil où les indicateurs du dispositif e-satis sont présent sur le site de data.gouv",
      "name": "annee",
      "secteur": "",
      "theme": "",
      "title": "Année du recueil",
      "type": "integer"
    },
    {
      "description": "Nombre de réponses concernant la satisfaction globale des patients",
      "indicateur": "score_all",
      "name": "nb_rep_score_all_ajust_ca",
      "secteur": "MCO",
      "theme": "CA",
      "title": "Nombre de réponses - satisfaction globale des patients",
      "type": "number",
      "type_metier": "effectif_observe"
    },
    {
      "description": "Score de satisfaction globale ajusté",
      "indicateur": "score_all",
      "name": "score_all_ajust_ca",
      "secteur": "MCO",
      "theme": "CA",
      "title": "Score de satisfaction",
      "type": "number",
      "type_metier": "score"
    },
    {
      "description": "Classement en 6 classes {A: >=79.7, B: [76.5-79.7[, C: [73.1-76.5[, D: <73.1, DI: données insuffisantes(min de 30 questionnaires exploitables), NR: non répondants}",
      "indicateur": "ca",
      "name": "classement_ca",
      "secteur": "MCO",
      "theme": "CA",
      "title": "Classement en MCO CA",
      "type": "string",
      "type_metier": "classe"
    },
    {
      "description": "Changement de classe d'une année à l'autre",
      "indicateur": "ca",
      "name": "evolution_ca",
      "secteur": "MCO",
      "theme": "CA",
      "title": "Changement de classe en MCO CA",
      "type": "string",
      "type_metier": "evolution"
    },
    {
      "description": "Note ajustée de la satisfaction avant l’hospitalisation",
      "indicateur": "score_avh",
      "name": "score_avh_ajust",
      "secteur": "MCO",
      "theme": "CA",
      "title": "Note ajustée - satisfaction avant l’hospitalisation",
      "type": "number",
      "type_metier": "score"
    },
    {
      "description": "Nombre de réponses concernant la satisfaction avant l’hospitalisation",
      "indicateur": "score_avh",
      "name": "nb_rep_score_avh_ajust",
      "secteur": "MCO",
      "theme": "CA",
      "title": "Nombre de réponses - satisfaction avant l’hospitalisation",
      "type": "number",
      "type_metier": "effectif_observe"
    },
    {
      "description": "Note ajustée concernant la satisfaction accueil le jour de l’hospitalisation",
      "indicateur": "score_acc",
      "name": "score_acc_ajust",
      "secteur": "MCO",
      "theme": "CA",
      "title": "Note ajustée - satisfaction accueil le jour de l’hospitalisation",
      "type": "number",
      "type_metier": "score"
    },
    {
      "description": "Nombre de réponses concernant la satisfaction accueil le jour de l’hospitalisation",
      "indicateur": "score_acc",
      "name": "nb_rep_score_acc_ajust",
      "secteur": "MCO",
      "theme": "CA",
      "title": "Nombre de réponses - satisfaction accueil le jour de l’hospitalisation",
      "type": "number",
      "type_metier": "effectif_observe"
    },
    {
      "description": "Note ajustée de la satisfaction de la prise en charge",
      "indicateur": "score_pec",
      "name": "score_pec_ajust",
      "secteur": "MCO",
      "theme": "CA",
      "title": "Note ajustée - satisfaction de la prise en charge",
      "type": "number",
      "type_metier": "score"
    },
    {
      "description": "Nombre de réponses de la satisfaction de la prise en charge",
      "indicateur": "score_pec",
      "name": "nb_rep_score_pec_ajust",
      "secteur": "MCO",
      "theme": "CA",
      "title": "Nombre de réponses - satisfaction de la prise en charge",
      "type": "number",
      "type_metier": "effectif_observe"
    },
    {
      "description": "Note ajustée de la satisfaction chambre et repas / collation",
      "indicateur": "score_cer",
      "name": "score_cer_ajust",
      "secteur": "MCO",
      "theme": "CA",
      "title": "Note ajustée - satisfaction chambre et repas / collation",
      "type": "number",
      "type_metier": "score"
    },
    {
      "description": "Nombre de réponses concernant la satisfaction chambre et repas / collation",
      "indicateur": "score_cer",
      "name": "nb_rep_score_cer_ajust",
      "secteur": "MCO",
      "theme": "CA",
      "title": "Nombre de réponses - satisfaction chambre et repas / collation",
      "type": "number",
      "type_metier": "effectif_observe"
    },
    {
      "description": "Note ajustée de la satisfaction sortie et retour à domicile",
      "indicateur": "score_ovs",
      "name": "score_ovs_ajust",
      "secteur": "MCO",
      "theme": "CA",
      "title": "Note ajustée - satisfaction sortie et retour à domicile",
      "type": "number",
      "type_metier": "score"
    },
    {
      "description": "Nombre de réponses concernant la satisfaction sortie et retour à domicile",
      "indicateur": "score_ovs",
      "name": "nb_rep_score_ovs_ajust",
      "secteur": "MCO",
      "theme": "CA",
      "title": "Nombre de réponses - satisfaction sortie et retour à domicile",
      "type": "number",
      "type_metier": "effectif_observe"
    },
    {
      "description": "Pourcentage de patients recommandant certainement l’établissement",
      "indicateur": "ca",
      "name": "taux_reco_brut_ca",
      "secteur": "MCO",
      "theme": "CA",
      "title": "Pourcentage de patients recommandant certainement l’établissement",
      "type": "number",
      "type_metier": "score"
    },
    {
      "description": "Nombre de patients recommandant certainement l’établissement",
      "indicateur": "ca",
      "name": "nb_reco_brut_ca",
      "secteur": "MCO",
      "theme": "CA",
      "title": "Nombre de patients recommandant certainement l’établissement",
      "type": "number",
      "type_metier": "effectif_observe"
    },
    {
      "description": "Numéro du finess PMSI",
      "indicateur": "",
      "name": "finess_pmsi",
      "secteur": "",
      "theme": "",
      "title": "Numéro du finess PMSI",
      "type": "string",
      "type_metier": ""
    }
  ],
  "missingValues": [
    ""
  ],
  "primaryKey": [
    "finess_geo",
    "annee"
  ],
  "produit": "ESATIS",
  "title": "Fichier historisé des indicateurs E-Satis"
}
