{
  "fields": [
    {
      "format": "default",
      "name": "ATC3",
      "type": "string"
    },
    {
      "format": "default",
      "name": "Libell\u00e9 ATC3",
      "type": "string"
    }
  ],
  "missingValues": [
    ""
  ],
  "name": "openmedic_ATC3",
  "primaryKey": "ATC3",
  "title": "Libell\u00e9 ATC3"
}
