{
  "fields": [
    {
      "format": "default",
      "name": "ATC5",
      "type": "string"
    },
    {
      "format": "default",
      "name": "Libell\u00c3\u00a9 ATC5",
      "type": "string"
    }
  ],
  "missingValues": [
    ""
  ],
  "name": "openmedic_ATC5",
  "primaryKey": "ATC5",
  "title": "Libell\u00e9 ATC5"
}
