{
  "fields": [
    {
      "format": "default",
      "name": "DDP_SPE_COD",
      "role": "code",
      "type": "integer"
    },
    {
      "format": "default",
      "name": "DDP_SPE_LIB",
      "role": "label",
      "type": "string"
    }
  ],
  "missingValues": [],
  "name": "DDP_SPE_COD",
  "primaryKey": "DDP_SPE_COD",
  "title": "Discipline de l'\u00e9tablissement ex\u00e9cutant (OPEN_DAMIR)"
}
