{
  "fields": [
    {
      "format": "default",
      "name": "AGE_BEN_SNDS",
      "role": "code",
      "type": "integer"
    },
    {
      "format": "default",
      "name": "AGE_BEN_LIB",
      "role": "label",
      "type": "string"
    }
  ],
  "missingValues": [],
  "name": "AGE_BEN_SNDS",
  "primaryKey": "AGE_BEN_SNDS",
  "title": "Tranches d'\u00e2ge du b\u00e9n\u00e9ficiaire (OPEN_DAMIR)"
}
