{
  "fields": [
    {
      "format": "default",
      "name": "MDT_TYP_COD",
      "role": "code",
      "type": "integer"
    },
    {
      "format": "default",
      "name": "MDT_TYP_LIB",
      "role": "label",
      "type": "string"
    }
  ],
  "missingValues": [],
  "name": "MDT_TYP_COD",
  "primaryKey": "MDT_TYP_COD",
  "title": "Mode de traitement de l'\u00e9tablissement ex\u00e9cutant (OPEN DAMIR)"
}
