{
  "fields": [
    {
      "format": "default",
      "name": "TOP_GEN",
      "type": "string"
    },
    {
      "format": "default",
      "name": "Libell\u00e9 Top G\u00e9n\u00e9rique",
      "type": "string"
    }
  ],
  "missingValues": [
    ""
  ],
  "name": "openmedic_TOP_GEN",
  "primaryKey": "TOP_GEN",
  "title": "Libell\u00e9 Top G\u00e9n\u00e9rique"
}
