[{
        "id": 0,
        "author": "dissMe2",
        "headline": "Setting up hot reload with PureScript",
        "description": "Everyone should do it",
        "text": "Vivamus lobortis consequat nibh,\nvitae egestas augue suscipit eu.Morbi hendrerit dapibus molestie.Donec ornare at mauris a blandit.Nulla maximus erat tempus condimentum vestibulum.Ut in metus placerat,\nsagittis velit nec,\nlobortis ipsum.Mauris iaculis elementum libero,\nin pharetra enim feugiat vel.Etiam posuere lorem tellus.Morbi eget nisl vestibulum,\ntristique orci vitae,\nmolestie tortor.Ut ac ultricies justo,\nsit amet cursus nisl.Vivamus in semper libero,\neleifend luctus purus.\n\nEtiam maximus ultrices nibh,\nid ultrices nisi convallis vel.Vestibulum ante ipsum primis in faucibus orci luctus et ultrices posuere cubilia Curae;Sed condimentum,\naugue id interdum porttitor,\nurna libero dapibus diam,\nac vehicula nibh ex eu nisi.Etiam id metus malesuada,\nultricies nisi ut,\nscelerisque nulla.Aliquam erat volutpat.Nullam fermentum velit eget magna egestas tincidunt.Vestibulum sit amet nulla et nunc fermentum porttitor eget ac nibh.Curabitur non eros gravida,\nsodales tellus tristique,\npharetra nisl.\n\nDonec dictum nunc eu ante varius iaculis.Aenean eu justo quis est molestie placerat vitae vitae erat.Nam id ligula consectetur,\ngravida ligula vitae,\negestas sem.Duis nec quam id ligula facilisis sagittis.Vestibulum ut dui nec nunc tincidunt commodo.In ullamcorper rhoncus tristique.Etiam porta porta porta.",
        "date": "Tue, Sep 17. 2019",
        "comments": [{
                "actId": 0,
                "text": "Great article!",
                "author": "Huso",
                "date": "Wed, Sep 18. 2019"
            },
            {
                "actId": 0,
                "text": "Wow, I did't know I needed this.",
                "author": "NotHuso",
                "date": "Thu, Sep 19. 2019"
            }
        ]
    },
    {
        "id": 1,
        "author": "roller54",
        "headline": "How to componentize purescript-halogen application.",
        "description": "A few simple steps",
        "text": "Lorem ipsum dolor sit amet,\nconsectetur adipiscing elit.Praesent feugiat,\nmassa eget gravida rutrum,\nest arcu tincidunt felis,\nvel pretium turpis mauris sit amet felis.Vivamus risus nibh,\nblandit et eleifend ac,\ninterdum quis urna.Nunc tempus pulvinar porttitor.Phasellus nisi libero,\nporttitor ut odio ut,\nmaximus ornare felis.Ut id sagittis dui.Fusce eu euismod purus,\na tristique sapien.Curabitur blandit orci a ex lacinia suscipit.Cras lobortis odio sed lacus accumsan,\nnon iaculis dui pellentesque.Praesent pulvinar nibh orci,\nac efficitur nisl sollicitudin quis.Nulla facilisi.Vivamus tempor lacus eu neque porttitor,\nsit amet blandit lectus ultrices.Duis scelerisque lectus sed risus facilisis scelerisque.Duis eleifend turpis et dui egestas placerat.Cras nec interdum nibh.\n\nEtiam eu euismod urna.Sed ut cursus libero,\neu tempor nibh.Ut pulvinar mi nibh.Quisque quis felis id magna egestas porttitor.Duis egestas urna et facilisis varius.Nunc maximus aliquam mi bibendum rutrum.Morbi consectetur sem ut dui aliquam lobortis.Sed vitae commodo felis.Aenean imperdiet a orci vel interdum.Fusce vel cursus nisl.Morbi dictum nunc ac ante tincidunt efficitur.Sed dictum libero vel nibh aliquam dapibus.In in pharetra lacus.",
        "date": "Fri, Sep 20. 2019",
        "comments": [{
                "actId": 1,
                "text": "This is pretty lame tbh",
                "author": "TheDudeHimself",
                "date": "Sat, Sep 21. 2019"
            },
            {
                "actId": 1,
                "text": "I would like to add that etlam eu eulsmod urna",
                "author": "blz42",
                "date": "Sun, Sep 22. 2019"
            }
        ]
    }
]