<?xml version="1.0" encoding="UTF-8" standalone="no"?>
<!-- Created with Inkscape (http://www.inkscape.org/) -->

<svg
   width="604.61816mm"
   height="586.89984mm"
   viewBox="0 0 604.61817 586.89984"
   version="1.1"
   id="svg5"
   xml:space="preserve"
   inkscape:version="1.2.1 (9c6d41e410, 2022-07-14)"
   sodipodi:docname="drawing.svg"
   xmlns:inkscape="http://www.inkscape.org/namespaces/inkscape"
   xmlns:sodipodi="http://sodipodi.sourceforge.net/DTD/sodipodi-0.dtd"
   xmlns="http://www.w3.org/2000/svg"
   xmlns:svg="http://www.w3.org/2000/svg"><sodipodi:namedview
     id="namedview7"
     pagecolor="#ffffff"
     bordercolor="#666666"
     borderopacity="1.0"
     inkscape:showpageshadow="2"
     inkscape:pageopacity="0.0"
     inkscape:pagecheckerboard="0"
     inkscape:deskcolor="#d1d1d1"
     inkscape:document-units="mm"
     showgrid="false"
     inkscape:zoom="0.12315096"
     inkscape:cx="1230.1975"
     inkscape:cy="-332.92473"
     inkscape:window-width="1920"
     inkscape:window-height="1011"
     inkscape:window-x="0"
     inkscape:window-y="0"
     inkscape:window-maximized="1"
     inkscape:current-layer="layer1" /><defs
     id="defs2" /><g
     inkscape:label="Layer 1"
     inkscape:groupmode="layer"
     id="layer1"
     transform="translate(-46.19886,-515.42073)"><g
       id="g539"
       transform="translate(222.90979,781.85015)"><path
         style="fill:#e8c989;stroke-width:0.264583"
         d="m 413.17722,146.85653 c -2.31532,-2.36469 -14.10295,-14.32533 -26.19476,-26.57922 l -21.9851,-22.279797 -0.15981,-4.046299 c -0.0879,-2.225464 -0.57719,-10.7138 -1.08733,-18.862967 -0.51012,-8.149167 -1.10543,-18.031355 -1.32292,-21.960418 l -0.39542,-7.14375 5.96178,-9.048327 c 3.27898,-4.976575 6.10045,-9.156647 6.26994,-9.289018 0.34605,-0.270325 20.85763,-4.321467 37.08522,-7.324567 0.68061,-0.125942 1.73574,0.432118 7.40243,3.915172 l 6.60868,4.062042 -0.0769,60.562942 c -0.0423,33.309637 -0.1048,60.590937 -0.13898,60.625097 -0.0553,0.0553 -7.47742,1.66854 -7.67663,1.66854 -0.0443,0 -1.97492,-1.93474 -4.29024,-4.29943 z M 366.12718,7.6194678 c -2.02512,-1.6636736 -3.79029,-3.133143 -3.9226,-3.2654612 -0.2149,-0.2148946 -1.53374,-14.1272953 -2.2774,-24.0241416 l -0.28118,-3.741711 3.18905,-6.973914 c 1.75398,-3.835665 3.32518,-7.262707 3.49158,-7.615661 0.16642,-0.352954 3.86545,-3.496151 8.2201,-6.984842 9.07328,-7.268977 6.67827,-5.981938 22.25,-11.956746 4.65667,-1.786739 11.52713,-4.449707 15.2677,-5.917708 3.74058,-1.468001 6.92547,-2.700655 7.07758,-2.739234 0.15209,-0.03858 2.18649,1.476589 4.52089,3.367037 l 4.24434,3.437182 -0.16084,5.690944 c -0.0885,3.130018 -0.26702,7.964988 -0.39677,10.744383 -0.12976,2.779395 -0.38204,10.312929 -0.5606,16.741193 l -0.32467,11.687784 -3.58902,6.6599071 -3.58902,6.65993316 -17.33021,4.01626934 c -16.9971,3.9390903 -31.75268,7.2824714 -32.01459,7.2540284 -0.0728,-0.0079 -1.78922,-1.3755421 -3.81434,-3.0392422 z m -0.52649,-74.1751758 c -0.0698,-0.240514 -1.73003,-5.61652 -3.68951,-11.946676 -1.95945,-6.330157 -3.90102,-12.624179 -4.31459,-13.986714 l -0.75194,-2.477342 -9.12813,-4.87712 c -5.02047,-2.68242 -14.72406,-7.80787 -21.56354,-11.3899 -6.83948,-3.58202 -15.59057,-8.20118 -19.44688,-10.26478 -3.8563,-2.06361 -10.6131,-5.63735 -15.0151,-7.94164 -4.40201,-2.3043 -8.00365,-4.28154 -8.00365,-4.39387 0,-0.11232 1.39899,-2.13027 3.10886,-4.48431 l 3.10885,-4.28009 12.30313,-5.40479 c 6.76672,-2.97263 15.04156,-6.57573 18.38854,-8.00688 3.34698,-1.43115 8.44264,-3.63169 11.32369,-4.89008 l 5.2383,-2.28799 8.52003,2.40983 c 16.64439,4.70774 13.85986,3.59377 30.2159,12.08813 8.00364,4.15663 18.65974,9.72606 23.68021,12.37652 5.02047,2.65046 12.04515,6.32344 15.61041,8.16218 3.56527,1.83873 6.62612,3.43719 6.80189,3.55213 0.29982,0.19604 5.10437,15.76395 5.10437,16.53941 0,0.65341 -8.13901,19.886364 -8.50467,20.097033 -0.6038,0.347874 -28.07888,13.601624 -33.42404,16.12349 -4.81217,2.270387 -5.24902,2.42135 -10.58334,3.657338 -3.06019,0.709059 -6.3038,1.4634 -7.20799,1.67631 -1.50439,0.354248 -1.65473,0.349985 -1.7708,-0.05019 z"
         id="path555" /><path
         style="fill:#a1bb8b;stroke-width:0.264583"
         d="m 97.817554,312.97886 c -8.003646,-4.10945 -20.08849,-10.30782 -26.855209,-13.77421 -6.766719,-3.46636 -15.875001,-8.1475 -20.240626,-10.40251 -4.365625,-2.25505 -12.283282,-6.33151 -17.594793,-9.05886 -5.31151,-2.72735 -14.122136,-7.25543 -19.579167,-10.0624 -5.4570315,-2.80696 -12.4594942,-6.40625 -15.5610301,-7.99841 -4.5443618,-2.3328 -5.6910713,-3.03085 -5.9065612,-3.59555 -0.147074,-0.38542 -1.023456,-3.26059 -1.9475134,-6.38929 -1.4263553,-4.82939 -1.7043713,-6.10812 -1.8407693,-8.46667 -0.08837,-1.52797 -0.505402,-8.49312 -0.926749,-15.47812 -0.421346,-6.985 -0.836136,-14.30735 -0.921755,-16.27188 -0.08562,-1.96453 -0.224848,-4.64344 -0.309396,-5.95312 l -0.15372,-2.38125 2.91909,-2.71728 2.9190921,-2.71724 10.9308005,5.59006 c 6.0119421,3.07457 13.0143974,6.69211 15.5610114,8.039 2.546615,1.34689 10.40474,5.39962 17.462501,9.00607 7.057761,3.60643 14.677761,7.53335 16.933334,8.72649 2.255573,1.19316 9.518386,4.94056 16.139584,8.32757 6.621198,3.38704 16.975482,8.72874 23.00949,11.87048 l 10.970972,5.71225 12.84153,1.64386 c 7.06287,0.90413 14.06115,1.83158 15.55178,2.061 1.49064,0.22942 3.04875,0.41711 3.46247,0.41711 0.45972,0 9.76726,-4.47468 23.93342,-11.50622 l 23.18118,-11.50623 5.9001,-1.43433 c 3.24506,-0.78889 5.91439,-1.41537 5.93183,-1.39222 0.0175,0.0233 -4.68551,6.07545 -10.45104,13.44952 -26.13412,33.42529 -30.50699,39.01101 -37.45305,47.84082 -4.06508,5.16755 -9.62752,12.26513 -12.36093,15.77239 -2.73344,3.50727 -5.12324,6.50412 -5.31069,6.6597 -0.18746,0.15557 -2.84036,0.82878 -5.89529,1.49598 -3.05496,0.6672 -6.29333,1.39105 -7.19635,1.60851 -0.90302,0.21749 -1.85552,0.38669 -2.11667,0.37605 -0.26114,-0.0106 -7.02323,-3.38164 -15.026876,-7.49107 z m 68.837896,-5.65819 c -0.48043,-0.83958 -1.75223,-5.71548 -1.55694,-5.96916 0.13086,-0.17 4.00568,-4.97758 8.6107,-10.68353 4.60502,-5.70595 12.86214,-16.00486 18.34917,-22.88646 5.48701,-6.8816 12.01598,-15.01233 14.50878,-18.06827 2.49279,-3.05593 8.90402,-11.03312 14.24712,-17.72708 5.34313,-6.69396 11.79994,-14.75269 14.34851,-17.90827 l 4.63373,-5.73746 11.8251,-7.86337 c 12.9711,-8.62539 12.54771,-8.39372 29.68448,-16.24303 3.41974,-1.56639 11.69459,-5.43494 18.38855,-8.59682 6.69395,-3.16185 15.9213,-7.47713 20.5052,-9.58948 l 8.33438,-3.84064 13.70846,-8.76673 c 7.53965,-4.82169 14.44215,-9.24295 15.33885,-9.82504 l 1.63041,-1.05833 0.73393,-5.55625 c 0.40365,-3.05594 0.82352,-5.98109 0.93303,-6.50034 l 0.19907,-0.94411 5.47823,1.47328 5.47822,1.47325 20.58323,20.12596 c 11.32079,11.06927 21.04113,20.53854 21.6008,21.04281 l 1.01754,0.91686 -4.59156,6.87073 -4.59155,6.87073 -27.24997,13.57225 c -14.98745,7.46477 -38.73947,19.29887 -52.78223,26.29802 -14.04276,6.99919 -47.14214,23.47667 -73.55417,36.61665 -26.41203,13.14 -49.56969,24.6726 -51.46146,25.62801 -14.73102,7.43974 -34.25918,17.03383 -34.34961,16.87582 z M -101.546,212.11017 c -30.48661,-15.36158 -55.47855,-27.97742 -55.53764,-28.0352 -0.0591,-0.0578 1.42919,-2.41829 3.30729,-5.24558 l 3.41473,-5.14051 2.77812,-1.23309 c 1.52797,-0.67818 6.94532,-3.02286 12.03854,-5.21036 5.09323,-2.18752 14.38011,-6.23898 20.63751,-9.00324 6.25739,-2.76429 12.03509,-5.31495 12.83933,-5.66817 l 1.46225,-0.64222 11.370043,5.59527 c 6.253523,3.0774 19.473247,9.61451 29.377162,14.52692 l 18.007125,8.93168 0.595984,2.08462 c 0.327793,1.14655 1.589736,5.35885 2.804322,9.36067 l 2.208337,7.27604 0.159583,4.10104 c 0.246031,6.32259 0.490842,34.13125 0.300472,34.13125 -0.0929,0 -2.31652,0.47625 -4.941377,1.05834 -2.624858,0.58208 -4.911765,1.05481 -5.082017,1.0505 -0.170251,-0.004 -25.253144,-12.57641 -55.739764,-27.93796 z m 348.32398,-364.54392 c -5.67532,-1.49489 -12.81907,-3.40364 -15.875,-4.24167 l -5.55625,-1.52368 -11.37709,-5.96035 c -6.25739,-3.27819 -14.41318,-7.59573 -18.12396,-9.59453 -3.71078,-1.9988 -12.87859,-6.84773 -20.37291,-10.7754 -7.49433,-3.92767 -15.8287,-8.32918 -18.52084,-9.78113 -2.69213,-1.45195 -6.08542,-3.26699 -7.54062,-4.03342 -2.64039,-1.39064 -2.6502,-1.39952 -4.7625,-4.31209 -1.16417,-1.60522 -3.87565,-5.31335 -6.02549,-8.24029 l -3.9088,-5.3217 0.14624,-7.14375 c 0.0804,-3.92907 0.27598,-11.13235 0.43457,-16.0073 0.15857,-4.87495 0.36344,-12.36263 0.45527,-16.6393 l 0.16696,-7.77576 5.71788,-1.32265 5.71788,-1.32265 11.34775,5.75756 c 6.24125,3.16667 13.01461,6.62032 15.0519,7.67479 2.0373,1.05447 14.89605,7.547 28.575,14.42784 13.67896,6.88085 26.71631,13.45678 28.97188,14.6132 2.25557,1.15641 19.10292,9.67223 37.43854,18.92403 44.53271,22.47036 40.15796,20.17581 40.51766,21.25143 0.16553,0.49503 1.07141,3.36105 2.01306,6.36894 l 1.71209,5.46888 -3.336,1.38673 c -1.83478,0.7627 -9.76535,4.15572 -17.62347,7.54005 -26.83706,11.55815 -31.55969,13.39656 -34.2183,13.32043 -0.38867,-0.0111 -5.35014,-1.24333 -11.02545,-2.73821 z M 19.351112,-166.73463 c -3.827296,-1.93193 -3.856239,-1.95331 -4.18668,-3.09251 -0.183007,-0.63092 -2.516508,-8.17181 -5.1855557,-16.75754 -5.5114589,-17.72912 -5.9561177,-19.20717 -5.9561177,-19.79815 0,-0.23458 2.3514845,-3.30564 5.2255211,-6.82457 l 5.2255213,-6.39806 46.169793,-22.99913 46.169796,-22.99912 2.42337,1.1974 c 2.03808,1.00703 2.44724,1.31526 2.5735,1.93868 0.18494,0.91314 3.63508,27.14927 4.35972,33.15274 l 0.52692,4.36563 -5.70847,9.65729 c -3.13965,5.31151 -6.34373,10.73074 -7.1202,12.04273 l -1.41174,2.38545 -33.408009,16.56885 -33.408013,16.56885 -5.820833,1.36855 c -3.201459,0.7527 -5.999428,1.41349 -6.217709,1.46842 -0.218281,0.0549 -2.131147,-0.77555 -4.250814,-1.84551 z"
         id="path553" /><path
         style="fill:#7c9dbc;stroke-width:0.264583"
         d="m 114.08943,227.36916 -4.10104,-0.14549 -14.552086,-7.43458 c -8.003646,-4.089 -20.683803,-10.56214 -28.178126,-14.38474 -7.494323,-3.82259 -18.567136,-9.48605 -24.606251,-12.58546 -6.039115,-3.09941 -17.171459,-8.78297 -24.738543,-12.63018 -20.0689242,-10.20325 -39.619194,-20.17585 -50.932293,-25.98057 -5.457032,-2.79998 -16.76797,-8.56994 -25.135418,-12.82213 l -15.213542,-7.73123 -4.497917,-6.89769 c -2.473854,-3.79373 -4.893623,-7.52102 -5.377265,-8.28284 l -0.879345,-1.38514 0.281484,-28.805642 c 0.263137,-26.927652 0.53761,-60.179614 1.054722,-127.77833 l 0.214688,-28.064336 5.435132,-8.053793 5.435132,-8.05379 7.104185,-3.482166 c 3.9073,-1.915191 14.783716,-7.260198 24.16981,-11.877791 9.386094,-4.617592 19.804063,-9.728602 23.151042,-11.357792 3.34698,-1.62919 14.1221364,-6.92121 23.9447931,-11.76004 9.8226569,-4.83883 25.0031259,-12.31357 33.7343759,-16.61054 8.731251,-4.29697 24.149845,-11.89082 34.263543,-16.87523 10.113699,-4.98441 22.959405,-11.29636 28.546029,-14.02656 l 10.15751,-4.96401 10.82072,0.0544 10.82075,0.0544 14.74052,7.48109 c 8.10728,4.1146 19.62208,9.98608 25.58843,13.04773 15.93959,8.17943 36.25446,18.54734 51.72605,26.39891 7.49432,3.80324 19.40057,9.86996 26.45833,13.48158 34.54231,17.676114 47.97714,24.530979 56.24351,28.697161 l 9.01542,4.543682 5.36106,8.228624 5.36105,8.228621 -0.5438,78.742345 c -0.29909,43.308272 -0.61685,84.87405 -0.70615,92.368377 l -0.16232,13.62604 -5.4397,8.10985 -5.4397,8.10985 -6.64314,3.24136 c -8.40708,4.10202 -37.36583,18.34594 -60.22123,29.62092 -9.67713,4.77393 -20.2737,9.98448 -23.54792,11.57902 -7.06236,3.43937 -32.49427,15.93723 -55.5625,27.30481 -9.09505,4.48186 -21.64223,10.66297 -27.88261,13.73579 l -11.34616,5.58694 -6.91009,-0.0529 c -3.80056,-0.0291 -8.75557,-0.11843 -11.01114,-0.19844 z M 252.65096,114.60123 c 1.82623,-0.68329 3.83678,-2.51915 4.5089,-4.11718 0.48315,-1.14869 0.54768,-2.07674 0.7044,-10.12809 0.15062,-7.739464 0.11874,-9.021079 -0.25125,-10.105632 -0.80865,-2.370429 -3.2244,-4.439444 -6.07695,-5.204725 -1.06558,-0.285882 -114.61309,-1.258544 -121.57163,-1.0414 -2.85649,0.08911 -3.50729,0.195395 -4.77457,0.779753 -2.01586,0.929482 -3.27257,2.106692 -4.14451,3.882285 l -0.73821,1.503256 v 9.128126 c 0,10.185687 -0.0185,10.065437 1.87574,12.162157 1.03462,1.14522 2.63638,2.09407 4.47426,2.65041 0.79433,0.24045 16.04052,0.43889 61.11875,0.79542 33.03323,0.26127 60.8338,0.41563 61.77902,0.34303 0.94522,-0.0726 2.33844,-0.36396 3.09605,-0.64741 z M 18.503421,111.6004 c 1.713955,-0.85746 3.156278,-2.1319 4.70163,-4.15435 0.291042,-0.3809 8.863542,-7.813174 19.050001,-16.516166 10.186459,-8.702993 25.902709,-22.141816 34.925001,-29.864052 9.022292,-7.722235 20.892374,-17.879722 26.377957,-22.572187 5.48558,-4.692491 10.4013,-9.031235 10.92382,-9.641681 1.86338,-2.176913 2.1749,-5.29471 0.78433,-7.849633 C 114.49961,19.593928 115.15131,20.190166 97.023804,4.3127316 90.475366,-1.4228796 81.069428,-9.6996816 76.12172,-14.080123 71.174011,-18.460565 61.706955,-26.800153 55.083799,-32.612546 48.460642,-38.424913 38.666042,-47.050039 33.318024,-51.779466 27.198833,-57.19087 23.038988,-60.67266 22.096153,-61.172175 c -1.391904,-0.737431 -1.696699,-0.79375 -4.295696,-0.79375 -2.513406,0 -2.945265,0.07323 -4.252698,0.721146 -0.800365,0.396631 -2.824427,1.891437 -4.4979168,3.321796 -1.6734897,1.430356 -6.7618666,5.777942 -11.3075063,9.661311 -4.5456398,3.883343 -8.6168949,7.546711 -9.0472369,8.14078 -1.649026,2.276395 -1.617874,5.399775 0.07782,7.802827 0.456525,0.646959 6.3664519,6.016361 13.1331709,11.931968 6.766719,5.915607 14.8629691,13.0337723 17.9916671,15.8181416 3.128698,2.7843693 9.076505,8.0348405 13.217351,11.6676757 4.140843,3.6328617 9.022406,7.9158837 10.847917,9.5178037 3.938974,3.45657 4.778021,4.756468 4.768496,7.387432 -0.0066,1.829726 -0.579623,3.316499 -1.740773,4.516622 -0.422381,0.436563 -4.696238,4.127501 -9.497471,8.202084 -4.801235,4.074584 -13.499082,11.51599 -19.328546,16.536459 -5.829462,5.020469 -14.9112028,12.795886 -20.1816448,17.278721 -5.7039142,4.851533 -9.8501492,8.574405 -10.2435742,9.197631 -1.538325,2.436866 -1.442636,5.512251 0.240432,7.727157 0.467413,0.615103 6.3816206,5.978869 13.1426829,11.919453 6.7610595,5.940607 12.8861061,11.328187 13.6112101,11.972397 0.725106,0.64423 1.45325,1.17131 1.618099,1.17131 0.164848,0 1.133014,-0.41688 2.151483,-0.92639 z"
         id="path551" /><path
         style="fill:#9f9e74;stroke-width:0.264583"
         d="m 425.36827,110.807 c 0,-21.391565 0.0313,-30.103554 0.0696,-19.359988 0.0383,10.743568 0.0383,28.245758 0,38.893748 -0.0383,10.648 -0.0696,1.8578 -0.0696,-19.53376 z m -0.007,-63.103129 c 0,-6.621198 0.0344,-9.32987 0.0763,-6.019271 0.042,3.310599 0.042,8.727943 0,12.038542 -0.042,3.310599 -0.0763,0.601927 -0.0763,-6.019271 z"
         id="path549" /><path
         style="fill:#bc5f69;stroke-width:0.264583"
         d="m -172.0343,155.36484 -4.67663,-5.61062 0.1523,-9.02255 c 0.26944,-15.96274 0.97959,-116.621278 1.02124,-144.7538429 0.0222,-14.9886461 -0.0586,-45.5281791 -0.17946,-67.8656271 l -0.2198,-40.61354 8.02501,-10.76457 8.02502,-10.76457 4.10104,-1.97623 c 3.73419,-1.79946 14.55102,-7.1097 53.975,-26.49764 29.973024,-14.74014 46.164588,-22.68501 56.92624,-27.93254 l 11.285612,-5.50301 7.235222,0.64131 c 3.979373,0.35272 7.60458,0.70357 8.05602,0.77966 l 0.820799,0.13835 2.054857,6.80837 c 1.130171,3.7446 3.886203,12.73503 6.1245147,19.97873 2.2383116,7.2437 4.0696569,13.28299 4.0696569,13.42066 0,0.13766 -3.8725529,3.85506 -8.6056716,8.26088 l -8.605673,8.0106 -3.235635,1.5875 c -1.779598,0.87312 -6.33072,3.06537 -10.1136,4.87167 -3.782881,1.8063 -11.819057,5.66183 -17.858172,8.56785 -6.039115,2.90603 -18.600209,8.93328 -27.913543,13.3939 -9.313334,4.46061 -17.469115,8.40473 -18.123959,8.76472 -1.045148,0.57453 -1.877598,1.653944 -6.813018,8.834172 l -5.6224,8.179668 -0.001,11.264843 c -8e-4,6.195663 -0.13025,30.67203 -0.28772,54.391927 -0.21384,32.211408 -0.20611,55.080749 0.0305,90.355212 l 0.31684,47.228128 -6.12144,10.4485 c -3.36679,5.74667 -6.26717,10.59177 -6.44527,10.76693 -0.25126,0.24709 -30.15855,12.78353 -30.49675,12.78353 -0.0442,0 -2.66096,1.61546 -5.8151,3.58994 -3.15413,1.97448 -5.88627,3.64808 -6.07141,3.71912 -0.19885,0.0763 -2.25068,-2.16715 -5.01325,-5.48143 z"
         id="path547" /></g></g></svg>
