{
  "https://demowebshop.tricentis.com/logout-23" : {
    "transaction" : "https://demowebshop.tricentis.com/logout-23",
    "sampleCount" : 10,
    "errorCount" : 0,
    "errorPct" : 0.0,
    "meanResTime" : 175.1,
    "medianResTime" : 164.5,
    "minResTime" : 159.0,
    "maxResTime" : 264.0,
    "pct1ResTime" : 255.40000000000003,
    "pct2ResTime" : 264.0,
    "pct3ResTime" : 264.0,
    "throughput" : 0.9289363678588017,
    "receivedKBytesPerSec" : 0.11248838829540175,
    "sentKBytesPerSec" : 0.8400342545285647
  },
  "https://demowebshop.tricentis.com/logout-22" : {
    "transaction" : "https://demowebshop.tricentis.com/logout-22",
    "sampleCount" : 10,
    "errorCount" : 0,
    "errorPct" : 0.0,
    "meanResTime" : 202.0,
    "medianResTime" : 168.5,
    "minResTime" : 163.0,
    "maxResTime" : 514.0,
    "pct1ResTime" : 479.8000000000001,
    "pct2ResTime" : 514.0,
    "pct3ResTime" : 514.0,
    "throughput" : 0.9181050312155711,
    "receivedKBytesPerSec" : 0.11117678112376056,
    "sentKBytesPerSec" : 0.8212736412045538
  },
  "https://demowebshop.tricentis.com/logout-21" : {
    "transaction" : "https://demowebshop.tricentis.com/logout-21",
    "sampleCount" : 10,
    "errorCount" : 0,
    "errorPct" : 0.0,
    "meanResTime" : 166.4,
    "medianResTime" : 165.5,
    "minResTime" : 161.0,
    "maxResTime" : 178.0,
    "pct1ResTime" : 177.2,
    "pct2ResTime" : 178.0,
    "pct3ResTime" : 178.0,
    "throughput" : 0.9173470323823503,
    "receivedKBytesPerSec" : 0.11018914549123934,
    "sentKBytesPerSec" : 0.8250748211173287
  },
  "https://demowebshop.tricentis.com/logout-20" : {
    "transaction" : "https://demowebshop.tricentis.com/logout-20",
    "sampleCount" : 10,
    "errorCount" : 0,
    "errorPct" : 0.0,
    "meanResTime" : 216.90000000000003,
    "medianResTime" : 165.5,
    "minResTime" : 160.0,
    "maxResTime" : 674.0,
    "pct1ResTime" : 624.2000000000002,
    "pct2ResTime" : 674.0,
    "pct3ResTime" : 674.0,
    "throughput" : 0.9165062780680048,
    "receivedKBytesPerSec" : 0.11187820777197324,
    "sentKBytesPerSec" : 0.8126833012556136
  },
  "https://demowebshop.tricentis.com/login-18" : {
    "transaction" : "https://demowebshop.tricentis.com/login-18",
    "sampleCount" : 10,
    "errorCount" : 0,
    "errorPct" : 0.0,
    "meanResTime" : 584.3,
    "medianResTime" : 503.0,
    "minResTime" : 345.0,
    "maxResTime" : 1397.0,
    "pct1ResTime" : 1312.0000000000005,
    "pct2ResTime" : 1397.0,
    "pct3ResTime" : 1397.0,
    "throughput" : 0.7535795026375283,
    "receivedKBytesPerSec" : 41.02813559721176,
    "sentKBytesPerSec" : 0.8433614355689526
  },
  "https://demowebshop.tricentis.com/login-19" : {
    "transaction" : "https://demowebshop.tricentis.com/login-19",
    "sampleCount" : 10,
    "errorCount" : 0,
    "errorPct" : 0.0,
    "meanResTime" : 1130.4,
    "medianResTime" : 1043.5,
    "minResTime" : 865.0,
    "maxResTime" : 1618.0,
    "pct1ResTime" : 1606.7,
    "pct2ResTime" : 1618.0,
    "pct3ResTime" : 1618.0,
    "throughput" : 0.7015574575557738,
    "receivedKBytesPerSec" : 301.96225072786586,
    "sentKBytesPerSec" : 0.7851414515223797
  },
  "https://demowebshop.tricentis.com/login" : {
    "transaction" : "https://demowebshop.tricentis.com/login",
    "sampleCount" : 20,
    "errorCount" : 1,
    "errorPct" : 5.0,
    "meanResTime" : 3443.8999999999996,
    "medianResTime" : 3342.5,
    "minResTime" : 2470.0,
    "maxResTime" : 5325.0,
    "pct1ResTime" : 5139.500000000003,
    "pct2ResTime" : 5321.7,
    "pct3ResTime" : 5325.0,
    "throughput" : 0.9770873027505008,
    "receivedKBytesPerSec" : 545.3870887836484,
    "sentKBytesPerSec" : 19.229822383848745
  },
  "https://demowebshop.tricentis.com/logout" : {
    "transaction" : "https://demowebshop.tricentis.com/logout",
    "sampleCount" : 10,
    "errorCount" : 4,
    "errorPct" : 40.0,
    "meanResTime" : 2779.7,
    "medianResTime" : 2706.5,
    "minResTime" : 1967.0,
    "maxResTime" : 4926.0,
    "pct1ResTime" : 4743.500000000001,
    "pct2ResTime" : 4926.0,
    "pct3ResTime" : 4926.0,
    "throughput" : 0.8069071249899137,
    "receivedKBytesPerSec" : 32.60826739389171,
    "sentKBytesPerSec" : 17.187515759904784
  },
  "https://demowebshop.tricentis.com/login-25" : {
    "transaction" : "https://demowebshop.tricentis.com/login-25",
    "sampleCount" : 10,
    "errorCount" : 0,
    "errorPct" : 0.0,
    "meanResTime" : 221.79999999999998,
    "medianResTime" : 168.5,
    "minResTime" : 161.0,
    "maxResTime" : 677.0,
    "pct1ResTime" : 628.6000000000001,
    "pct2ResTime" : 677.0,
    "pct3ResTime" : 677.0,
    "throughput" : 0.7785736530675802,
    "receivedKBytesPerSec" : 2.9964441081438804,
    "sentKBytesPerSec" : 0.8873002471971349
  },
  "https://demowebshop.tricentis.com/login-23" : {
    "transaction" : "https://demowebshop.tricentis.com/login-23",
    "sampleCount" : 10,
    "errorCount" : 0,
    "errorPct" : 0.0,
    "meanResTime" : 225.9,
    "medianResTime" : 172.5,
    "minResTime" : 164.0,
    "maxResTime" : 674.0,
    "pct1ResTime" : 627.0000000000002,
    "pct2ResTime" : 674.0,
    "pct3ResTime" : 674.0,
    "throughput" : 0.7843752451172641,
    "receivedKBytesPerSec" : 3.0294961859753706,
    "sentKBytesPerSec" : 0.9000399541140481
  },
  "https://demowebshop.tricentis.com/login-24" : {
    "transaction" : "https://demowebshop.tricentis.com/login-24",
    "sampleCount" : 10,
    "errorCount" : 0,
    "errorPct" : 0.0,
    "meanResTime" : 191.2,
    "medianResTime" : 173.0,
    "minResTime" : 164.0,
    "maxResTime" : 359.0,
    "pct1ResTime" : 341.30000000000007,
    "pct2ResTime" : 359.0,
    "pct3ResTime" : 359.0,
    "throughput" : 0.7758553805570642,
    "receivedKBytesPerSec" : 2.9852248040965166,
    "sentKBytesPerSec" : 0.8978404550391808
  },
  "Test" : {
    "transaction" : "Test",
    "sampleCount" : 10,
    "errorCount" : 4,
    "errorPct" : 40.0,
    "meanResTime" : 9667.5,
    "medianResTime" : 9581.0,
    "minResTime" : 8263.0,
    "maxResTime" : 11843.0,
    "pct1ResTime" : 11747.5,
    "pct2ResTime" : 11843.0,
    "pct3ResTime" : 11843.0,
    "throughput" : 0.8042464211034261,
    "receivedKBytesPerSec" : 930.3235144060641,
    "sentKBytesPerSec" : 48.78720582173878
  },
  "https://demowebshop.tricentis.com/login-21" : {
    "transaction" : "https://demowebshop.tricentis.com/login-21",
    "sampleCount" : 10,
    "errorCount" : 0,
    "errorPct" : 0.0,
    "meanResTime" : 213.8,
    "medianResTime" : 170.5,
    "minResTime" : 163.0,
    "maxResTime" : 588.0,
    "pct1ResTime" : 548.8000000000002,
    "pct2ResTime" : 588.0,
    "pct3ResTime" : 588.0,
    "throughput" : 0.7745333436604446,
    "receivedKBytesPerSec" : 5.760591743474556,
    "sentKBytesPerSec" : 0.8819393346758578
  },
  "https://demowebshop.tricentis.com/login-22" : {
    "transaction" : "https://demowebshop.tricentis.com/login-22",
    "sampleCount" : 10,
    "errorCount" : 0,
    "errorPct" : 0.0,
    "meanResTime" : 167.9,
    "medianResTime" : 165.0,
    "minResTime" : 163.0,
    "maxResTime" : 179.0,
    "pct1ResTime" : 178.6,
    "pct2ResTime" : 179.0,
    "pct3ResTime" : 179.0,
    "throughput" : 0.78125,
    "receivedKBytesPerSec" : 3.006744384765625,
    "sentKBytesPerSec" : 0.901031494140625
  },
  "https://demowebshop.tricentis.com/logout-24" : {
    "transaction" : "https://demowebshop.tricentis.com/logout-24",
    "sampleCount" : 10,
    "errorCount" : 1,
    "errorPct" : 10.0,
    "meanResTime" : 158.9,
    "medianResTime" : 164.5,
    "minResTime" : 84.0,
    "maxResTime" : 190.0,
    "pct1ResTime" : 188.0,
    "pct2ResTime" : 190.0,
    "pct3ResTime" : 190.0,
    "throughput" : 0.9307520476545049,
    "receivedKBytesPerSec" : 0.3932063826321668,
    "sentKBytesPerSec" : 0.7436018068224125
  },
  "https://demowebshop.tricentis.com/login-20" : {
    "transaction" : "https://demowebshop.tricentis.com/login-20",
    "sampleCount" : 10,
    "errorCount" : 0,
    "errorPct" : 0.0,
    "meanResTime" : 170.60000000000002,
    "medianResTime" : 165.5,
    "minResTime" : 162.0,
    "maxResTime" : 200.0,
    "pct1ResTime" : 197.8,
    "pct2ResTime" : 200.0,
    "pct3ResTime" : 200.0,
    "throughput" : 0.7716644802839726,
    "receivedKBytesPerSec" : 2.310471969287754,
    "sentKBytesPerSec" : 0.8831941122000154
  },
  "https://demowebshop.tricentis.com/login-2" : {
    "transaction" : "https://demowebshop.tricentis.com/login-2",
    "sampleCount" : 20,
    "errorCount" : 0,
    "errorPct" : 0.0,
    "meanResTime" : 584.5,
    "medianResTime" : 499.5,
    "minResTime" : 163.0,
    "maxResTime" : 2323.0,
    "pct1ResTime" : 1032.3000000000002,
    "pct2ResTime" : 2258.999999999999,
    "pct3ResTime" : 2323.0,
    "throughput" : 1.194243745148385,
    "receivedKBytesPerSec" : 14.963034424075953,
    "sentKBytesPerSec" : 1.1680030378575268
  },
  "https://demowebshop.tricentis.com/login-1" : {
    "transaction" : "https://demowebshop.tricentis.com/login-1",
    "sampleCount" : 20,
    "errorCount" : 0,
    "errorPct" : 0.0,
    "meanResTime" : 809.4000000000001,
    "medianResTime" : 768.0,
    "minResTime" : 358.0,
    "maxResTime" : 1583.0,
    "pct1ResTime" : 1170.2,
    "pct2ResTime" : 1562.4499999999998,
    "pct3ResTime" : 1583.0,
    "throughput" : 1.2062726176115801,
    "receivedKBytesPerSec" : 76.76323130277443,
    "sentKBytesPerSec" : 1.1049645657418579
  },
  "https://demowebshop.tricentis.com/login-4" : {
    "transaction" : "https://demowebshop.tricentis.com/login-4",
    "sampleCount" : 20,
    "errorCount" : 0,
    "errorPct" : 0.0,
    "meanResTime" : 916.05,
    "medianResTime" : 781.5,
    "minResTime" : 165.0,
    "maxResTime" : 2509.0,
    "pct1ResTime" : 2396.2000000000016,
    "pct2ResTime" : 2507.35,
    "pct3ResTime" : 2509.0,
    "throughput" : 1.1924636298592892,
    "receivedKBytesPerSec" : 55.07050907017649,
    "sentKBytesPerSec" : 1.1744136432745051
  },
  "https://demowebshop.tricentis.com/login-3" : {
    "transaction" : "https://demowebshop.tricentis.com/login-3",
    "sampleCount" : 20,
    "errorCount" : 0,
    "errorPct" : 0.0,
    "meanResTime" : 762.75,
    "medianResTime" : 817.0,
    "minResTime" : 167.0,
    "maxResTime" : 2373.0,
    "pct1ResTime" : 2052.4000000000024,
    "pct2ResTime" : 2362.8999999999996,
    "pct3ResTime" : 2373.0,
    "throughput" : 1.1929615269907545,
    "receivedKBytesPerSec" : 15.97333544586937,
    "sentKBytesPerSec" : 1.1836415150611392
  },
  "https://demowebshop.tricentis.com/login-6" : {
    "transaction" : "https://demowebshop.tricentis.com/login-6",
    "sampleCount" : 20,
    "errorCount" : 0,
    "errorPct" : 0.0,
    "meanResTime" : 622.95,
    "medianResTime" : 672.0,
    "minResTime" : 168.0,
    "maxResTime" : 1988.0,
    "pct1ResTime" : 835.1,
    "pct2ResTime" : 1930.4499999999991,
    "pct3ResTime" : 1988.0,
    "throughput" : 1.1940298507462688,
    "receivedKBytesPerSec" : 4.888059701492537,
    "sentKBytesPerSec" : 1.1380597014925373
  },
  "https://demowebshop.tricentis.com/login-5" : {
    "transaction" : "https://demowebshop.tricentis.com/login-5",
    "sampleCount" : 20,
    "errorCount" : 0,
    "errorPct" : 0.0,
    "meanResTime" : 742.35,
    "medianResTime" : 749.0,
    "minResTime" : 167.0,
    "maxResTime" : 2318.0,
    "pct1ResTime" : 2059.1000000000026,
    "pct2ResTime" : 2311.0,
    "pct3ResTime" : 2318.0,
    "throughput" : 1.1933174224343677,
    "receivedKBytesPerSec" : 14.292423366646776,
    "sentKBytesPerSec" : 1.1239791542362767
  },
  "https://demowebshop.tricentis.com/login-8" : {
    "transaction" : "https://demowebshop.tricentis.com/login-8",
    "sampleCount" : 20,
    "errorCount" : 1,
    "errorPct" : 5.0,
    "meanResTime" : 586.5,
    "medianResTime" : 660.5,
    "minResTime" : 1.0,
    "maxResTime" : 2898.0,
    "pct1ResTime" : 1228.7000000000012,
    "pct2ResTime" : 2817.249999999999,
    "pct3ResTime" : 2898.0,
    "throughput" : 1.244864932154861,
    "receivedKBytesPerSec" : 4.785131936231794,
    "sentKBytesPerSec" : 1.1337510114527574
  },
  "https://demowebshop.tricentis.com/login-7" : {
    "transaction" : "https://demowebshop.tricentis.com/login-7",
    "sampleCount" : 20,
    "errorCount" : 0,
    "errorPct" : 0.0,
    "meanResTime" : 676.4999999999999,
    "medianResTime" : 468.5,
    "minResTime" : 163.0,
    "maxResTime" : 3063.0,
    "pct1ResTime" : 1431.2,
    "pct2ResTime" : 2981.549999999999,
    "pct3ResTime" : 3063.0,
    "throughput" : 1.2276717205819165,
    "receivedKBytesPerSec" : 137.01248005033455,
    "sentKBytesPerSec" : 1.191704775642993
  },
  "https://demowebshop.tricentis.com/login-0" : {
    "transaction" : "https://demowebshop.tricentis.com/login-0",
    "sampleCount" : 20,
    "errorCount" : 0,
    "errorPct" : 0.0,
    "meanResTime" : 844.25,
    "medianResTime" : 939.0,
    "minResTime" : 217.0,
    "maxResTime" : 1607.0,
    "pct1ResTime" : 1470.9,
    "pct2ResTime" : 1600.25,
    "pct3ResTime" : 1607.0,
    "throughput" : 1.1680196227296618,
    "receivedKBytesPerSec" : 13.686589309700402,
    "sentKBytesPerSec" : 0.7824818956958476
  },
  "https://demowebshop.tricentis.com/logout-5" : {
    "transaction" : "https://demowebshop.tricentis.com/logout-5",
    "sampleCount" : 10,
    "errorCount" : 0,
    "errorPct" : 0.0,
    "meanResTime" : 491.80000000000007,
    "medianResTime" : 666.5,
    "minResTime" : 167.0,
    "maxResTime" : 775.0,
    "pct1ResTime" : 769.9,
    "pct2ResTime" : 775.0,
    "pct3ResTime" : 775.0,
    "throughput" : 0.9304922303898763,
    "receivedKBytesPerSec" : 0.11267679352377408,
    "sentKBytesPerSec" : 0.8314456941472039
  },
  "https://demowebshop.tricentis.com/logout-4" : {
    "transaction" : "https://demowebshop.tricentis.com/logout-4",
    "sampleCount" : 10,
    "errorCount" : 0,
    "errorPct" : 0.0,
    "meanResTime" : 486.0,
    "medianResTime" : 586.5,
    "minResTime" : 162.0,
    "maxResTime" : 1012.0,
    "pct1ResTime" : 978.8000000000002,
    "pct2ResTime" : 1012.0,
    "pct3ResTime" : 1012.0,
    "throughput" : 0.9305788200260562,
    "receivedKBytesPerSec" : 0.11177851060859854,
    "sentKBytesPerSec" : 0.8360669086171598
  },
  "https://demowebshop.tricentis.com/logout-3" : {
    "transaction" : "https://demowebshop.tricentis.com/logout-3",
    "sampleCount" : 10,
    "errorCount" : 0,
    "errorPct" : 0.0,
    "meanResTime" : 407.5,
    "medianResTime" : 338.0,
    "minResTime" : 160.0,
    "maxResTime" : 738.0,
    "pct1ResTime" : 731.3000000000001,
    "pct2ResTime" : 738.0,
    "pct3ResTime" : 738.0,
    "throughput" : 0.9296272194849865,
    "receivedKBytesPerSec" : 0.11257204610951009,
    "sentKBytesPerSec" : 0.8134238170493633
  },
  "https://demowebshop.tricentis.com/logout-2" : {
    "transaction" : "https://demowebshop.tricentis.com/logout-2",
    "sampleCount" : 10,
    "errorCount" : 0,
    "errorPct" : 0.0,
    "meanResTime" : 385.9,
    "medianResTime" : 253.0,
    "minResTime" : 164.0,
    "maxResTime" : 675.0,
    "pct1ResTime" : 674.8,
    "pct2ResTime" : 675.0,
    "pct3ResTime" : 675.0,
    "throughput" : 0.9294544102611767,
    "receivedKBytesPerSec" : 0.11255111999256436,
    "sentKBytesPerSec" : 0.8096419276884469
  },
  "https://demowebshop.tricentis.com/logout-1" : {
    "transaction" : "https://demowebshop.tricentis.com/logout-1",
    "sampleCount" : 10,
    "errorCount" : 0,
    "errorPct" : 0.0,
    "meanResTime" : 636.0,
    "medianResTime" : 635.0,
    "minResTime" : 398.0,
    "maxResTime" : 1019.0,
    "pct1ResTime" : 987.7,
    "pct2ResTime" : 1019.0,
    "pct3ResTime" : 1019.0,
    "throughput" : 0.9111617312072894,
    "receivedKBytesPerSec" : 31.397707858769934,
    "sentKBytesPerSec" : 0.6842611047835991
  },
  "https://demowebshop.tricentis.com/logout-0" : {
    "transaction" : "https://demowebshop.tricentis.com/logout-0",
    "sampleCount" : 10,
    "errorCount" : 0,
    "errorPct" : 0.0,
    "meanResTime" : 363.40000000000003,
    "medianResTime" : 217.0,
    "minResTime" : 198.0,
    "maxResTime" : 746.0,
    "pct1ResTime" : 743.5,
    "pct2ResTime" : 746.0,
    "pct3ResTime" : 746.0,
    "throughput" : 0.9487666034155597,
    "receivedKBytesPerSec" : 0.6402321513282733,
    "sentKBytesPerSec" : 0.9913869781783682
  },
  "https://demowebshop.tricentis.com/logout-9" : {
    "transaction" : "https://demowebshop.tricentis.com/logout-9",
    "sampleCount" : 10,
    "errorCount" : 1,
    "errorPct" : 10.0,
    "meanResTime" : 512.4,
    "medianResTime" : 661.0,
    "minResTime" : 163.0,
    "maxResTime" : 686.0,
    "pct1ResTime" : 685.3,
    "pct2ResTime" : 686.0,
    "pct3ResTime" : 686.0,
    "throughput" : 0.888888888888889,
    "receivedKBytesPerSec" : 0.3802083333333333,
    "sentKBytesPerSec" : 0.69921875
  },
  "https://demowebshop.tricentis.com/logout-8" : {
    "transaction" : "https://demowebshop.tricentis.com/logout-8",
    "sampleCount" : 10,
    "errorCount" : 1,
    "errorPct" : 10.0,
    "meanResTime" : 636.1999999999999,
    "medianResTime" : 655.5,
    "minResTime" : 166.0,
    "maxResTime" : 1177.0,
    "pct1ResTime" : 1160.8000000000002,
    "pct2ResTime" : 1177.0,
    "pct3ResTime" : 1177.0,
    "throughput" : 0.9106638739641199,
    "receivedKBytesPerSec" : 0.3839195257717876,
    "sentKBytesPerSec" : 0.707543142701029
  },
  "https://demowebshop.tricentis.com/logout-7" : {
    "transaction" : "https://demowebshop.tricentis.com/logout-7",
    "sampleCount" : 10,
    "errorCount" : 0,
    "errorPct" : 0.0,
    "meanResTime" : 430.29999999999995,
    "medianResTime" : 173.0,
    "minResTime" : 162.0,
    "maxResTime" : 1635.0,
    "pct1ResTime" : 1538.4000000000003,
    "pct2ResTime" : 1635.0,
    "pct3ResTime" : 1635.0,
    "throughput" : 0.8738967054094207,
    "receivedKBytesPerSec" : 0.10497001441929564,
    "sentKBytesPerSec" : 0.7518583959625973
  },
  "https://demowebshop.tricentis.com/logout-6" : {
    "transaction" : "https://demowebshop.tricentis.com/logout-6",
    "sampleCount" : 10,
    "errorCount" : 0,
    "errorPct" : 0.0,
    "meanResTime" : 430.7,
    "medianResTime" : 334.0,
    "minResTime" : 163.0,
    "maxResTime" : 954.0,
    "pct1ResTime" : 926.8000000000001,
    "pct2ResTime" : 954.0,
    "pct3ResTime" : 954.0,
    "throughput" : 0.929195316855603,
    "receivedKBytesPerSec" : 0.11251974540048318,
    "sentKBytesPerSec" : 0.8402684212971566
  },
  "https://demowebshop.tricentis.com/login-9" : {
    "transaction" : "https://demowebshop.tricentis.com/login-9",
    "sampleCount" : 20,
    "errorCount" : 0,
    "errorPct" : 0.0,
    "meanResTime" : 511.80000000000007,
    "medianResTime" : 664.0,
    "minResTime" : 165.0,
    "maxResTime" : 726.0,
    "pct1ResTime" : 721.5,
    "pct2ResTime" : 725.8,
    "pct3ResTime" : 726.0,
    "throughput" : 1.2075836251660428,
    "receivedKBytesPerSec" : 2.086147883709697,
    "sentKBytesPerSec" : 1.1722051986475062
  },
  "https://demowebshop.tricentis.com/logout-12" : {
    "transaction" : "https://demowebshop.tricentis.com/logout-12",
    "sampleCount" : 10,
    "errorCount" : 1,
    "errorPct" : 10.0,
    "meanResTime" : 630.5,
    "medianResTime" : 668.5,
    "minResTime" : 164.0,
    "maxResTime" : 1328.0,
    "pct1ResTime" : 1263.6000000000004,
    "pct2ResTime" : 1328.0,
    "pct3ResTime" : 1328.0,
    "throughput" : 0.8893632159373889,
    "receivedKBytesPerSec" : 0.37493955109391675,
    "sentKBytesPerSec" : 0.6863035285485592
  },
  "https://demowebshop.tricentis.com/logout-11" : {
    "transaction" : "https://demowebshop.tricentis.com/logout-11",
    "sampleCount" : 10,
    "errorCount" : 0,
    "errorPct" : 0.0,
    "meanResTime" : 348.5,
    "medianResTime" : 169.0,
    "minResTime" : 160.0,
    "maxResTime" : 675.0,
    "pct1ResTime" : 674.8,
    "pct2ResTime" : 675.0,
    "pct3ResTime" : 675.0,
    "throughput" : 0.9321401938851603,
    "receivedKBytesPerSec" : 0.11287635160328113,
    "sentKBytesPerSec" : 0.8092506175428784
  },
  "https://demowebshop.tricentis.com/logout-10" : {
    "transaction" : "https://demowebshop.tricentis.com/logout-10",
    "sampleCount" : 10,
    "errorCount" : 0,
    "errorPct" : 0.0,
    "meanResTime" : 572.0,
    "medianResTime" : 667.5,
    "minResTime" : 169.0,
    "maxResTime" : 692.0,
    "pct1ResTime" : 690.8,
    "pct2ResTime" : 692.0,
    "pct3ResTime" : 692.0,
    "throughput" : 0.8891259891526629,
    "receivedKBytesPerSec" : 0.10766760024895528,
    "sentKBytesPerSec" : 0.7745120921134525
  },
  "https://demowebshop.tricentis.com/login-16" : {
    "transaction" : "https://demowebshop.tricentis.com/login-16",
    "sampleCount" : 10,
    "errorCount" : 0,
    "errorPct" : 0.0,
    "meanResTime" : 165.39999999999998,
    "medianResTime" : 165.0,
    "minResTime" : 159.0,
    "maxResTime" : 170.0,
    "pct1ResTime" : 170.0,
    "pct2ResTime" : 170.0,
    "pct3ResTime" : 170.0,
    "throughput" : 0.7663422484481569,
    "receivedKBytesPerSec" : 0.09130249444401871,
    "sentKBytesPerSec" : 0.92724418537819
  },
  "https://demowebshop.tricentis.com/login-17" : {
    "transaction" : "https://demowebshop.tricentis.com/login-17",
    "sampleCount" : 10,
    "errorCount" : 0,
    "errorPct" : 0.0,
    "meanResTime" : 174.7,
    "medianResTime" : 166.5,
    "minResTime" : 162.0,
    "maxResTime" : 214.0,
    "pct1ResTime" : 212.20000000000002,
    "pct2ResTime" : 214.0,
    "pct3ResTime" : 214.0,
    "throughput" : 0.7688167909587145,
    "receivedKBytesPerSec" : 1.4850777465979856,
    "sentKBytesPerSec" : 0.8709252710079188
  },
  "https://demowebshop.tricentis.com/logout-19" : {
    "transaction" : "https://demowebshop.tricentis.com/logout-19",
    "sampleCount" : 10,
    "errorCount" : 0,
    "errorPct" : 0.0,
    "meanResTime" : 166.80000000000004,
    "medianResTime" : 164.0,
    "minResTime" : 159.0,
    "maxResTime" : 185.0,
    "pct1ResTime" : 183.70000000000002,
    "pct2ResTime" : 185.0,
    "pct3ResTime" : 185.0,
    "throughput" : 0.9295408068414204,
    "receivedKBytesPerSec" : 0.11256158207845325,
    "sentKBytesPerSec" : 0.8287800357873212
  },
  "https://demowebshop.tricentis.com/login-14" : {
    "transaction" : "https://demowebshop.tricentis.com/login-14",
    "sampleCount" : 10,
    "errorCount" : 0,
    "errorPct" : 0.0,
    "meanResTime" : 586.5,
    "medianResTime" : 332.0,
    "minResTime" : 324.0,
    "maxResTime" : 1333.0,
    "pct1ResTime" : 1290.5000000000002,
    "pct2ResTime" : 1333.0,
    "pct3ResTime" : 1333.0,
    "throughput" : 0.7641754546843955,
    "receivedKBytesPerSec" : 22.257356382775484,
    "sentKBytesPerSec" : 0.8723838930918538
  },
  "https://demowebshop.tricentis.com/logout-18" : {
    "transaction" : "https://demowebshop.tricentis.com/logout-18",
    "sampleCount" : 10,
    "errorCount" : 1,
    "errorPct" : 10.0,
    "meanResTime" : 201.7,
    "medianResTime" : 167.5,
    "minResTime" : 161.0,
    "maxResTime" : 521.0,
    "pct1ResTime" : 486.2000000000001,
    "pct2ResTime" : 521.0,
    "pct3ResTime" : 521.0,
    "throughput" : 0.8893632159373889,
    "receivedKBytesPerSec" : 0.43903623599252933,
    "sentKBytesPerSec" : 0.694120197438634
  },
  "https://demowebshop.tricentis.com/login-15" : {
    "transaction" : "https://demowebshop.tricentis.com/login-15",
    "sampleCount" : 10,
    "errorCount" : 0,
    "errorPct" : 0.0,
    "meanResTime" : 300.7,
    "medianResTime" : 165.5,
    "minResTime" : 162.0,
    "maxResTime" : 965.0,
    "pct1ResTime" : 940.2,
    "pct2ResTime" : 965.0,
    "pct3ResTime" : 965.0,
    "throughput" : 0.7663422484481569,
    "receivedKBytesPerSec" : 0.09205087554601886,
    "sentKBytesPerSec" : 0.9040443712161852
  },
  "https://demowebshop.tricentis.com/logout-17" : {
    "transaction" : "https://demowebshop.tricentis.com/logout-17",
    "sampleCount" : 10,
    "errorCount" : 0,
    "errorPct" : 0.0,
    "meanResTime" : 561.0,
    "medianResTime" : 169.5,
    "minResTime" : 161.0,
    "maxResTime" : 3090.0,
    "pct1ResTime" : 2849.100000000001,
    "pct2ResTime" : 3090.0,
    "pct3ResTime" : 3090.0,
    "throughput" : 0.888888888888889,
    "receivedKBytesPerSec" : 0.1076388888888889,
    "sentKBytesPerSec" : 0.7699652777777778
  },
  "https://demowebshop.tricentis.com/login-12" : {
    "transaction" : "https://demowebshop.tricentis.com/login-12",
    "sampleCount" : 20,
    "errorCount" : 0,
    "errorPct" : 0.0,
    "meanResTime" : 488.09999999999997,
    "medianResTime" : 652.5,
    "minResTime" : 165.0,
    "maxResTime" : 1247.0,
    "pct1ResTime" : 750.8000000000001,
    "pct2ResTime" : 1222.2999999999997,
    "pct3ResTime" : 1247.0,
    "throughput" : 1.2183978068839476,
    "receivedKBytesPerSec" : 4.515448903441974,
    "sentKBytesPerSec" : 1.1838924002436797
  },
  "https://demowebshop.tricentis.com/logout-16" : {
    "transaction" : "https://demowebshop.tricentis.com/logout-16",
    "sampleCount" : 10,
    "errorCount" : 1,
    "errorPct" : 10.0,
    "meanResTime" : 284.90000000000003,
    "medianResTime" : 166.0,
    "minResTime" : 160.0,
    "maxResTime" : 663.0,
    "pct1ResTime" : 661.1,
    "pct2ResTime" : 663.0,
    "pct3ResTime" : 663.0,
    "throughput" : 0.9296272194849865,
    "receivedKBytesPerSec" : 0.39681646253602304,
    "sentKBytesPerSec" : 0.7312643801710514
  },
  "https://demowebshop.tricentis.com/login-13" : {
    "transaction" : "https://demowebshop.tricentis.com/login-13",
    "sampleCount" : 10,
    "errorCount" : 0,
    "errorPct" : 0.0,
    "meanResTime" : 702.1,
    "medianResTime" : 671.5,
    "minResTime" : 167.0,
    "maxResTime" : 1670.0,
    "pct1ResTime" : 1600.8000000000002,
    "pct2ResTime" : 1670.0,
    "pct3ResTime" : 1670.0,
    "throughput" : 0.7668123610152595,
    "receivedKBytesPerSec" : 0.09285618434169159,
    "sentKBytesPerSec" : 0.9165804002760525
  },
  "https://demowebshop.tricentis.com/logout-15" : {
    "transaction" : "https://demowebshop.tricentis.com/logout-15",
    "sampleCount" : 10,
    "errorCount" : 1,
    "errorPct" : 10.0,
    "meanResTime" : 342.0,
    "medianResTime" : 175.5,
    "minResTime" : 162.0,
    "maxResTime" : 677.0,
    "pct1ResTime" : 676.1,
    "pct2ResTime" : 677.0,
    "pct3ResTime" : 677.0,
    "throughput" : 0.9320533134495294,
    "receivedKBytesPerSec" : 0.39867124149501354,
    "sentKBytesPerSec" : 0.7077779849007364
  },
  "https://demowebshop.tricentis.com/login-10" : {
    "transaction" : "https://demowebshop.tricentis.com/login-10",
    "sampleCount" : 20,
    "errorCount" : 0,
    "errorPct" : 0.0,
    "meanResTime" : 504.4500000000001,
    "medianResTime" : 660.5,
    "minResTime" : 165.0,
    "maxResTime" : 706.0,
    "pct1ResTime" : 704.1,
    "pct2ResTime" : 705.95,
    "pct3ResTime" : 706.0,
    "throughput" : 1.20962864400629,
    "receivedKBytesPerSec" : 2.3590121114067983,
    "sentKBytesPerSec" : 1.1735996658400871
  },
  "https://demowebshop.tricentis.com/logout-14" : {
    "transaction" : "https://demowebshop.tricentis.com/logout-14",
    "sampleCount" : 10,
    "errorCount" : 1,
    "errorPct" : 10.0,
    "meanResTime" : 206.2,
    "medianResTime" : 167.5,
    "minResTime" : 163.0,
    "maxResTime" : 564.0,
    "pct1ResTime" : 524.9000000000001,
    "pct2ResTime" : 564.0,
    "pct3ResTime" : 564.0,
    "throughput" : 0.9314456035767511,
    "receivedKBytesPerSec" : 0.39268072955476896,
    "sentKBytesPerSec" : 0.7449745598919523
  },
  "Total" : {
    "transaction" : "Total",
    "sampleCount" : 670,
    "errorCount" : 14,
    "errorPct" : 2.0895522,
    "meanResTime" : 612.8507462686567,
    "medianResTime" : 339.0,
    "minResTime" : 1.0,
    "maxResTime" : 5325.0,
    "pct1ResTime" : 1173.8,
    "pct2ResTime" : 2345.4999999999964,
    "pct3ResTime" : 3622.8899999999985,
    "throughput" : 28.615358332621508,
    "receivedKBytesPerSec" : 988.0962311544374,
    "sentKBytesPerSec" : 51.81687171670795
  },
  "https://demowebshop.tricentis.com/login-11" : {
    "transaction" : "https://demowebshop.tricentis.com/login-11",
    "sampleCount" : 20,
    "errorCount" : 0,
    "errorPct" : 0.0,
    "meanResTime" : 515.45,
    "medianResTime" : 651.5,
    "minResTime" : 166.0,
    "maxResTime" : 1270.0,
    "pct1ResTime" : 877.4000000000003,
    "pct2ResTime" : 1251.2499999999998,
    "pct3ResTime" : 1270.0,
    "throughput" : 1.2160272390101539,
    "receivedKBytesPerSec" : 0.923895695263574,
    "sentKBytesPerSec" : 1.1691199382866178
  },
  "https://demowebshop.tricentis.com/logout-13" : {
    "transaction" : "https://demowebshop.tricentis.com/logout-13",
    "sampleCount" : 10,
    "errorCount" : 0,
    "errorPct" : 0.0,
    "meanResTime" : 415.0,
    "medianResTime" : 411.5,
    "minResTime" : 160.0,
    "maxResTime" : 675.0,
    "pct1ResTime" : 674.7,
    "pct2ResTime" : 675.0,
    "pct3ResTime" : 675.0,
    "throughput" : 0.9005763688760806,
    "receivedKBytesPerSec" : 0.1090541696685879,
    "sentKBytesPerSec" : 0.7739328170028819
  }
}