{
  "posts": [
    {
      "id": 1,
      "title": "post 1 ",
      "content": "Build a simple blog post using JSON server for Mock APIs with CRUD Functionality \nCreate a db.json to be used with json-server file with 5 blog details. Each blog should have following parameters id, title, description, authorName that will server data for blogs CRUD Apis. Check Creating Demo APIs with json-server | egghead.io\nCreate a Home page, that should be server on / as well as /home which will list all the blogs.\nEach Blog on home page should have 3 options, Edit, Show and Delete Options. \nOn Clicking the Show button, it should navigate to /blog/:id page, This page should load the blog using REST API for that particular ID. If I refresh the Page, it should still works\nOn Click on Edit button, it should navigate to /blog/edit/:id Page, Load blog details for the ID using Rest Api, and the title, description and authorName should be in input box. You can Change the content in the text box and should be able to save the data using REST API\nOn Click the Delete Button on Home page, it should delete the blog and load the fresh list of blog using REST Api. \nCreate Dummy pages to be rendered on /about and /contact\n\nCheck this video to understand the assignment \n ",
      "author": "someone else"
    },
    {
      "id": 2,
      "title": "post 2",
      "content": "this is postt 2 hehe",
      "author": "me but not me"
    },
    {
      "id": 3,
      "title": "post 3",
      "content": "soemthakjsh laa hfhd belk hel khb wlkeh hkljh aluie bg absh dyipa tea btha ",
      "author": "me "
    },
    {
      "id": 4,
      "title": "post 4 ",
      "content": "soemthakjsh laa hfhd belk hel khb wlkeh hkljh aluie bg absh dyipa tea btha ",
      "author": "someone else but can be me"
    }
  ]
}