{
  "type": "sleep",
  "tracks": [
    {
      "name": "432 Hz background music",
      "lqurl": "https://gitlab.com/harsh.sadh313/mediasmr/-/raw/main/sleep/432%20hz%20background%20music.mp3",
      "hqurl": "https://gitlab.com/harsh.sadh313/mediasmr/-/raw/main/sleep/432%20hz%20background%20music.mp3",
      "isPremium": false
    },
    {
      "name": "Astral",
      "lqurl": "https://gitlab.com/harsh.sadh313/mediasmr/-/raw/main/sleep/astral.mp3",
      "hqurl": "https://gitlab.com/harsh.sadh313/mediasmr/-/raw/main/sleep/astral.mp3",
      "isPremium": false
    },
    {
      "name": "Celestial White Noise",
      "lqurl": "https://gitlab.com/harsh.sadh313/mediasmr/-/raw/main/sleep/celestial%20white%20noise.mp3",
      "hqurl": "https://gitlab.com/harsh.sadh313/mediasmr/-/raw/main/sleep/celestial%20white%20noise.mp3",
      "isPremium": true
    },
    {
      "name": "Deep Sleep Music",
      "lqurl": "https://gitlab.com/harsh.sadh313/mediasmr/-/raw/main/sleep/deep%20sleep.mp3",
      "hqurl": "https://gitlab.com/harsh.sadh313/mediasmr/-/raw/main/sleep/deep%20sleep.mp3",
      "isPremium": true
    },
    {
      "name": "Etherial Sleep",
      "lqurl": "https://gitlab.com/harsh.sadh313/mediasmr/-/raw/main/sleep/etherial%20sleep.mp3",
      "hqurl": "https://gitlab.com/harsh.sadh313/mediasmr/-/raw/main/sleep/etherial%20sleep.mp3",
      "isPremium": true
    },
    {
      "name": "Healing with Delta range",
      "lqurl": "https://gitlab.com/harsh.sadh313/mediasmr/-/raw/main/sleep/healing%20with%20delta%20range.mp3",
      "hqurl": "https://gitlab.com/harsh.sadh313/mediasmr/-/raw/main/sleep/healing%20with%20delta%20range.mp3",
      "isPremium": true
    },
    {
      "name": "IsoChronic Tunes",
      "lqurl": "https://gitlab.com/harsh.sadh313/mediasmr/-/raw/main/sleep/Isochronic%20tunes.mp3",
      "hqurl": "https://gitlab.com/harsh.sadh313/mediasmr/-/raw/main/sleep/Isochronic%20tunes.mp3",
      "isPremium": true
    },
    {
      "name": "Music for Insomaniacs",
      "lqurl": "https://gitlab.com/harsh.sadh313/mediasmr/-/raw/main/sleep/music%20for%20insomniac.mp3",
      "hqurl": "https://gitlab.com/harsh.sadh313/mediasmr/-/raw/main/sleep/music%20for%20insomniac.mp3",
      "isPremium": true
    },
    {
      "name": "Raad Bhairavi for Sleep",
      "lqurl": "https://gitlab.com/harsh.sadh313/mediasmr/-/raw/main/sleep/Raag%20Bhairavi.mp3",
      "hqurl": "https://gitlab.com/harsh.sadh313/mediasmr/-/raw/main/sleep/Raag%20Bhairavi.mp3",
      "isPremium": true
    },
    {
      "name": "Shamanic Sleep",
      "lqurl": "https://gitlab.com/harsh.sadh313/mediasmr/-/raw/main/sleep/shamanic%20sleep.mp3",
      "hqurl": "https://gitlab.com/harsh.sadh313/mediasmr/-/raw/main/sleep/shamanic%20sleep.mp3",
      "isPremium": true
    },
    {
      "name": "Sleep and Anxiety Treatment",
      "lqurl": "https://gitlab.com/harsh.sadh313/mediasmr/-/raw/main/sleep/sleep%20and%20anxiety%20treatment.mp3",
      "hqurl": "https://gitlab.com/harsh.sadh313/mediasmr/-/raw/main/sleep/sleep%20and%20anxiety%20treatment.mp3",
      "isPremium": true
    },
    {
      "name": "Sleep with Nature",
      "lqurl": "https://gitlab.com/harsh.sadh313/mediasmr/-/raw/main/sleep/sleep%20with%20nature.mp3",
      "hqurl": "https://gitlab.com/harsh.sadh313/mediasmr/-/raw/main/sleep/sleep%20with%20nature.mp3",
      "isPremium": true
    },
    {
      "name": "Sleep with Piano Sound",
      "lqurl": "https://gitlab.com/harsh.sadh313/mediasmr/-/raw/main/sleep/sleep%20with%20piano%20sounds.mp3",
      "hqurl": "https://gitlab.com/harsh.sadh313/mediasmr/-/raw/main/sleep/sleep%20with%20piano%20sounds.mp3",
      "isPremium": true
    },
    {
      "name": "Sleep with Rain",
      "lqurl": "https://gitlab.com/harsh.sadh313/mediasmr/-/raw/main/sleep/sleep%20with%20rain.mp3",
      "hqurl": "https://gitlab.com/harsh.sadh313/mediasmr/-/raw/main/sleep/sleep%20with%20rain.mp3",
      "isPremium": true
    },
    {
      "name": "Sound Sleep",
      "lqurl": "https://gitlab.com/harsh.sadh313/mediasmr/-/raw/main/sleep/sleep.mp3",
      "hqurl": "https://gitlab.com/harsh.sadh313/mediasmr/-/raw/main/sleep/sleep.mp3",
      "isPremium": true
    },
    {
      "name": "Soothing Instrumental Mix",
      "lqurl": "https://gitlab.com/harsh.sadh313/mediasmr/-/raw/main/sleep/soothing%20instrumental%20mix.mp3",
      "hqurl": "https://gitlab.com/harsh.sadh313/mediasmr/-/raw/main/sleep/soothing%20instrumental%20mix.mp3",
      "isPremium": true
    },
    {
      "name": "Tibetan Beats",
      "lqurl": "https://gitlab.com/harsh.sadh313/mediasmr/-/raw/main/sleep/Tibetan%20beats.mp3",
      "hqurl": "https://gitlab.com/harsh.sadh313/mediasmr/-/raw/main/sleep/Tibetan%20beats.mp3",
      "isPremium": true
    }
  ]
}
