{
  "type": "meditation",
  "playlist": [
    {
      "name": "5 minute Meditation",
      "image": "https://gitlab.com/harsh.sadh313/mediasmr/-/raw/main/meditation/5min/5min.jpg",
      "tracks": [
        {
          "name": "Hypnotic Meditation",
          "lqurl": "https://gitlab.com/harsh.sadh313/mediasmr/-/raw/main/meditation/5min/hypnotic%20meditation/Hypnotic%20Meditation.mp3",
          "hqurl": "https://gitlab.com/harsh.sadh313/mediasmr/-/raw/main/meditation/5min/hypnotic%20meditation/Hypnotic%20Meditation.wav",
          "isPremium": false
        },
        {
          "name": "Mindful Meditation",
          "lqurl": "https://gitlab.com/harsh.sadh313/mediasmr/-/raw/main/meditation/5min/midfull%20meditation/Item.mp3",
          "hqurl": "https://gitlab.com/harsh.sadh313/mediasmr/-/raw/main/meditation/5min/midfull%20meditation/Item.wav",
          "isPremium": false
        },
        {
          "name": "Track 1",
          "lqurl": "https://gitlab.com/harsh.sadh313/mediasmr/-/raw/main/meditation/5min/track%201.mp3",
          "hqurl": "https://gitlab.com/harsh.sadh313/mediasmr/-/raw/main/meditation/5min/track%201.mp3",
          "isPremium": false
        },
        {
          "name": "Track 2",
          "lqurl": "https://gitlab.com/harsh.sadh313/mediasmr/-/raw/main/meditation/5min/track%202.mp3",
          "hqurl": "https://gitlab.com/harsh.sadh313/mediasmr/-/raw/main/meditation/5min/track%202.mp3",
          "isPremium": false
        },
        {
          "name": "Track 3",
          "lqurl": "https://gitlab.com/harsh.sadh313/mediasmr/-/raw/main/meditation/5min/track%203.mp3",
          "hqurl": "https://gitlab.com/harsh.sadh313/mediasmr/-/raw/main/meditation/5min/track%203.mp3",
          "isPremium": true
        },
        {
          "name": "Track 4",
          "lqurl": "https://gitlab.com/harsh.sadh313/mediasmr/-/raw/main/meditation/5min/track%204.mp3",
          "hqurl": "https://gitlab.com/harsh.sadh313/mediasmr/-/raw/main/meditation/5min/track%204.mp3",
          "isPremium": true
        },
        {
          "name": "Track 5",
          "lqurl": "https://gitlab.com/harsh.sadh313/mediasmr/-/raw/main/meditation/5min/track%205.mp3",
          "hqurl": "https://gitlab.com/harsh.sadh313/mediasmr/-/raw/main/meditation/5min/track%205.mp3",
          "isPremium": true
        },
        {
          "name": "Track 6",
          "lqurl": "https://gitlab.com/harsh.sadh313/mediasmr/-/raw/main/meditation/5min/track%206.mp3",
          "hqurl": "https://gitlab.com/harsh.sadh313/mediasmr/-/raw/main/meditation/5min/track%206.mp3",
          "isPremium": true
        },
        {
          "name": "Track 7",
          "lqurl": "https://gitlab.com/harsh.sadh313/mediasmr/-/raw/main/meditation/5min/track%207.mp3",
          "hqurl": "https://gitlab.com/harsh.sadh313/mediasmr/-/raw/main/meditation/5min/track%207.mp3",
          "isPremium": true
        },
        {
          "name": "Track 8",
          "lqurl": "https://gitlab.com/harsh.sadh313/mediasmr/-/raw/main/meditation/5min/track%208.mp3",
          "hqurl": "https://gitlab.com/harsh.sadh313/mediasmr/-/raw/main/meditation/5min/track%208.mp3",
          "isPremium": true
        }
      ]
    },
    {
      "name": "10 minute Meditation",
      "image": "https://gitlab.com/harsh.sadh313/mediasmr/-/raw/main/meditation/10min/10min.jpg",
      "tracks": [
        {
          "name": "Ambient Meditation",
          "lqurl": "https://gitlab.com/harsh.sadh313/mediasmr/-/raw/main/meditation/10min/ambient%20meditation/Ambient%20Meditation%20Music-With%20SoundFX.mp3",
          "hqurl": "https://gitlab.com/harsh.sadh313/mediasmr/-/raw/main/meditation/10min/ambient%20meditation/Ambient%20Meditation%20Music-With%20SoundFX.wav",
          "isPremium": false
        },
         {
          "name": "Guided Meditation",
          "lqurl": "https://gitlab.com/harsh.sadh313/mediasmr/-/raw/main/meditation/10min/guided%20meditation.mp3",
          "hqurl": "https://gitlab.com/harsh.sadh313/mediasmr/-/raw/main/meditation/10min/guided%20meditation.mp3",
          "isPremium": false
        },
        {
          "name": "Healing Meditation",
          "lqurl": "https://gitlab.com/harsh.sadh313/mediasmr/-/raw/main/meditation/10min/healing%20meditation/Healing%20Music%20for%20Meditation.mp3",
          "hqurl": "https://gitlab.com/harsh.sadh313/mediasmr/-/raw/main/meditation/10min/healing%20meditation/Healing%20Music%20for%20Meditation.wav",
          "isPremium": false
        },
        {
          "name": "Meditation Track",
          "lqurl": "https://gitlab.com/harsh.sadh313/mediasmr/-/raw/main/meditation/10min/meditation%20track/full.mp3",
          "hqurl": "https://gitlab.com/harsh.sadh313/mediasmr/-/raw/main/meditation/10min/meditation%20track/full.wav",
          "isPremium": true
        },
        {
          "name": "Mindful Meditation",
          "lqurl": "https://gitlab.com/harsh.sadh313/mediasmr/-/raw/main/meditation/10min/mindfull%20meditation/Item%20version%202.mp3",
          "hqurl": "https://gitlab.com/harsh.sadh313/mediasmr/-/raw/main/meditation/10min/mindfull%20meditation/Item%20version%202.wav",
          "isPremium": true
        },
        {
          "name": "Peaceful Meditation",
          "lqurl": "https://gitlab.com/harsh.sadh313/mediasmr/-/raw/main/meditation/10min/peaceful%20meditation/Peaceful%20Meditation.mp3",
          "hqurl": "https://gitlab.com/harsh.sadh313/mediasmr/-/raw/main/meditation/10min/peaceful%20meditation/Peaceful%20Meditation.wav",
          "isPremium": true
        },
       
        {
          "name": "Track 1",
          "lqurl": "https://gitlab.com/harsh.sadh313/mediasmr/-/raw/main/meditation/10min/track%201.mp3",
          "hqurl": "https://gitlab.com/harsh.sadh313/mediasmr/-/raw/main/meditation/10min/track%201.mp3",
          "isPremium": true
        },
        {
          "name": "Track 2",
          "lqurl": "https://gitlab.com/harsh.sadh313/mediasmr/-/raw/main/meditation/10min/track%202.mp3",
          "hqurl": "https://gitlab.com/harsh.sadh313/mediasmr/-/raw/main/meditation/10min/track%202.mp3",
          "isPremium": true
        },
        {
          "name": "Track 3",
          "lqurl": "https://gitlab.com/harsh.sadh313/mediasmr/-/raw/main/meditation/10min/track%203.mp3",
          "hqurl": "https://gitlab.com/harsh.sadh313/mediasmr/-/raw/main/meditation/10min/track%203.mp3",
          "isPremium": true
        }
      ]
    },
    {
      "name": "15 minute Meditation",
      "image": "https://gitlab.com/harsh.sadh313/mediasmr/-/raw/main/meditation/15min/15min.jpg",
      "tracks": [
        {
          "name": "Calm Meditation",
          "lqurl": "https://gitlab.com/harsh.sadh313/mediasmr/-/raw/main/meditation/15min/calm%20meditation/Calm%20Meditation.mp3",
          "hqurl": "https://gitlab.com/harsh.sadh313/mediasmr/-/raw/main/meditation/15min/calm%20meditation/Calm%20Meditation.wav",
          "isPremium": false
        },
        {
          "name": "Piano Meditation",
          "lqurl": "https://gitlab.com/harsh.sadh313/mediasmr/-/raw/main/meditation/15min/piano%20meditation/piano%20for%20meditation.mp3",
          "hqurl": "https://gitlab.com/harsh.sadh313/mediasmr/-/raw/main/meditation/15min/piano%20meditation/piano%20for%20meditation.wav",
          "isPremium": false
        },
        {
          "name": "Track 1",
          "lqurl": "https://gitlab.com/harsh.sadh313/mediasmr/-/raw/main/meditation/15min/track%201.mp3",
          "hqurl": "https://gitlab.com/harsh.sadh313/mediasmr/-/raw/main/meditation/15min/track%201.mp3",
          "isPremium": true
        },
        {
          "name": "Track 2",
          "lqurl": "https://gitlab.com/harsh.sadh313/mediasmr/-/raw/main/meditation/15min/track%202.mp3",
          "hqurl": "https://gitlab.com/harsh.sadh313/mediasmr/-/raw/main/meditation/15min/track%202.mp3",
          "isPremium": true
        },
        {
          "name": "Track 3",
          "lqurl": "https://gitlab.com/harsh.sadh313/mediasmr/-/raw/main/meditation/15min/track%203.mp3",
          "hqurl": "https://gitlab.com/harsh.sadh313/mediasmr/-/raw/main/meditation/15min/track%203.mp3",
          "isPremium": true
        },
        {
          "name": "Track 4",
          "lqurl": "https://gitlab.com/harsh.sadh313/mediasmr/-/raw/main/meditation/15min/track%204.mp3",
          "hqurl": "https://gitlab.com/harsh.sadh313/mediasmr/-/raw/main/meditation/15min/track%204.mp3",
          "isPremium": true
        }
      ]
    }
  ]
}
