{
 "add_total_row": 1, 
 "apply_user_permissions": 1, 
 "creation": "2018-03-22 17:25:43.903124", 
 "disabled": 0, 
 "docstatus": 0, 
 "doctype": "Report", 
 "idx": 0, 
 "is_standard": "Yes", 
 "modified": "2018-04-17 21:12:55.215454", 
 "modified_by": "Administrator", 
 "module": "Meter Reports", 
 "name": "Water Customer", 
 "owner": "Administrator", 
 "ref_doctype": "Meter", 
 "report_name": "Water Customer", 
 "report_type": "Script Report", 
 "roles": [
  {
   "role": "Sales Master Manager"
  }, 
  {
   "role": "Administrator"
  }, 
  {
   "role": "Employee"
  }, 
  {
   "role": "System Manager"
  }, 
  {
   "role": "All"
  }
 ]
}