-- Merging decision tree log ---
manifest
ADDED from /home/harry_setiawan/Documents/git_MNC/Raptor/app/src/main/AndroidManifest.xml:2:1-163:12
	package
		ADDED from /home/harry_setiawan/Documents/git_MNC/Raptor/app/src/main/AndroidManifest.xml:3:5-31
		INJECTED from /home/harry_setiawan/Documents/git_MNC/Raptor/app/src/main/AndroidManifest.xml
		INJECTED from /home/harry_setiawan/Documents/git_MNC/Raptor/app/src/main/AndroidManifest.xml
	android:versionName
		INJECTED from /home/harry_setiawan/Documents/git_MNC/Raptor/app/src/main/AndroidManifest.xml
		INJECTED from /home/harry_setiawan/Documents/git_MNC/Raptor/app/src/main/AndroidManifest.xml
	xmlns:android
		ADDED from /home/harry_setiawan/Documents/git_MNC/Raptor/app/src/main/AndroidManifest.xml:2:11-69
	android:versionCode
		INJECTED from /home/harry_setiawan/Documents/git_MNC/Raptor/app/src/main/AndroidManifest.xml
		INJECTED from /home/harry_setiawan/Documents/git_MNC/Raptor/app/src/main/AndroidManifest.xml
uses-permission#android.permission.INTERNET
ADDED from /home/harry_setiawan/Documents/git_MNC/Raptor/app/src/main/AndroidManifest.xml:5:5-67
MERGED from [Raptor:googlemapssdkm4b_lib:unspecified] /home/harry_setiawan/Documents/git_MNC/Raptor/googlemapssdkm4b_lib/build/intermediates/bundles/default/AndroidManifest.xml:11:5-67
MERGED from [com.google.android.gms:play-services-ads-lite:10.2.1] /home/harry_setiawan/.android/build-cache/143e6b6c0c3ee2c1dc9713e7188e7b43127d84e0/output/AndroidManifest.xml:19:5-66
MERGED from [com.google.android.gms:play-services-analytics:10.2.1] /home/harry_setiawan/.android/build-cache/ae66a51f97fbf7801b60ed216c0cbed13ee4773e/output/AndroidManifest.xml:20:5-66
MERGED from [com.google.android.gms:play-services-appinvite:10.2.1] /home/harry_setiawan/.android/build-cache/3fe3f1828d09dcd0ed9ceeed0992745e309aedbe/output/AndroidManifest.xml:18:5-66
MERGED from [com.google.android.gms:play-services-gcm:10.2.1] /home/harry_setiawan/.android/build-cache/deb0b6cf45e78a4d4892286d6fb77dae3383371a/output/AndroidManifest.xml:21:5-66
MERGED from [com.google.android.gms:play-services-iid:10.2.1] /home/harry_setiawan/.android/build-cache/43207882768d00971f2de24976d184186dff9ae7/output/AndroidManifest.xml:21:5-66
MERGED from [com.google.android.gms:play-services-tagmanager-api:10.2.1] /home/harry_setiawan/.android/build-cache/cc78923e659bcf22762714b2d11e9b60189e2b34/output/AndroidManifest.xml:20:5-66
MERGED from [com.google.android.gms:play-services-analytics-impl:10.2.1] /home/harry_setiawan/.android/build-cache/245c14990409eb2fabbb739cc15f6b6c2aed4b23/output/AndroidManifest.xml:20:5-66
MERGED from [com.google.android.gms:play-services-maps:10.2.1] /home/harry_setiawan/.android/build-cache/346f9a4f86a7e8cbb5b06ddcde1eece87edbca83/output/AndroidManifest.xml:20:5-66
MERGED from [com.google.firebase:firebase-crash:10.2.1] /home/harry_setiawan/.android/build-cache/549f7e9d2bbe906aa2c5fc69f868b019a9d46f5d/output/AndroidManifest.xml:18:5-66
MERGED from [org.osmdroid:osmdroid-android:5.6.4] /home/harry_setiawan/.android/build-cache/a2c220f32126867315c402f5f152625fb52599f6/output/AndroidManifest.xml:20:5-67
MERGED from [com.google.firebase:firebase-analytics:10.2.1] /home/harry_setiawan/.android/build-cache/834ef20128b5b247debe7898d2270bf7da24c64e/output/AndroidManifest.xml:20:5-66
MERGED from [com.google.firebase:firebase-analytics-impl:10.2.1] /home/harry_setiawan/.android/build-cache/80eeec0bddad5ab33ad7d955bdbf1d1d94500053/output/AndroidManifest.xml:20:5-66
MERGED from [com.google.firebase:firebase-iid:10.2.1] /home/harry_setiawan/.android/build-cache/17da2f9da2d533fa88c07d3346a165da1a3664cb/output/AndroidManifest.xml:20:5-66
	android:name
		ADDED from /home/harry_setiawan/Documents/git_MNC/Raptor/app/src/main/AndroidManifest.xml:5:22-64
uses-permission#android.permission.ACCESS_WIFI_STATE
ADDED from /home/harry_setiawan/Documents/git_MNC/Raptor/app/src/main/AndroidManifest.xml:6:5-76
MERGED from [org.osmdroid:osmdroid-android:5.6.4] /home/harry_setiawan/.android/build-cache/a2c220f32126867315c402f5f152625fb52599f6/output/AndroidManifest.xml:18:5-76
	android:name
		ADDED from /home/harry_setiawan/Documents/git_MNC/Raptor/app/src/main/AndroidManifest.xml:6:22-73
uses-permission#android.permission.ACCESS_NETWORK_STATE
ADDED from /home/harry_setiawan/Documents/git_MNC/Raptor/app/src/main/AndroidManifest.xml:7:5-79
MERGED from [Raptor:googlemapssdkm4b_lib:unspecified] /home/harry_setiawan/Documents/git_MNC/Raptor/googlemapssdkm4b_lib/build/intermediates/bundles/default/AndroidManifest.xml:12:5-79
MERGED from [com.google.android.gms:play-services-ads-lite:10.2.1] /home/harry_setiawan/.android/build-cache/143e6b6c0c3ee2c1dc9713e7188e7b43127d84e0/output/AndroidManifest.xml:20:5-78
MERGED from [com.google.android.gms:play-services-analytics:10.2.1] /home/harry_setiawan/.android/build-cache/ae66a51f97fbf7801b60ed216c0cbed13ee4773e/output/AndroidManifest.xml:21:5-78
MERGED from [com.google.android.gms:play-services-nearby:10.2.1] /home/harry_setiawan/.android/build-cache/339a4e32820b15a6b424aa4088b24a185556e228/output/AndroidManifest.xml:4:5-78
MERGED from [com.google.android.gms:play-services-tagmanager-api:10.2.1] /home/harry_setiawan/.android/build-cache/cc78923e659bcf22762714b2d11e9b60189e2b34/output/AndroidManifest.xml:21:5-78
MERGED from [com.google.android.gms:play-services-analytics-impl:10.2.1] /home/harry_setiawan/.android/build-cache/245c14990409eb2fabbb739cc15f6b6c2aed4b23/output/AndroidManifest.xml:21:5-78
MERGED from [com.google.android.gms:play-services-maps:10.2.1] /home/harry_setiawan/.android/build-cache/346f9a4f86a7e8cbb5b06ddcde1eece87edbca83/output/AndroidManifest.xml:19:5-78
MERGED from [org.osmdroid:osmdroid-android:5.6.4] /home/harry_setiawan/.android/build-cache/a2c220f32126867315c402f5f152625fb52599f6/output/AndroidManifest.xml:19:5-79
MERGED from [com.google.firebase:firebase-analytics:10.2.1] /home/harry_setiawan/.android/build-cache/834ef20128b5b247debe7898d2270bf7da24c64e/output/AndroidManifest.xml:21:5-78
MERGED from [com.google.firebase:firebase-analytics-impl:10.2.1] /home/harry_setiawan/.android/build-cache/80eeec0bddad5ab33ad7d955bdbf1d1d94500053/output/AndroidManifest.xml:21:5-78
MERGED from [com.google.firebase:firebase-iid:10.2.1] /home/harry_setiawan/.android/build-cache/17da2f9da2d533fa88c07d3346a165da1a3664cb/output/AndroidManifest.xml:19:5-78
	android:name
		ADDED from /home/harry_setiawan/Documents/git_MNC/Raptor/app/src/main/AndroidManifest.xml:7:22-76
uses-permission#android.permission.READ_PHONE_STATE
ADDED from /home/harry_setiawan/Documents/git_MNC/Raptor/app/src/main/AndroidManifest.xml:8:5-75
	android:name
		ADDED from /home/harry_setiawan/Documents/git_MNC/Raptor/app/src/main/AndroidManifest.xml:8:22-72
uses-permission#android.permission.SET_DEBUG_APP
ADDED from /home/harry_setiawan/Documents/git_MNC/Raptor/app/src/main/AndroidManifest.xml:9:5-72
	android:name
		ADDED from /home/harry_setiawan/Documents/git_MNC/Raptor/app/src/main/AndroidManifest.xml:9:22-69
uses-permission#android.permission.WRITE_EXTERNAL_STORAGE
ADDED from /home/harry_setiawan/Documents/git_MNC/Raptor/app/src/main/AndroidManifest.xml:10:5-81
MERGED from [org.osmdroid:osmdroid-android:5.6.4] /home/harry_setiawan/.android/build-cache/a2c220f32126867315c402f5f152625fb52599f6/output/AndroidManifest.xml:21:5-81
	android:name
		ADDED from /home/harry_setiawan/Documents/git_MNC/Raptor/app/src/main/AndroidManifest.xml:10:22-78
uses-permission#android.permission.READ_EXTERNAL_STORAGE
ADDED from /home/harry_setiawan/Documents/git_MNC/Raptor/app/src/main/AndroidManifest.xml:11:5-80
MERGED from [org.osmdroid:osmdroid-android:5.6.4] /home/harry_setiawan/.android/build-cache/a2c220f32126867315c402f5f152625fb52599f6/output/AndroidManifest.xml:22:5-80
	android:name
		ADDED from /home/harry_setiawan/Documents/git_MNC/Raptor/app/src/main/AndroidManifest.xml:11:22-77
uses-permission#android.permission.RECEIVE_BOOT_COMPLETED
ADDED from /home/harry_setiawan/Documents/git_MNC/Raptor/app/src/main/AndroidManifest.xml:12:5-81
	android:name
		ADDED from /home/harry_setiawan/Documents/git_MNC/Raptor/app/src/main/AndroidManifest.xml:12:22-78
permission#myskysfa.com.sfa.permission.C2D_MESSAGE
ADDED from /home/harry_setiawan/Documents/git_MNC/Raptor/app/src/main/AndroidManifest.xml:14:5-16:47
MERGED from [com.google.firebase:firebase-iid:10.2.1] /home/harry_setiawan/.android/build-cache/17da2f9da2d533fa88c07d3346a165da1a3664cb/output/AndroidManifest.xml:24:5-109
	android:protectionLevel
		ADDED from /home/harry_setiawan/Documents/git_MNC/Raptor/app/src/main/AndroidManifest.xml:16:9-44
	android:name
		ADDED from /home/harry_setiawan/Documents/git_MNC/Raptor/app/src/main/AndroidManifest.xml:15:9-63
uses-permission#myskysfa.com.sfa.permission.C2D_MESSAGE
ADDED from /home/harry_setiawan/Documents/git_MNC/Raptor/app/src/main/AndroidManifest.xml:18:5-79
MERGED from [com.google.firebase:firebase-iid:10.2.1] /home/harry_setiawan/.android/build-cache/17da2f9da2d533fa88c07d3346a165da1a3664cb/output/AndroidManifest.xml:26:5-78
	android:name
		ADDED from /home/harry_setiawan/Documents/git_MNC/Raptor/app/src/main/AndroidManifest.xml:18:22-76
uses-permission#android.permission.WAKE_LOCK
ADDED from /home/harry_setiawan/Documents/git_MNC/Raptor/app/src/main/AndroidManifest.xml:19:5-68
MERGED from [com.google.android.gms:play-services-analytics:10.2.1] /home/harry_setiawan/.android/build-cache/ae66a51f97fbf7801b60ed216c0cbed13ee4773e/output/AndroidManifest.xml:24:5-67
MERGED from [com.google.android.gms:play-services-analytics-impl:10.2.1] /home/harry_setiawan/.android/build-cache/245c14990409eb2fabbb739cc15f6b6c2aed4b23/output/AndroidManifest.xml:24:5-67
MERGED from [com.google.firebase:firebase-analytics:10.2.1] /home/harry_setiawan/.android/build-cache/834ef20128b5b247debe7898d2270bf7da24c64e/output/AndroidManifest.xml:22:5-67
MERGED from [com.google.firebase:firebase-analytics-impl:10.2.1] /home/harry_setiawan/.android/build-cache/80eeec0bddad5ab33ad7d955bdbf1d1d94500053/output/AndroidManifest.xml:22:5-67
MERGED from [com.google.firebase:firebase-iid:10.2.1] /home/harry_setiawan/.android/build-cache/17da2f9da2d533fa88c07d3346a165da1a3664cb/output/AndroidManifest.xml:21:5-67
	android:name
		ADDED from /home/harry_setiawan/Documents/git_MNC/Raptor/app/src/main/AndroidManifest.xml:19:22-65
uses-permission#com.google.android.c2dm.permission.RECEIVE
ADDED from /home/harry_setiawan/Documents/git_MNC/Raptor/app/src/main/AndroidManifest.xml:20:5-82
MERGED from [com.google.android.gms:play-services-gcm:10.2.1] /home/harry_setiawan/.android/build-cache/deb0b6cf45e78a4d4892286d6fb77dae3383371a/output/AndroidManifest.xml:20:5-81
MERGED from [com.google.android.gms:play-services-iid:10.2.1] /home/harry_setiawan/.android/build-cache/43207882768d00971f2de24976d184186dff9ae7/output/AndroidManifest.xml:20:5-81
MERGED from [com.google.firebase:firebase-iid:10.2.1] /home/harry_setiawan/.android/build-cache/17da2f9da2d533fa88c07d3346a165da1a3664cb/output/AndroidManifest.xml:22:5-81
	android:name
		ADDED from /home/harry_setiawan/Documents/git_MNC/Raptor/app/src/main/AndroidManifest.xml:20:22-79
uses-permission#android.permission.ACCESS_LOCATION
ADDED from /home/harry_setiawan/Documents/git_MNC/Raptor/app/src/main/AndroidManifest.xml:21:5-74
	android:name
		ADDED from /home/harry_setiawan/Documents/git_MNC/Raptor/app/src/main/AndroidManifest.xml:21:22-71
uses-permission#android.permission.ACCESS_COARSE_LOCATION
ADDED from /home/harry_setiawan/Documents/git_MNC/Raptor/app/src/main/AndroidManifest.xml:22:5-81
MERGED from [Raptor:googlemapssdkm4b_lib:unspecified] /home/harry_setiawan/Documents/git_MNC/Raptor/googlemapssdkm4b_lib/build/intermediates/bundles/default/AndroidManifest.xml:14:5-81
MERGED from [org.osmdroid:osmdroid-android:5.6.4] /home/harry_setiawan/.android/build-cache/a2c220f32126867315c402f5f152625fb52599f6/output/AndroidManifest.xml:17:5-81
	android:name
		ADDED from /home/harry_setiawan/Documents/git_MNC/Raptor/app/src/main/AndroidManifest.xml:22:22-78
uses-permission#android.permission.ACCESS_FINE_LOCATION
ADDED from /home/harry_setiawan/Documents/git_MNC/Raptor/app/src/main/AndroidManifest.xml:23:5-79
MERGED from [Raptor:googlemapssdkm4b_lib:unspecified] /home/harry_setiawan/Documents/git_MNC/Raptor/googlemapssdkm4b_lib/build/intermediates/bundles/default/AndroidManifest.xml:15:5-79
MERGED from [org.osmdroid:osmdroid-android:5.6.4] /home/harry_setiawan/.android/build-cache/a2c220f32126867315c402f5f152625fb52599f6/output/AndroidManifest.xml:16:5-79
	android:name
		ADDED from /home/harry_setiawan/Documents/git_MNC/Raptor/app/src/main/AndroidManifest.xml:23:22-76
uses-permission#android.permission.ACCESS_GPS
ADDED from /home/harry_setiawan/Documents/git_MNC/Raptor/app/src/main/AndroidManifest.xml:24:5-69
	android:name
		ADDED from /home/harry_setiawan/Documents/git_MNC/Raptor/app/src/main/AndroidManifest.xml:24:22-66
uses-permission#android.permission.ACCESS_ASSISTED_GPS
ADDED from /home/harry_setiawan/Documents/git_MNC/Raptor/app/src/main/AndroidManifest.xml:25:5-78
	android:name
		ADDED from /home/harry_setiawan/Documents/git_MNC/Raptor/app/src/main/AndroidManifest.xml:25:22-75
permission#myskysfa.com.sfa.permission.MAPS_RECEIVE
ADDED from /home/harry_setiawan/Documents/git_MNC/Raptor/app/src/main/AndroidManifest.xml:28:5-30:47
	android:protectionLevel
		ADDED from /home/harry_setiawan/Documents/git_MNC/Raptor/app/src/main/AndroidManifest.xml:30:9-44
	android:name
		ADDED from /home/harry_setiawan/Documents/git_MNC/Raptor/app/src/main/AndroidManifest.xml:29:9-64
uses-permission#com.arshad.map.permission.MAPS_RECEIVE
ADDED from /home/harry_setiawan/Documents/git_MNC/Raptor/app/src/main/AndroidManifest.xml:33:5-78
	android:name
		ADDED from /home/harry_setiawan/Documents/git_MNC/Raptor/app/src/main/AndroidManifest.xml:33:22-75
uses-feature#0x00020000
ADDED from /home/harry_setiawan/Documents/git_MNC/Raptor/app/src/main/AndroidManifest.xml:36:5-38:35
MERGED from [Raptor:googlemapssdkm4b_lib:unspecified] /home/harry_setiawan/Documents/git_MNC/Raptor/googlemapssdkm4b_lib/build/intermediates/bundles/default/AndroidManifest.xml:17:5-19:35
MERGED from [com.google.android.gms:play-services-maps:10.2.1] /home/harry_setiawan/.android/build-cache/346f9a4f86a7e8cbb5b06ddcde1eece87edbca83/output/AndroidManifest.xml:21:5-77
	android:glEsVersion
		ADDED from /home/harry_setiawan/Documents/git_MNC/Raptor/app/src/main/AndroidManifest.xml:37:9-41
	android:required
		ADDED from /home/harry_setiawan/Documents/git_MNC/Raptor/app/src/main/AndroidManifest.xml:38:9-32
application
ADDED from /home/harry_setiawan/Documents/git_MNC/Raptor/app/src/main/AndroidManifest.xml:40:5-162:19
MERGED from [Raptor:googlemapssdkm4b_lib:unspecified] /home/harry_setiawan/Documents/git_MNC/Raptor/googlemapssdkm4b_lib/build/intermediates/bundles/default/AndroidManifest.xml:21:5-20
MERGED from [com.android.volley:volley:1.0.0] /home/harry_setiawan/.android/build-cache/83d9bc1855c916f585e4af8b66729d89590381ee/output/AndroidManifest.xml:9:5-20
MERGED from [com.android.support:design:25.3.1] /home/harry_setiawan/.android/build-cache/9a266c852ab5c6d8766ab417a69864cfbe13c63d/output/AndroidManifest.xml:29:5-20
MERGED from [com.android.support:transition:25.3.1] /home/harry_setiawan/.android/build-cache/cd5540c7ae3ae2cd079638c258fb02cae63b1695/output/AndroidManifest.xml:26:5-20
MERGED from [com.android.support:cardview-v7:25.3.1] /home/harry_setiawan/.android/build-cache/69ee0754ebe800efe5629a40c5fca8765bed5fdd/output/AndroidManifest.xml:26:5-20
MERGED from [com.google.android.gms:play-services:10.2.1] /home/harry_setiawan/.android/build-cache/e826f2b996e4d8b33d9ea8b40710d4682a73875e/output/AndroidManifest.xml:5:5-20
MERGED from [com.google.android.gms:play-services-ads-lite:10.2.1] /home/harry_setiawan/.android/build-cache/143e6b6c0c3ee2c1dc9713e7188e7b43127d84e0/output/AndroidManifest.xml:23:5-27:19
MERGED from [com.google.android.gms:play-services-analytics:10.2.1] /home/harry_setiawan/.android/build-cache/ae66a51f97fbf7801b60ed216c0cbed13ee4773e/output/AndroidManifest.xml:26:5-19
MERGED from [com.google.android.gms:play-services-appinvite:10.2.1] /home/harry_setiawan/.android/build-cache/3fe3f1828d09dcd0ed9ceeed0992745e309aedbe/output/AndroidManifest.xml:19:5-26:19
MERGED from [com.google.android.gms:play-services-auth:10.2.1] /home/harry_setiawan/.android/build-cache/3e610fad5124839d4eea4bd6a8671d8c361163d7/output/AndroidManifest.xml:19:5-25:19
MERGED from [com.google.android.gms:play-services-cast-framework:10.2.1] /home/harry_setiawan/.android/build-cache/55651066960fd11cf1adc40ee4d371c804f6dbb0/output/AndroidManifest.xml:4:5-8:19
MERGED from [com.google.android.gms:play-services-cast:10.2.1] /home/harry_setiawan/.android/build-cache/4ca09463e00618d6f32b43fcd5f2e227ca4babc5/output/AndroidManifest.xml:18:5-19
MERGED from [com.android.support:mediarouter-v7:24.0.0] /home/harry_setiawan/.android/build-cache/e7b4a20098353d0f61a26862acd80c95d4f02a4b/output/AndroidManifest.xml:22:5-20
MERGED from [com.android.support:palette-v7:24.0.0] /home/harry_setiawan/.android/build-cache/52496ab431f53e45cb80b13f1e2bbb7daa30ef88/output/AndroidManifest.xml:22:5-23:19
MERGED from [com.android.support:appcompat-v7:25.3.1] /home/harry_setiawan/.android/build-cache/375828fc3a6844e78021805539ee6be7b2aba095/output/AndroidManifest.xml:29:5-20
MERGED from [com.android.support:animated-vector-drawable:25.3.1] /home/harry_setiawan/.android/build-cache/e000e5b46d786dff19900a23b6339056f8ac7dbf/output/AndroidManifest.xml:26:5-20
MERGED from [com.android.support:support-vector-drawable:25.3.1] /home/harry_setiawan/.android/build-cache/addbc118c37927a26426a2ae7f0443d70413f534/output/AndroidManifest.xml:26:5-20
MERGED from [com.google.android.gms:play-services-clearcut:10.2.1] /home/harry_setiawan/.android/build-cache/0865d2e1deb0f42df1f817a04e303893dd7cf64e/output/AndroidManifest.xml:18:5-19
MERGED from [com.google.firebase:firebase-config:10.2.1] /home/harry_setiawan/.android/build-cache/cddf98edaa653a3f5c64abb93b32d1cc28ed6715/output/AndroidManifest.xml:18:5-19
MERGED from [com.google.android.gms:play-services-awareness:10.2.1] /home/harry_setiawan/.android/build-cache/51823d74178ff3717a7da80ca604b68b92181b14/output/AndroidManifest.xml:18:5-19
MERGED from [com.google.firebase:firebase-auth:10.2.1] /home/harry_setiawan/.android/build-cache/33f5d1064d3e09c8304ec6dc97f5df5339bfc7b8/output/AndroidManifest.xml:19:5-20:19
MERGED from [com.google.android.gms:play-services-fitness:10.2.1] /home/harry_setiawan/.android/build-cache/084c40bb6f3ced24a32e4a4999c35b7e4344a7de/output/AndroidManifest.xml:18:5-19
MERGED from [com.google.android.gms:play-services-games:10.2.1] /home/harry_setiawan/.android/build-cache/261eb5d5813747a03eba61ec91180ba0daef575d/output/AndroidManifest.xml:18:5-19
MERGED from [com.google.android.gms:play-services-drive:10.2.1] /home/harry_setiawan/.android/build-cache/71b8d26d5be4abab5d615ea61424491c33f78dfd/output/AndroidManifest.xml:18:5-19
MERGED from [com.google.android.gms:play-services-gass:10.2.1] /home/harry_setiawan/.android/build-cache/7d24d0b27fb005abbb1bbd168258ad3c57272d11/output/AndroidManifest.xml:4:5-19
MERGED from [com.google.android.gms:play-services-gcm:10.2.1] /home/harry_setiawan/.android/build-cache/deb0b6cf45e78a4d4892286d6fb77dae3383371a/output/AndroidManifest.xml:23:5-19
MERGED from [com.google.firebase:firebase-appindexing:10.2.1] /home/harry_setiawan/.android/build-cache/9f8bd1a2f79785c41c5510e3a8dc16d10fcd5bbd/output/AndroidManifest.xml:18:5-19
MERGED from [com.google.android.gms:play-services-iid:10.2.1] /home/harry_setiawan/.android/build-cache/43207882768d00971f2de24976d184186dff9ae7/output/AndroidManifest.xml:23:5-19
MERGED from [com.google.android.gms:play-services-location:10.2.1] /home/harry_setiawan/.android/build-cache/26a0ffc6609f23663bd4ca57ca6de3e1440c93e6/output/AndroidManifest.xml:4:5-19
MERGED from [com.google.android.gms:play-services-nearby:10.2.1] /home/harry_setiawan/.android/build-cache/339a4e32820b15a6b424aa4088b24a185556e228/output/AndroidManifest.xml:5:5-19
MERGED from [com.google.android.gms:play-services-panorama:10.2.1] /home/harry_setiawan/.android/build-cache/72118449290567260e3e6125380c0bcb307c2a22/output/AndroidManifest.xml:18:5-19
MERGED from [com.google.android.gms:play-services-places:10.2.1] /home/harry_setiawan/.android/build-cache/4e05f6db9e52ccef09f539229f1a636dbb8ef8a7/output/AndroidManifest.xml:18:5-19
MERGED from [com.google.android.gms:play-services-plus:10.2.1] /home/harry_setiawan/.android/build-cache/e1bd11949598bb2f14924c2092a058b540098ca0/output/AndroidManifest.xml:18:5-19
MERGED from [com.google.android.gms:play-services-safetynet:10.2.1] /home/harry_setiawan/.android/build-cache/ec9b4c58a6ed14d34a7874313ca478d0aad7ef94/output/AndroidManifest.xml:18:5-19
MERGED from [com.google.android.gms:play-services-tagmanager-api:10.2.1] /home/harry_setiawan/.android/build-cache/cc78923e659bcf22762714b2d11e9b60189e2b34/output/AndroidManifest.xml:23:5-33:19
MERGED from [com.google.android.gms:play-services-tagmanager-v4-impl:10.2.1] /home/harry_setiawan/.android/build-cache/4e791b7d49fe006fb5d01b7258059dbf2b581a02/output/AndroidManifest.xml:19:5-19
MERGED from [com.google.android.gms:play-services-analytics-impl:10.2.1] /home/harry_setiawan/.android/build-cache/245c14990409eb2fabbb739cc15f6b6c2aed4b23/output/AndroidManifest.xml:26:5-19
MERGED from [com.google.android.gms:play-services-vision:10.2.1] /home/harry_setiawan/.android/build-cache/df9e529ad08354478d7cb96fa0ade0fe000d9146/output/AndroidManifest.xml:4:5-19
MERGED from [com.google.android.gms:play-services-identity:10.2.1] /home/harry_setiawan/.android/build-cache/bb74905607bbeb129bfff8f5df7c590a7d92ddc0/output/AndroidManifest.xml:18:5-19
MERGED from [com.google.android.gms:play-services-maps:10.2.1] /home/harry_setiawan/.android/build-cache/346f9a4f86a7e8cbb5b06ddcde1eece87edbca83/output/AndroidManifest.xml:24:5-19
MERGED from [com.google.android.gms:play-services-wearable:10.2.1] /home/harry_setiawan/.android/build-cache/489f33d40a1822df152eb6054dcc7d9c48e9d296/output/AndroidManifest.xml:18:5-19
MERGED from [com.google.android.gms:play-services-base:10.2.1] /home/harry_setiawan/.android/build-cache/b6bc37bb0da67a020e75bc7247339f0c214db687/output/AndroidManifest.xml:18:5-20:19
MERGED from [com.embarkmobile:zxing-android-minimal:2.0.0] /home/harry_setiawan/.android/build-cache/229e2e8f12407d024745ea931e1ef0d98c3e8828/output/AndroidManifest.xml:44:3-57:17
MERGED from [com.embarkmobile:zxing-android-legacy:2.0.0] /home/harry_setiawan/.android/build-cache/f81e4864cf3de7587e861a8682c8b0d70c3a5fba/output/AndroidManifest.xml:43:3-47:17
MERGED from [com.embarkmobile:zxing-android-integration:2.0.0] /home/harry_setiawan/.android/build-cache/73f73a6e5d2391b0c71ad010fa1f0e39c7ed34d2/output/AndroidManifest.xml:4:5-5:19
MERGED from [com.google.firebase:firebase-messaging:10.2.1] /home/harry_setiawan/.android/build-cache/ac56a6af0f48494c40c4c0c0504a075fc35b6368/output/AndroidManifest.xml:19:5-29:19
MERGED from [com.google.firebase:firebase-crash:10.2.1] /home/harry_setiawan/.android/build-cache/549f7e9d2bbe906aa2c5fc69f868b019a9d46f5d/output/AndroidManifest.xml:22:5-23:19
MERGED from [com.toptoche.searchablespinner:searchablespinnerlibrary:1.3.1] /home/harry_setiawan/.android/build-cache/4efe2b3d0380033bad3c5ad3f60ea5cfc5ba1c03/output/AndroidManifest.xml:11:5-15:19
MERGED from [com.google.firebase:firebase-core:10.2.1] /home/harry_setiawan/.android/build-cache/9f6e07649d4b9430490fa76cd319b2d3c2259fb4/output/AndroidManifest.xml:5:5-20
MERGED from [com.google.firebase:firebase-analytics:10.2.1] /home/harry_setiawan/.android/build-cache/834ef20128b5b247debe7898d2270bf7da24c64e/output/AndroidManifest.xml:24:5-33:19
MERGED from [com.google.firebase:firebase-analytics-impl:10.2.1] /home/harry_setiawan/.android/build-cache/80eeec0bddad5ab33ad7d955bdbf1d1d94500053/output/AndroidManifest.xml:24:5-28:19
MERGED from [com.google.firebase:firebase-iid:10.2.1] /home/harry_setiawan/.android/build-cache/17da2f9da2d533fa88c07d3346a165da1a3664cb/output/AndroidManifest.xml:28:5-49:19
MERGED from [com.google.firebase:firebase-common:10.2.1] /home/harry_setiawan/.android/build-cache/9331e37e87baeaccc66c38376acf250ed0ee799d/output/AndroidManifest.xml:4:5-7:19
MERGED from [com.google.android.gms:play-services-tasks:10.2.1] /home/harry_setiawan/.android/build-cache/bd47d249f5af181e2ce53d4aaf30c43858574879/output/AndroidManifest.xml:4:5-19
MERGED from [com.google.android.gms:play-services-basement:10.2.1] /home/harry_setiawan/.android/build-cache/72fe356702d162acc755c42b4fdcfb2ad5218198/output/AndroidManifest.xml:19:5-21:19
MERGED from [com.android.support:support-v4:25.3.1] /home/harry_setiawan/.android/build-cache/fc30434847c10a2f8edaa41bf51391c832f5be3e/output/AndroidManifest.xml:29:5-20
MERGED from [com.android.support:support-fragment:25.3.1] /home/harry_setiawan/.android/build-cache/5f74e8cddfa4fffdd3f043461823433c0150955e/output/AndroidManifest.xml:29:5-20
MERGED from [com.android.support:support-media-compat:25.3.1] /home/harry_setiawan/.android/build-cache/f355e2861fa49e23d7b175992837ecbd383c6c53/output/AndroidManifest.xml:29:5-20
MERGED from [com.android.support:support-core-ui:25.3.1] /home/harry_setiawan/.android/build-cache/e0a1706ec35575dde3cdd677534c725055503710/output/AndroidManifest.xml:29:5-20
MERGED from [com.android.support:support-core-utils:25.3.1] /home/harry_setiawan/.android/build-cache/c0a721f9f9030480eebd7f8a82433b42ee3ed4de/output/AndroidManifest.xml:29:5-20
MERGED from [com.android.support:support-compat:25.3.1] /home/harry_setiawan/.android/build-cache/a7d0a2cb7e2136c1977d98f4fbc427308e1eae5a/output/AndroidManifest.xml:29:5-20
	android:label
		ADDED from /home/harry_setiawan/Documents/git_MNC/Raptor/app/src/main/AndroidManifest.xml:44:9-41
	android:supportsRtl
		ADDED from [com.toptoche.searchablespinner:searchablespinnerlibrary:1.3.1] /home/harry_setiawan/.android/build-cache/4efe2b3d0380033bad3c5ad3f60ea5cfc5ba1c03/output/AndroidManifest.xml:14:9-35
	android:allowBackup
		ADDED from /home/harry_setiawan/Documents/git_MNC/Raptor/app/src/main/AndroidManifest.xml:42:9-35
	android:icon
		ADDED from /home/harry_setiawan/Documents/git_MNC/Raptor/app/src/main/AndroidManifest.xml:43:9-43
	android:theme
		ADDED from /home/harry_setiawan/Documents/git_MNC/Raptor/app/src/main/AndroidManifest.xml:45:9-40
	android:name
		ADDED from /home/harry_setiawan/Documents/git_MNC/Raptor/app/src/main/AndroidManifest.xml:41:9-68
activity#myskysfa.com.sfa.main.MainMenuActivity
ADDED from /home/harry_setiawan/Documents/git_MNC/Raptor/app/src/main/AndroidManifest.xml:46:9-55:20
	android:screenOrientation
		ADDED from /home/harry_setiawan/Documents/git_MNC/Raptor/app/src/main/AndroidManifest.xml:49:13-49
	android:label
		ADDED from /home/harry_setiawan/Documents/git_MNC/Raptor/app/src/main/AndroidManifest.xml:48:13-45
	android:name
		ADDED from /home/harry_setiawan/Documents/git_MNC/Raptor/app/src/main/AndroidManifest.xml:47:13-66
intent-filter#android.intent.action.MAIN+android.intent.category.LAUNCHER
ADDED from /home/harry_setiawan/Documents/git_MNC/Raptor/app/src/main/AndroidManifest.xml:50:13-54:29
action#android.intent.action.MAIN
ADDED from /home/harry_setiawan/Documents/git_MNC/Raptor/app/src/main/AndroidManifest.xml:51:17-69
	android:name
		ADDED from /home/harry_setiawan/Documents/git_MNC/Raptor/app/src/main/AndroidManifest.xml:51:25-66
category#android.intent.category.LAUNCHER
ADDED from /home/harry_setiawan/Documents/git_MNC/Raptor/app/src/main/AndroidManifest.xml:53:17-77
	android:name
		ADDED from /home/harry_setiawan/Documents/git_MNC/Raptor/app/src/main/AndroidManifest.xml:53:27-74
activity#myskysfa.com.sfa.main.LoginActivity
ADDED from /home/harry_setiawan/Documents/git_MNC/Raptor/app/src/main/AndroidManifest.xml:57:9-62:66
	android:screenOrientation
		ADDED from /home/harry_setiawan/Documents/git_MNC/Raptor/app/src/main/AndroidManifest.xml:61:13-49
	android:label
		ADDED from /home/harry_setiawan/Documents/git_MNC/Raptor/app/src/main/AndroidManifest.xml:60:13-57
	android:windowSoftInputMode
		ADDED from /home/harry_setiawan/Documents/git_MNC/Raptor/app/src/main/AndroidManifest.xml:62:13-54
	android:configChanges
		ADDED from /home/harry_setiawan/Documents/git_MNC/Raptor/app/src/main/AndroidManifest.xml:59:13-63
	android:name
		ADDED from /home/harry_setiawan/Documents/git_MNC/Raptor/app/src/main/AndroidManifest.xml:58:13-63
activity#myskysfa.com.sfa.main.SplashActivity
ADDED from /home/harry_setiawan/Documents/git_MNC/Raptor/app/src/main/AndroidManifest.xml:64:9-69:66
	android:screenOrientation
		ADDED from /home/harry_setiawan/Documents/git_MNC/Raptor/app/src/main/AndroidManifest.xml:68:13-49
	android:label
		ADDED from /home/harry_setiawan/Documents/git_MNC/Raptor/app/src/main/AndroidManifest.xml:67:13-45
	android:windowSoftInputMode
		ADDED from /home/harry_setiawan/Documents/git_MNC/Raptor/app/src/main/AndroidManifest.xml:69:13-54
	android:configChanges
		ADDED from /home/harry_setiawan/Documents/git_MNC/Raptor/app/src/main/AndroidManifest.xml:66:13-51
	android:name
		ADDED from /home/harry_setiawan/Documents/git_MNC/Raptor/app/src/main/AndroidManifest.xml:65:13-64
activity#myskysfa.com.sfa.main.menu.dtdproject.FormProDTD
ADDED from /home/harry_setiawan/Documents/git_MNC/Raptor/app/src/main/AndroidManifest.xml:87:9-93:20
	android:screenOrientation
		ADDED from /home/harry_setiawan/Documents/git_MNC/Raptor/app/src/main/AndroidManifest.xml:91:13-49
	android:label
		ADDED from /home/harry_setiawan/Documents/git_MNC/Raptor/app/src/main/AndroidManifest.xml:90:13-43
	android:windowSoftInputMode
		ADDED from /home/harry_setiawan/Documents/git_MNC/Raptor/app/src/main/AndroidManifest.xml:92:13-54
	android:configChanges
		ADDED from /home/harry_setiawan/Documents/git_MNC/Raptor/app/src/main/AndroidManifest.xml:89:13-51
	android:name
		ADDED from /home/harry_setiawan/Documents/git_MNC/Raptor/app/src/main/AndroidManifest.xml:88:13-60
activity#myskysfa.com.sfa.main.menu.MainFragmentMS
ADDED from /home/harry_setiawan/Documents/git_MNC/Raptor/app/src/main/AndroidManifest.xml:95:9-100:20
	android:screenOrientation
		ADDED from /home/harry_setiawan/Documents/git_MNC/Raptor/app/src/main/AndroidManifest.xml:99:13-49
	android:label
		ADDED from /home/harry_setiawan/Documents/git_MNC/Raptor/app/src/main/AndroidManifest.xml:98:13-49
	android:configChanges
		ADDED from /home/harry_setiawan/Documents/git_MNC/Raptor/app/src/main/AndroidManifest.xml:97:13-51
	android:name
		ADDED from /home/harry_setiawan/Documents/git_MNC/Raptor/app/src/main/AndroidManifest.xml:96:13-53
activity#myskysfa.com.sfa.main.menu.MainFragmentDTD
ADDED from /home/harry_setiawan/Documents/git_MNC/Raptor/app/src/main/AndroidManifest.xml:102:9-107:20
	android:screenOrientation
		ADDED from /home/harry_setiawan/Documents/git_MNC/Raptor/app/src/main/AndroidManifest.xml:106:13-49
	android:label
		ADDED from /home/harry_setiawan/Documents/git_MNC/Raptor/app/src/main/AndroidManifest.xml:105:13-41
	android:configChanges
		ADDED from /home/harry_setiawan/Documents/git_MNC/Raptor/app/src/main/AndroidManifest.xml:104:13-51
	android:name
		ADDED from /home/harry_setiawan/Documents/git_MNC/Raptor/app/src/main/AndroidManifest.xml:103:13-54
activity#myskysfa.com.sfa.main.menu.AgreementActivity
ADDED from /home/harry_setiawan/Documents/git_MNC/Raptor/app/src/main/AndroidManifest.xml:109:9-112:47
	android:label
		ADDED from /home/harry_setiawan/Documents/git_MNC/Raptor/app/src/main/AndroidManifest.xml:111:13-61
	android:theme
		ADDED from /home/harry_setiawan/Documents/git_MNC/Raptor/app/src/main/AndroidManifest.xml:112:13-44
	android:name
		ADDED from /home/harry_setiawan/Documents/git_MNC/Raptor/app/src/main/AndroidManifest.xml:110:13-56
service#myskysfa.com.sfa.service.MyFirebaseMessagingService
ADDED from /home/harry_setiawan/Documents/git_MNC/Raptor/app/src/main/AndroidManifest.xml:130:9-134:19
	android:name
		ADDED from /home/harry_setiawan/Documents/git_MNC/Raptor/app/src/main/AndroidManifest.xml:130:18-68
intent-filter#com.google.firebase.MESSAGING_EVENT
ADDED from /home/harry_setiawan/Documents/git_MNC/Raptor/app/src/main/AndroidManifest.xml:131:13-133:29
action#com.google.firebase.MESSAGING_EVENT
ADDED from /home/harry_setiawan/Documents/git_MNC/Raptor/app/src/main/AndroidManifest.xml:132:17-78
	android:name
		ADDED from /home/harry_setiawan/Documents/git_MNC/Raptor/app/src/main/AndroidManifest.xml:132:25-75
service#myskysfa.com.sfa.service.MyFirebaseInstanceIdService
ADDED from /home/harry_setiawan/Documents/git_MNC/Raptor/app/src/main/AndroidManifest.xml:136:9-140:19
	android:name
		ADDED from /home/harry_setiawan/Documents/git_MNC/Raptor/app/src/main/AndroidManifest.xml:136:18-69
intent-filter#com.google.firebase.INSTANCE_ID_EVENT
ADDED from /home/harry_setiawan/Documents/git_MNC/Raptor/app/src/main/AndroidManifest.xml:137:13-139:29
action#com.google.firebase.INSTANCE_ID_EVENT
ADDED from /home/harry_setiawan/Documents/git_MNC/Raptor/app/src/main/AndroidManifest.xml:138:17-80
	android:name
		ADDED from /home/harry_setiawan/Documents/git_MNC/Raptor/app/src/main/AndroidManifest.xml:138:25-77
service#myskysfa.com.sfa.service.AutoSender
ADDED from /home/harry_setiawan/Documents/git_MNC/Raptor/app/src/main/AndroidManifest.xml:143:9-145:39
	android:exported
		ADDED from /home/harry_setiawan/Documents/git_MNC/Raptor/app/src/main/AndroidManifest.xml:145:13-36
	android:name
		ADDED from /home/harry_setiawan/Documents/git_MNC/Raptor/app/src/main/AndroidManifest.xml:144:13-47
receiver#myskysfa.com.sfa.service.SessionService
ADDED from /home/harry_setiawan/Documents/git_MNC/Raptor/app/src/main/AndroidManifest.xml:147:9-151:20
	android:name
		ADDED from /home/harry_setiawan/Documents/git_MNC/Raptor/app/src/main/AndroidManifest.xml:147:19-57
intent-filter#android.intent.action.BOOT_COMPLETED+com.android.techtrainner
ADDED from /home/harry_setiawan/Documents/git_MNC/Raptor/app/src/main/AndroidManifest.xml:148:13-150:29
action#com.android.techtrainner
ADDED from /home/harry_setiawan/Documents/git_MNC/Raptor/app/src/main/AndroidManifest.xml:148:28-77
	android:name
		ADDED from /home/harry_setiawan/Documents/git_MNC/Raptor/app/src/main/AndroidManifest.xml:148:36-75
action#android.intent.action.BOOT_COMPLETED
ADDED from /home/harry_setiawan/Documents/git_MNC/Raptor/app/src/main/AndroidManifest.xml:149:17-78
	android:name
		ADDED from /home/harry_setiawan/Documents/git_MNC/Raptor/app/src/main/AndroidManifest.xml:149:25-76
receiver#myskysfa.com.sfa.service.BroadCaseRC
ADDED from /home/harry_setiawan/Documents/git_MNC/Raptor/app/src/main/AndroidManifest.xml:152:9-156:20
	android:name
		ADDED from /home/harry_setiawan/Documents/git_MNC/Raptor/app/src/main/AndroidManifest.xml:152:19-54
intent-filter#android.intent.action.BOOT_COMPLETED
ADDED from /home/harry_setiawan/Documents/git_MNC/Raptor/app/src/main/AndroidManifest.xml:153:13-155:29
receiver#myskysfa.com.sfa.service.MyWakefulReceiver
ADDED from /home/harry_setiawan/Documents/git_MNC/Raptor/app/src/main/AndroidManifest.xml:157:9-63
	android:name
		ADDED from /home/harry_setiawan/Documents/git_MNC/Raptor/app/src/main/AndroidManifest.xml:157:19-60
activity#myskysfa.com.sfa.main.menu.SignatureWebViewActivity
ADDED from /home/harry_setiawan/Documents/git_MNC/Raptor/app/src/main/AndroidManifest.xml:159:9-161:52
	android:screenOrientation
		ADDED from /home/harry_setiawan/Documents/git_MNC/Raptor/app/src/main/AndroidManifest.xml:161:13-49
	android:name
		ADDED from /home/harry_setiawan/Documents/git_MNC/Raptor/app/src/main/AndroidManifest.xml:160:13-63
uses-sdk
INJECTED from /home/harry_setiawan/Documents/git_MNC/Raptor/app/src/main/AndroidManifest.xml reason: use-sdk injection requested
MERGED from [Raptor:googlemapssdkm4b_lib:unspecified] /home/harry_setiawan/Documents/git_MNC/Raptor/googlemapssdkm4b_lib/build/intermediates/bundles/default/AndroidManifest.xml:7:5-9:41
MERGED from [com.android.volley:volley:1.0.0] /home/harry_setiawan/.android/build-cache/83d9bc1855c916f585e4af8b66729d89590381ee/output/AndroidManifest.xml:7:5-43
MERGED from [com.android.support:design:25.3.1] /home/harry_setiawan/.android/build-cache/9a266c852ab5c6d8766ab417a69864cfbe13c63d/output/AndroidManifest.xml:21:5-23:62
MERGED from [com.android.support:transition:25.3.1] /home/harry_setiawan/.android/build-cache/cd5540c7ae3ae2cd079638c258fb02cae63b1695/output/AndroidManifest.xml:20:5-44
MERGED from [com.android.support:recyclerview-v7:25.3.1] /home/harry_setiawan/.android/build-cache/a316f3e69fc4cc9d007d7486286f937ad2ac8cc6/output/AndroidManifest.xml:20:5-43
MERGED from [com.android.support:cardview-v7:25.3.1] /home/harry_setiawan/.android/build-cache/69ee0754ebe800efe5629a40c5fca8765bed5fdd/output/AndroidManifest.xml:20:5-43
MERGED from [com.google.android.gms:play-services:10.2.1] /home/harry_setiawan/.android/build-cache/e826f2b996e4d8b33d9ea8b40710d4682a73875e/output/AndroidManifest.xml:4:5-43
MERGED from [com.google.android.gms:play-services-ads:10.2.1] /home/harry_setiawan/.android/build-cache/04cef968e86f5e5b8ee10d3a9402cc4dd68f36e8/output/AndroidManifest.xml:17:5-43
MERGED from [com.google.android.gms:play-services-ads-lite:10.2.1] /home/harry_setiawan/.android/build-cache/143e6b6c0c3ee2c1dc9713e7188e7b43127d84e0/output/AndroidManifest.xml:22:5-43
MERGED from [com.google.android.gms:play-services-analytics:10.2.1] /home/harry_setiawan/.android/build-cache/ae66a51f97fbf7801b60ed216c0cbed13ee4773e/output/AndroidManifest.xml:17:5-43
MERGED from [com.google.android.gms:play-services-appinvite:10.2.1] /home/harry_setiawan/.android/build-cache/3fe3f1828d09dcd0ed9ceeed0992745e309aedbe/output/AndroidManifest.xml:17:5-43
MERGED from [com.google.android.gms:play-services-auth:10.2.1] /home/harry_setiawan/.android/build-cache/3e610fad5124839d4eea4bd6a8671d8c361163d7/output/AndroidManifest.xml:17:5-43
MERGED from [com.google.android.gms:play-services-auth-base:10.2.1] /home/harry_setiawan/.android/build-cache/ccc2c14d719a4d9b99fd9cf66ad18fe357e115ca/output/AndroidManifest.xml:4:5-43
MERGED from [com.google.android.gms:play-services-cast-framework:10.2.1] /home/harry_setiawan/.android/build-cache/55651066960fd11cf1adc40ee4d371c804f6dbb0/output/AndroidManifest.xml:3:5-43
MERGED from [com.google.android.gms:play-services-cast:10.2.1] /home/harry_setiawan/.android/build-cache/4ca09463e00618d6f32b43fcd5f2e227ca4babc5/output/AndroidManifest.xml:17:5-43
MERGED from [com.android.support:mediarouter-v7:24.0.0] /home/harry_setiawan/.android/build-cache/e7b4a20098353d0f61a26862acd80c95d4f02a4b/output/AndroidManifest.xml:20:5-43
MERGED from [com.android.support:palette-v7:24.0.0] /home/harry_setiawan/.android/build-cache/52496ab431f53e45cb80b13f1e2bbb7daa30ef88/output/AndroidManifest.xml:20:5-43
MERGED from [com.android.support:appcompat-v7:25.3.1] /home/harry_setiawan/.android/build-cache/375828fc3a6844e78021805539ee6be7b2aba095/output/AndroidManifest.xml:21:5-23:78
MERGED from [com.android.support:animated-vector-drawable:25.3.1] /home/harry_setiawan/.android/build-cache/e000e5b46d786dff19900a23b6339056f8ac7dbf/output/AndroidManifest.xml:20:5-44
MERGED from [com.android.support:support-vector-drawable:25.3.1] /home/harry_setiawan/.android/build-cache/addbc118c37927a26426a2ae7f0443d70413f534/output/AndroidManifest.xml:20:5-43
MERGED from [com.google.android.gms:play-services-clearcut:10.2.1] /home/harry_setiawan/.android/build-cache/0865d2e1deb0f42df1f817a04e303893dd7cf64e/output/AndroidManifest.xml:17:5-43
MERGED from [com.google.firebase:firebase-config:10.2.1] /home/harry_setiawan/.android/build-cache/cddf98edaa653a3f5c64abb93b32d1cc28ed6715/output/AndroidManifest.xml:17:5-43
MERGED from [com.google.android.gms:play-services-awareness:10.2.1] /home/harry_setiawan/.android/build-cache/51823d74178ff3717a7da80ca604b68b92181b14/output/AndroidManifest.xml:17:5-43
MERGED from [com.google.firebase:firebase-auth:10.2.1] /home/harry_setiawan/.android/build-cache/33f5d1064d3e09c8304ec6dc97f5df5339bfc7b8/output/AndroidManifest.xml:17:5-43
MERGED from [com.google.firebase:firebase-storage:10.2.1] /home/harry_setiawan/.android/build-cache/c756e0f7a01000332df999c11b5431e14fb3d30a/output/AndroidManifest.xml:3:5-43
MERGED from [com.google.firebase:firebase-storage-common:10.2.1] /home/harry_setiawan/.android/build-cache/ba5b8917f65eb7b7e589ac6920a58145297cea98/output/AndroidManifest.xml:3:5-43
MERGED from [com.google.android.gms:play-services-fitness:10.2.1] /home/harry_setiawan/.android/build-cache/084c40bb6f3ced24a32e4a4999c35b7e4344a7de/output/AndroidManifest.xml:17:5-43
MERGED from [com.google.android.gms:play-services-games:10.2.1] /home/harry_setiawan/.android/build-cache/261eb5d5813747a03eba61ec91180ba0daef575d/output/AndroidManifest.xml:17:5-43
MERGED from [com.google.android.gms:play-services-drive:10.2.1] /home/harry_setiawan/.android/build-cache/71b8d26d5be4abab5d615ea61424491c33f78dfd/output/AndroidManifest.xml:17:5-43
MERGED from [com.google.android.gms:play-services-gass:10.2.1] /home/harry_setiawan/.android/build-cache/7d24d0b27fb005abbb1bbd168258ad3c57272d11/output/AndroidManifest.xml:3:5-43
MERGED from [com.google.android.gms:play-services-gcm:10.2.1] /home/harry_setiawan/.android/build-cache/deb0b6cf45e78a4d4892286d6fb77dae3383371a/output/AndroidManifest.xml:17:5-43
MERGED from [com.google.firebase:firebase-appindexing:10.2.1] /home/harry_setiawan/.android/build-cache/9f8bd1a2f79785c41c5510e3a8dc16d10fcd5bbd/output/AndroidManifest.xml:17:5-43
MERGED from [com.google.android.gms:play-services-iid:10.2.1] /home/harry_setiawan/.android/build-cache/43207882768d00971f2de24976d184186dff9ae7/output/AndroidManifest.xml:17:5-43
MERGED from [com.google.android.gms:play-services-instantapps:10.2.1] /home/harry_setiawan/.android/build-cache/c501d76fd74f1bee656df0bab916aee5154be112/output/AndroidManifest.xml:3:5-43
MERGED from [com.google.android.gms:play-services-location:10.2.1] /home/harry_setiawan/.android/build-cache/26a0ffc6609f23663bd4ca57ca6de3e1440c93e6/output/AndroidManifest.xml:3:5-43
MERGED from [com.google.android.gms:play-services-nearby:10.2.1] /home/harry_setiawan/.android/build-cache/339a4e32820b15a6b424aa4088b24a185556e228/output/AndroidManifest.xml:3:5-43
MERGED from [com.google.android.gms:play-services-panorama:10.2.1] /home/harry_setiawan/.android/build-cache/72118449290567260e3e6125380c0bcb307c2a22/output/AndroidManifest.xml:17:5-43
MERGED from [com.google.android.gms:play-services-places:10.2.1] /home/harry_setiawan/.android/build-cache/4e05f6db9e52ccef09f539229f1a636dbb8ef8a7/output/AndroidManifest.xml:17:5-43
MERGED from [com.google.android.gms:play-services-plus:10.2.1] /home/harry_setiawan/.android/build-cache/e1bd11949598bb2f14924c2092a058b540098ca0/output/AndroidManifest.xml:17:5-43
MERGED from [com.google.android.gms:play-services-safetynet:10.2.1] /home/harry_setiawan/.android/build-cache/ec9b4c58a6ed14d34a7874313ca478d0aad7ef94/output/AndroidManifest.xml:17:5-43
MERGED from [com.google.android.gms:play-services-tagmanager:10.2.1] /home/harry_setiawan/.android/build-cache/985c413a0f1c6a7152b1f50fb48de2bd00567661/output/AndroidManifest.xml:17:5-43
MERGED from [com.google.android.gms:play-services-tagmanager-api:10.2.1] /home/harry_setiawan/.android/build-cache/cc78923e659bcf22762714b2d11e9b60189e2b34/output/AndroidManifest.xml:17:5-43
MERGED from [com.google.android.gms:play-services-tagmanager-v4-impl:10.2.1] /home/harry_setiawan/.android/build-cache/4e791b7d49fe006fb5d01b7258059dbf2b581a02/output/AndroidManifest.xml:17:5-43
MERGED from [com.google.android.gms:play-services-analytics-impl:10.2.1] /home/harry_setiawan/.android/build-cache/245c14990409eb2fabbb739cc15f6b6c2aed4b23/output/AndroidManifest.xml:17:5-43
MERGED from [com.google.android.gms:play-services-vision:10.2.1] /home/harry_setiawan/.android/build-cache/df9e529ad08354478d7cb96fa0ade0fe000d9146/output/AndroidManifest.xml:3:5-43
MERGED from [com.google.android.gms:play-services-wallet:10.2.1] /home/harry_setiawan/.android/build-cache/73508cb3bcf30ce519ac0d056af4657b4697bc9f/output/AndroidManifest.xml:18:5-43
MERGED from [com.google.android.gms:play-services-identity:10.2.1] /home/harry_setiawan/.android/build-cache/bb74905607bbeb129bfff8f5df7c590a7d92ddc0/output/AndroidManifest.xml:17:5-43
MERGED from [com.google.android.gms:play-services-maps:10.2.1] /home/harry_setiawan/.android/build-cache/346f9a4f86a7e8cbb5b06ddcde1eece87edbca83/output/AndroidManifest.xml:23:5-43
MERGED from [com.google.android.gms:play-services-wearable:10.2.1] /home/harry_setiawan/.android/build-cache/489f33d40a1822df152eb6054dcc7d9c48e9d296/output/AndroidManifest.xml:17:5-43
MERGED from [com.google.android.gms:play-services-base:10.2.1] /home/harry_setiawan/.android/build-cache/b6bc37bb0da67a020e75bc7247339f0c214db687/output/AndroidManifest.xml:17:5-43
MERGED from [com.embarkmobile:zxing-android-minimal:2.0.0] /home/harry_setiawan/.android/build-cache/229e2e8f12407d024745ea931e1ef0d98c3e8828/output/AndroidManifest.xml:24:3-70
MERGED from [com.embarkmobile:zxing-android-legacy:2.0.0] /home/harry_setiawan/.android/build-cache/f81e4864cf3de7587e861a8682c8b0d70c3a5fba/output/AndroidManifest.xml:23:3-70
MERGED from [com.embarkmobile:zxing-android-integration:2.0.0] /home/harry_setiawan/.android/build-cache/73f73a6e5d2391b0c71ad010fa1f0e39c7ed34d2/output/AndroidManifest.xml:2:5-72
MERGED from [com.android.support:multidex:1.0.1] /home/harry_setiawan/.android/build-cache/4acc6454a160f6f799ab8cb25cf4023847bb0fc2/output/AndroidManifest.xml:18:5-42
MERGED from [com.google.firebase:firebase-messaging:10.2.1] /home/harry_setiawan/.android/build-cache/ac56a6af0f48494c40c4c0c0504a075fc35b6368/output/AndroidManifest.xml:17:5-43
MERGED from [com.google.firebase:firebase-database:10.2.1] /home/harry_setiawan/.android/build-cache/68d8246cfe5bf8a9e69579ff8f51c1b76ed3cbc4/output/AndroidManifest.xml:3:5-43
MERGED from [com.google.firebase:firebase-database-connection:10.2.1] /home/harry_setiawan/.android/build-cache/bba30fa9151e915c9d540b0f6fc92f2f043e89be/output/AndroidManifest.xml:3:5-43
MERGED from [com.google.firebase:firebase-crash:10.2.1] /home/harry_setiawan/.android/build-cache/549f7e9d2bbe906aa2c5fc69f868b019a9d46f5d/output/AndroidManifest.xml:20:5-43
MERGED from [com.toptoche.searchablespinner:searchablespinnerlibrary:1.3.1] /home/harry_setiawan/.android/build-cache/4efe2b3d0380033bad3c5ad3f60ea5cfc5ba1c03/output/AndroidManifest.xml:7:5-9:41
MERGED from [org.osmdroid:osmdroid-android:5.6.4] /home/harry_setiawan/.android/build-cache/a2c220f32126867315c402f5f152625fb52599f6/output/AndroidManifest.xml:7:5-9:41
MERGED from [com.google.firebase:firebase-core:10.2.1] /home/harry_setiawan/.android/build-cache/9f6e07649d4b9430490fa76cd319b2d3c2259fb4/output/AndroidManifest.xml:4:5-43
MERGED from [com.google.firebase:firebase-analytics:10.2.1] /home/harry_setiawan/.android/build-cache/834ef20128b5b247debe7898d2270bf7da24c64e/output/AndroidManifest.xml:17:5-43
MERGED from [com.google.firebase:firebase-analytics-impl:10.2.1] /home/harry_setiawan/.android/build-cache/80eeec0bddad5ab33ad7d955bdbf1d1d94500053/output/AndroidManifest.xml:17:5-43
MERGED from [com.google.firebase:firebase-iid:10.2.1] /home/harry_setiawan/.android/build-cache/17da2f9da2d533fa88c07d3346a165da1a3664cb/output/AndroidManifest.xml:17:5-43
MERGED from [com.google.firebase:firebase-common:10.2.1] /home/harry_setiawan/.android/build-cache/9331e37e87baeaccc66c38376acf250ed0ee799d/output/AndroidManifest.xml:3:5-43
MERGED from [com.google.android.gms:play-services-tasks:10.2.1] /home/harry_setiawan/.android/build-cache/bd47d249f5af181e2ce53d4aaf30c43858574879/output/AndroidManifest.xml:3:5-43
MERGED from [com.google.android.gms:play-services-basement:10.2.1] /home/harry_setiawan/.android/build-cache/72fe356702d162acc755c42b4fdcfb2ad5218198/output/AndroidManifest.xml:17:5-43
MERGED from [com.android.support:support-v4:25.3.1] /home/harry_setiawan/.android/build-cache/fc30434847c10a2f8edaa41bf51391c832f5be3e/output/AndroidManifest.xml:21:5-23:54
MERGED from [com.android.support:support-fragment:25.3.1] /home/harry_setiawan/.android/build-cache/5f74e8cddfa4fffdd3f043461823433c0150955e/output/AndroidManifest.xml:21:5-23:60
MERGED from [com.android.support:support-media-compat:25.3.1] /home/harry_setiawan/.android/build-cache/f355e2861fa49e23d7b175992837ecbd383c6c53/output/AndroidManifest.xml:21:5-23:63
MERGED from [com.android.support:support-core-ui:25.3.1] /home/harry_setiawan/.android/build-cache/e0a1706ec35575dde3cdd677534c725055503710/output/AndroidManifest.xml:21:5-23:58
MERGED from [com.android.support:support-core-utils:25.3.1] /home/harry_setiawan/.android/build-cache/c0a721f9f9030480eebd7f8a82433b42ee3ed4de/output/AndroidManifest.xml:21:5-23:61
MERGED from [com.android.support:support-compat:25.3.1] /home/harry_setiawan/.android/build-cache/a7d0a2cb7e2136c1977d98f4fbc427308e1eae5a/output/AndroidManifest.xml:21:5-23:58
	tools:overrideLibrary
		ADDED from [com.android.support:design:25.3.1] /home/harry_setiawan/.android/build-cache/9a266c852ab5c6d8766ab417a69864cfbe13c63d/output/AndroidManifest.xml:23:9-59
	android:targetSdkVersion
		INJECTED from /home/harry_setiawan/Documents/git_MNC/Raptor/app/src/main/AndroidManifest.xml
		INJECTED from /home/harry_setiawan/Documents/git_MNC/Raptor/app/src/main/AndroidManifest.xml
	android:minSdkVersion
		INJECTED from /home/harry_setiawan/Documents/git_MNC/Raptor/app/src/main/AndroidManifest.xml
		INJECTED from /home/harry_setiawan/Documents/git_MNC/Raptor/app/src/main/AndroidManifest.xml
meta-data#android.support.VERSION
ADDED from [com.android.support:design:25.3.1] /home/harry_setiawan/.android/build-cache/9a266c852ab5c6d8766ab417a69864cfbe13c63d/output/AndroidManifest.xml:25:5-27:34
MERGED from [com.android.support:transition:25.3.1] /home/harry_setiawan/.android/build-cache/cd5540c7ae3ae2cd079638c258fb02cae63b1695/output/AndroidManifest.xml:22:5-24:34
MERGED from [com.android.support:recyclerview-v7:25.3.1] /home/harry_setiawan/.android/build-cache/a316f3e69fc4cc9d007d7486286f937ad2ac8cc6/output/AndroidManifest.xml:22:5-24:34
MERGED from [com.android.support:cardview-v7:25.3.1] /home/harry_setiawan/.android/build-cache/69ee0754ebe800efe5629a40c5fca8765bed5fdd/output/AndroidManifest.xml:22:5-24:34
MERGED from [com.android.support:appcompat-v7:25.3.1] /home/harry_setiawan/.android/build-cache/375828fc3a6844e78021805539ee6be7b2aba095/output/AndroidManifest.xml:25:5-27:34
MERGED from [com.android.support:animated-vector-drawable:25.3.1] /home/harry_setiawan/.android/build-cache/e000e5b46d786dff19900a23b6339056f8ac7dbf/output/AndroidManifest.xml:22:5-24:34
MERGED from [com.android.support:support-vector-drawable:25.3.1] /home/harry_setiawan/.android/build-cache/addbc118c37927a26426a2ae7f0443d70413f534/output/AndroidManifest.xml:22:5-24:34
MERGED from [com.android.support:support-v4:25.3.1] /home/harry_setiawan/.android/build-cache/fc30434847c10a2f8edaa41bf51391c832f5be3e/output/AndroidManifest.xml:25:5-27:34
MERGED from [com.android.support:support-fragment:25.3.1] /home/harry_setiawan/.android/build-cache/5f74e8cddfa4fffdd3f043461823433c0150955e/output/AndroidManifest.xml:25:5-27:34
MERGED from [com.android.support:support-media-compat:25.3.1] /home/harry_setiawan/.android/build-cache/f355e2861fa49e23d7b175992837ecbd383c6c53/output/AndroidManifest.xml:25:5-27:34
MERGED from [com.android.support:support-core-ui:25.3.1] /home/harry_setiawan/.android/build-cache/e0a1706ec35575dde3cdd677534c725055503710/output/AndroidManifest.xml:25:5-27:34
MERGED from [com.android.support:support-core-utils:25.3.1] /home/harry_setiawan/.android/build-cache/c0a721f9f9030480eebd7f8a82433b42ee3ed4de/output/AndroidManifest.xml:25:5-27:34
MERGED from [com.android.support:support-compat:25.3.1] /home/harry_setiawan/.android/build-cache/a7d0a2cb7e2136c1977d98f4fbc427308e1eae5a/output/AndroidManifest.xml:25:5-27:34
	android:value
		ADDED from [com.android.support:design:25.3.1] /home/harry_setiawan/.android/build-cache/9a266c852ab5c6d8766ab417a69864cfbe13c63d/output/AndroidManifest.xml:27:9-31
	android:name
		ADDED from [com.android.support:design:25.3.1] /home/harry_setiawan/.android/build-cache/9a266c852ab5c6d8766ab417a69864cfbe13c63d/output/AndroidManifest.xml:26:9-47
activity#com.google.android.gms.ads.AdActivity
ADDED from [com.google.android.gms:play-services-ads-lite:10.2.1] /home/harry_setiawan/.android/build-cache/143e6b6c0c3ee2c1dc9713e7188e7b43127d84e0/output/AndroidManifest.xml:25:9-232
	android:configChanges
		ADDED from [com.google.android.gms:play-services-ads-lite:10.2.1] /home/harry_setiawan/.android/build-cache/143e6b6c0c3ee2c1dc9713e7188e7b43127d84e0/output/AndroidManifest.xml:25:72-181
	android:theme
		ADDED from [com.google.android.gms:play-services-ads-lite:10.2.1] /home/harry_setiawan/.android/build-cache/143e6b6c0c3ee2c1dc9713e7188e7b43127d84e0/output/AndroidManifest.xml:25:182-230
	android:name
		ADDED from [com.google.android.gms:play-services-ads-lite:10.2.1] /home/harry_setiawan/.android/build-cache/143e6b6c0c3ee2c1dc9713e7188e7b43127d84e0/output/AndroidManifest.xml:25:19-71
activity#com.google.android.gms.ads.purchase.InAppPurchaseActivity
ADDED from [com.google.android.gms:play-services-ads-lite:10.2.1] /home/harry_setiawan/.android/build-cache/143e6b6c0c3ee2c1dc9713e7188e7b43127d84e0/output/AndroidManifest.xml:26:9-131
	android:theme
		ADDED from [com.google.android.gms:play-services-ads-lite:10.2.1] /home/harry_setiawan/.android/build-cache/143e6b6c0c3ee2c1dc9713e7188e7b43127d84e0/output/AndroidManifest.xml:26:92-129
	android:name
		ADDED from [com.google.android.gms:play-services-ads-lite:10.2.1] /home/harry_setiawan/.android/build-cache/143e6b6c0c3ee2c1dc9713e7188e7b43127d84e0/output/AndroidManifest.xml:26:19-91
activity#com.google.android.gms.appinvite.PreviewActivity
ADDED from [com.google.android.gms:play-services-appinvite:10.2.1] /home/harry_setiawan/.android/build-cache/3fe3f1828d09dcd0ed9ceeed0992745e309aedbe/output/AndroidManifest.xml:20:9-25:20
	android:exported
		ADDED from [com.google.android.gms:play-services-appinvite:10.2.1] /home/harry_setiawan/.android/build-cache/3fe3f1828d09dcd0ed9ceeed0992745e309aedbe/output/AndroidManifest.xml:20:51-74
	android:theme
		ADDED from [com.google.android.gms:play-services-appinvite:10.2.1] /home/harry_setiawan/.android/build-cache/3fe3f1828d09dcd0ed9ceeed0992745e309aedbe/output/AndroidManifest.xml:20:75-121
	android:name
		ADDED from [com.google.android.gms:play-services-appinvite:10.2.1] /home/harry_setiawan/.android/build-cache/3fe3f1828d09dcd0ed9ceeed0992745e309aedbe/output/AndroidManifest.xml:20:19-50
intent-filter#android.intent.category.DEFAULT+com.google.android.gms.appinvite.ACTION_PREVIEW
ADDED from [com.google.android.gms:play-services-appinvite:10.2.1] /home/harry_setiawan/.android/build-cache/3fe3f1828d09dcd0ed9ceeed0992745e309aedbe/output/AndroidManifest.xml:21:13-24:29
action#com.google.android.gms.appinvite.ACTION_PREVIEW
ADDED from [com.google.android.gms:play-services-appinvite:10.2.1] /home/harry_setiawan/.android/build-cache/3fe3f1828d09dcd0ed9ceeed0992745e309aedbe/output/AndroidManifest.xml:22:17-89
	android:name
		ADDED from [com.google.android.gms:play-services-appinvite:10.2.1] /home/harry_setiawan/.android/build-cache/3fe3f1828d09dcd0ed9ceeed0992745e309aedbe/output/AndroidManifest.xml:22:25-87
category#android.intent.category.DEFAULT
ADDED from [com.google.android.gms:play-services-appinvite:10.2.1] /home/harry_setiawan/.android/build-cache/3fe3f1828d09dcd0ed9ceeed0992745e309aedbe/output/AndroidManifest.xml:23:17-75
	android:name
		ADDED from [com.google.android.gms:play-services-appinvite:10.2.1] /home/harry_setiawan/.android/build-cache/3fe3f1828d09dcd0ed9ceeed0992745e309aedbe/output/AndroidManifest.xml:23:27-73
activity#com.google.android.gms.auth.api.signin.internal.SignInHubActivity
ADDED from [com.google.android.gms:play-services-auth:10.2.1] /home/harry_setiawan/.android/build-cache/3e610fad5124839d4eea4bd6a8671d8c361163d7/output/AndroidManifest.xml:20:9-189
	android:excludeFromRecents
		ADDED from [com.google.android.gms:play-services-auth:10.2.1] /home/harry_setiawan/.android/build-cache/3e610fad5124839d4eea4bd6a8671d8c361163d7/output/AndroidManifest.xml:20:129-162
	android:exported
		ADDED from [com.google.android.gms:play-services-auth:10.2.1] /home/harry_setiawan/.android/build-cache/3e610fad5124839d4eea4bd6a8671d8c361163d7/output/AndroidManifest.xml:20:163-187
	android:theme
		ADDED from [com.google.android.gms:play-services-auth:10.2.1] /home/harry_setiawan/.android/build-cache/3e610fad5124839d4eea4bd6a8671d8c361163d7/output/AndroidManifest.xml:20:69-128
	android:name
		ADDED from [com.google.android.gms:play-services-auth:10.2.1] /home/harry_setiawan/.android/build-cache/3e610fad5124839d4eea4bd6a8671d8c361163d7/output/AndroidManifest.xml:20:19-68
service#com.google.android.gms.auth.api.signin.RevocationBoundService
ADDED from [com.google.android.gms:play-services-auth:10.2.1] /home/harry_setiawan/.android/build-cache/3e610fad5124839d4eea4bd6a8671d8c361163d7/output/AndroidManifest.xml:24:9-184
	android:exported
		ADDED from [com.google.android.gms:play-services-auth:10.2.1] /home/harry_setiawan/.android/build-cache/3e610fad5124839d4eea4bd6a8671d8c361163d7/output/AndroidManifest.xml:24:64-87
	android:permission
		ADDED from [com.google.android.gms:play-services-auth:10.2.1] /home/harry_setiawan/.android/build-cache/3e610fad5124839d4eea4bd6a8671d8c361163d7/output/AndroidManifest.xml:24:88-182
	android:name
		ADDED from [com.google.android.gms:play-services-auth:10.2.1] /home/harry_setiawan/.android/build-cache/3e610fad5124839d4eea4bd6a8671d8c361163d7/output/AndroidManifest.xml:24:18-63
receiver#com.google.android.gms.cast.framework.media.MediaIntentReceiver
ADDED from [com.google.android.gms:play-services-cast-framework:10.2.1] /home/harry_setiawan/.android/build-cache/55651066960fd11cf1adc40ee4d371c804f6dbb0/output/AndroidManifest.xml:5:9-99
	android:name
		ADDED from [com.google.android.gms:play-services-cast-framework:10.2.1] /home/harry_setiawan/.android/build-cache/55651066960fd11cf1adc40ee4d371c804f6dbb0/output/AndroidManifest.xml:5:19-97
service#com.google.android.gms.cast.framework.media.MediaNotificationService
ADDED from [com.google.android.gms:play-services-cast-framework:10.2.1] /home/harry_setiawan/.android/build-cache/55651066960fd11cf1adc40ee4d371c804f6dbb0/output/AndroidManifest.xml:6:9-103
	android:name
		ADDED from [com.google.android.gms:play-services-cast-framework:10.2.1] /home/harry_setiawan/.android/build-cache/55651066960fd11cf1adc40ee4d371c804f6dbb0/output/AndroidManifest.xml:6:18-101
service#com.google.android.gms.cast.framework.ReconnectionService
ADDED from [com.google.android.gms:play-services-cast-framework:10.2.1] /home/harry_setiawan/.android/build-cache/55651066960fd11cf1adc40ee4d371c804f6dbb0/output/AndroidManifest.xml:7:9-92
	android:name
		ADDED from [com.google.android.gms:play-services-cast-framework:10.2.1] /home/harry_setiawan/.android/build-cache/55651066960fd11cf1adc40ee4d371c804f6dbb0/output/AndroidManifest.xml:7:18-90
service#com.google.android.gms.tagmanager.TagManagerService
ADDED from [com.google.android.gms:play-services-tagmanager-api:10.2.1] /home/harry_setiawan/.android/build-cache/cc78923e659bcf22762714b2d11e9b60189e2b34/output/AndroidManifest.xml:24:9-134
	android:enabled
		ADDED from [com.google.android.gms:play-services-tagmanager-api:10.2.1] /home/harry_setiawan/.android/build-cache/cc78923e659bcf22762714b2d11e9b60189e2b34/output/AndroidManifest.xml:24:110-132
	android:exported
		ADDED from [com.google.android.gms:play-services-tagmanager-api:10.2.1] /home/harry_setiawan/.android/build-cache/cc78923e659bcf22762714b2d11e9b60189e2b34/output/AndroidManifest.xml:24:85-109
	android:name
		ADDED from [com.google.android.gms:play-services-tagmanager-api:10.2.1] /home/harry_setiawan/.android/build-cache/cc78923e659bcf22762714b2d11e9b60189e2b34/output/AndroidManifest.xml:24:18-84
activity#com.google.android.gms.tagmanager.TagManagerPreviewActivity
ADDED from [com.google.android.gms:play-services-tagmanager-api:10.2.1] /home/harry_setiawan/.android/build-cache/cc78923e659bcf22762714b2d11e9b60189e2b34/output/AndroidManifest.xml:25:9-32:20
	android:noHistory
		ADDED from [com.google.android.gms:play-services-tagmanager-api:10.2.1] /home/harry_setiawan/.android/build-cache/cc78923e659bcf22762714b2d11e9b60189e2b34/output/AndroidManifest.xml:25:94-118
	android:name
		ADDED from [com.google.android.gms:play-services-tagmanager-api:10.2.1] /home/harry_setiawan/.android/build-cache/cc78923e659bcf22762714b2d11e9b60189e2b34/output/AndroidManifest.xml:25:19-93
intent-filter#android.intent.action.VIEW+android.intent.category.BROWSABLE+android.intent.category.DEFAULT
ADDED from [com.google.android.gms:play-services-tagmanager-api:10.2.1] /home/harry_setiawan/.android/build-cache/cc78923e659bcf22762714b2d11e9b60189e2b34/output/AndroidManifest.xml:26:13-31:29
data
ADDED from [com.google.android.gms:play-services-tagmanager-api:10.2.1] /home/harry_setiawan/.android/build-cache/cc78923e659bcf22762714b2d11e9b60189e2b34/output/AndroidManifest.xml:27:17-71
	android:scheme
		ADDED from [com.google.android.gms:play-services-tagmanager-api:10.2.1] /home/harry_setiawan/.android/build-cache/cc78923e659bcf22762714b2d11e9b60189e2b34/output/AndroidManifest.xml:27:23-69
action#android.intent.action.VIEW
ADDED from [com.google.android.gms:play-services-tagmanager-api:10.2.1] /home/harry_setiawan/.android/build-cache/cc78923e659bcf22762714b2d11e9b60189e2b34/output/AndroidManifest.xml:28:17-68
	android:name
		ADDED from [com.google.android.gms:play-services-tagmanager-api:10.2.1] /home/harry_setiawan/.android/build-cache/cc78923e659bcf22762714b2d11e9b60189e2b34/output/AndroidManifest.xml:28:25-66
category#android.intent.category.BROWSABLE
ADDED from [com.google.android.gms:play-services-tagmanager-api:10.2.1] /home/harry_setiawan/.android/build-cache/cc78923e659bcf22762714b2d11e9b60189e2b34/output/AndroidManifest.xml:30:17-77
	android:name
		ADDED from [com.google.android.gms:play-services-tagmanager-api:10.2.1] /home/harry_setiawan/.android/build-cache/cc78923e659bcf22762714b2d11e9b60189e2b34/output/AndroidManifest.xml:30:27-75
activity#com.google.android.gms.common.api.GoogleApiActivity
ADDED from [com.google.android.gms:play-services-base:10.2.1] /home/harry_setiawan/.android/build-cache/b6bc37bb0da67a020e75bc7247339f0c214db687/output/AndroidManifest.xml:19:9-172
	android:exported
		ADDED from [com.google.android.gms:play-services-base:10.2.1] /home/harry_setiawan/.android/build-cache/b6bc37bb0da67a020e75bc7247339f0c214db687/output/AndroidManifest.xml:19:146-170
	android:theme
		ADDED from [com.google.android.gms:play-services-base:10.2.1] /home/harry_setiawan/.android/build-cache/b6bc37bb0da67a020e75bc7247339f0c214db687/output/AndroidManifest.xml:19:86-145
	android:name
		ADDED from [com.google.android.gms:play-services-base:10.2.1] /home/harry_setiawan/.android/build-cache/b6bc37bb0da67a020e75bc7247339f0c214db687/output/AndroidManifest.xml:19:19-85
uses-permission#android.permission.CAMERA
ADDED from [com.embarkmobile:zxing-android-minimal:2.0.0] /home/harry_setiawan/.android/build-cache/229e2e8f12407d024745ea931e1ef0d98c3e8828/output/AndroidManifest.xml:19:3-62
MERGED from [com.embarkmobile:zxing-android-legacy:2.0.0] /home/harry_setiawan/.android/build-cache/f81e4864cf3de7587e861a8682c8b0d70c3a5fba/output/AndroidManifest.xml:19:3-62
	android:name
		ADDED from [com.embarkmobile:zxing-android-minimal:2.0.0] /home/harry_setiawan/.android/build-cache/229e2e8f12407d024745ea931e1ef0d98c3e8828/output/AndroidManifest.xml:19:20-60
uses-permission#android.permission.VIBRATE
ADDED from [com.embarkmobile:zxing-android-minimal:2.0.0] /home/harry_setiawan/.android/build-cache/229e2e8f12407d024745ea931e1ef0d98c3e8828/output/AndroidManifest.xml:20:3-63
MERGED from [com.embarkmobile:zxing-android-legacy:2.0.0] /home/harry_setiawan/.android/build-cache/f81e4864cf3de7587e861a8682c8b0d70c3a5fba/output/AndroidManifest.xml:20:3-63
	android:name
		ADDED from [com.embarkmobile:zxing-android-minimal:2.0.0] /home/harry_setiawan/.android/build-cache/229e2e8f12407d024745ea931e1ef0d98c3e8828/output/AndroidManifest.xml:20:20-61
uses-permission#android.permission.FLASHLIGHT
ADDED from [com.embarkmobile:zxing-android-minimal:2.0.0] /home/harry_setiawan/.android/build-cache/229e2e8f12407d024745ea931e1ef0d98c3e8828/output/AndroidManifest.xml:21:3-66
MERGED from [com.embarkmobile:zxing-android-legacy:2.0.0] /home/harry_setiawan/.android/build-cache/f81e4864cf3de7587e861a8682c8b0d70c3a5fba/output/AndroidManifest.xml:21:3-66
	android:name
		ADDED from [com.embarkmobile:zxing-android-minimal:2.0.0] /home/harry_setiawan/.android/build-cache/229e2e8f12407d024745ea931e1ef0d98c3e8828/output/AndroidManifest.xml:21:20-64
uses-feature#android.hardware.camera
ADDED from [com.embarkmobile:zxing-android-minimal:2.0.0] /home/harry_setiawan/.android/build-cache/229e2e8f12407d024745ea931e1ef0d98c3e8828/output/AndroidManifest.xml:27:3-82
MERGED from [com.embarkmobile:zxing-android-legacy:2.0.0] /home/harry_setiawan/.android/build-cache/f81e4864cf3de7587e861a8682c8b0d70c3a5fba/output/AndroidManifest.xml:26:3-82
	android:required
		ADDED from [com.embarkmobile:zxing-android-minimal:2.0.0] /home/harry_setiawan/.android/build-cache/229e2e8f12407d024745ea931e1ef0d98c3e8828/output/AndroidManifest.xml:27:56-80
	android:name
		ADDED from [com.embarkmobile:zxing-android-minimal:2.0.0] /home/harry_setiawan/.android/build-cache/229e2e8f12407d024745ea931e1ef0d98c3e8828/output/AndroidManifest.xml:27:17-55
uses-feature#android.hardware.camera.front
ADDED from [com.embarkmobile:zxing-android-minimal:2.0.0] /home/harry_setiawan/.android/build-cache/229e2e8f12407d024745ea931e1ef0d98c3e8828/output/AndroidManifest.xml:28:3-88
MERGED from [com.embarkmobile:zxing-android-legacy:2.0.0] /home/harry_setiawan/.android/build-cache/f81e4864cf3de7587e861a8682c8b0d70c3a5fba/output/AndroidManifest.xml:27:3-88
	android:required
		ADDED from [com.embarkmobile:zxing-android-minimal:2.0.0] /home/harry_setiawan/.android/build-cache/229e2e8f12407d024745ea931e1ef0d98c3e8828/output/AndroidManifest.xml:28:62-86
	android:name
		ADDED from [com.embarkmobile:zxing-android-minimal:2.0.0] /home/harry_setiawan/.android/build-cache/229e2e8f12407d024745ea931e1ef0d98c3e8828/output/AndroidManifest.xml:28:17-61
uses-feature#android.hardware.camera.autofocus
ADDED from [com.embarkmobile:zxing-android-minimal:2.0.0] /home/harry_setiawan/.android/build-cache/229e2e8f12407d024745ea931e1ef0d98c3e8828/output/AndroidManifest.xml:31:3-92
MERGED from [com.embarkmobile:zxing-android-legacy:2.0.0] /home/harry_setiawan/.android/build-cache/f81e4864cf3de7587e861a8682c8b0d70c3a5fba/output/AndroidManifest.xml:30:3-92
	android:required
		ADDED from [com.embarkmobile:zxing-android-minimal:2.0.0] /home/harry_setiawan/.android/build-cache/229e2e8f12407d024745ea931e1ef0d98c3e8828/output/AndroidManifest.xml:31:66-90
	android:name
		ADDED from [com.embarkmobile:zxing-android-minimal:2.0.0] /home/harry_setiawan/.android/build-cache/229e2e8f12407d024745ea931e1ef0d98c3e8828/output/AndroidManifest.xml:31:17-65
uses-feature#android.hardware.camera.flash
ADDED from [com.embarkmobile:zxing-android-minimal:2.0.0] /home/harry_setiawan/.android/build-cache/229e2e8f12407d024745ea931e1ef0d98c3e8828/output/AndroidManifest.xml:32:3-88
MERGED from [com.embarkmobile:zxing-android-legacy:2.0.0] /home/harry_setiawan/.android/build-cache/f81e4864cf3de7587e861a8682c8b0d70c3a5fba/output/AndroidManifest.xml:31:3-88
	android:required
		ADDED from [com.embarkmobile:zxing-android-minimal:2.0.0] /home/harry_setiawan/.android/build-cache/229e2e8f12407d024745ea931e1ef0d98c3e8828/output/AndroidManifest.xml:32:62-86
	android:name
		ADDED from [com.embarkmobile:zxing-android-minimal:2.0.0] /home/harry_setiawan/.android/build-cache/229e2e8f12407d024745ea931e1ef0d98c3e8828/output/AndroidManifest.xml:32:17-61
uses-feature#android.hardware.screen.landscape
ADDED from [com.embarkmobile:zxing-android-minimal:2.0.0] /home/harry_setiawan/.android/build-cache/229e2e8f12407d024745ea931e1ef0d98c3e8828/output/AndroidManifest.xml:33:3-93
MERGED from [com.embarkmobile:zxing-android-legacy:2.0.0] /home/harry_setiawan/.android/build-cache/f81e4864cf3de7587e861a8682c8b0d70c3a5fba/output/AndroidManifest.xml:32:3-93
	android:required
		ADDED from [com.embarkmobile:zxing-android-minimal:2.0.0] /home/harry_setiawan/.android/build-cache/229e2e8f12407d024745ea931e1ef0d98c3e8828/output/AndroidManifest.xml:33:66-90
	android:name
		ADDED from [com.embarkmobile:zxing-android-minimal:2.0.0] /home/harry_setiawan/.android/build-cache/229e2e8f12407d024745ea931e1ef0d98c3e8828/output/AndroidManifest.xml:33:17-65
uses-feature#android.hardware.wifi
ADDED from [com.embarkmobile:zxing-android-minimal:2.0.0] /home/harry_setiawan/.android/build-cache/229e2e8f12407d024745ea931e1ef0d98c3e8828/output/AndroidManifest.xml:34:3-80
MERGED from [com.embarkmobile:zxing-android-legacy:2.0.0] /home/harry_setiawan/.android/build-cache/f81e4864cf3de7587e861a8682c8b0d70c3a5fba/output/AndroidManifest.xml:33:3-80
MERGED from [org.osmdroid:osmdroid-android:5.6.4] /home/harry_setiawan/.android/build-cache/a2c220f32126867315c402f5f152625fb52599f6/output/AndroidManifest.xml:33:5-35:36
	android:required
		ADDED from [com.embarkmobile:zxing-android-minimal:2.0.0] /home/harry_setiawan/.android/build-cache/229e2e8f12407d024745ea931e1ef0d98c3e8828/output/AndroidManifest.xml:34:54-78
	android:name
		ADDED from [com.embarkmobile:zxing-android-minimal:2.0.0] /home/harry_setiawan/.android/build-cache/229e2e8f12407d024745ea931e1ef0d98c3e8828/output/AndroidManifest.xml:34:17-53
supports-screens
ADDED from [com.embarkmobile:zxing-android-minimal:2.0.0] /home/harry_setiawan/.android/build-cache/229e2e8f12407d024745ea931e1ef0d98c3e8828/output/AndroidManifest.xml:38:3-42:48
MERGED from [com.embarkmobile:zxing-android-legacy:2.0.0] /home/harry_setiawan/.android/build-cache/f81e4864cf3de7587e861a8682c8b0d70c3a5fba/output/AndroidManifest.xml:37:3-41:48
MERGED from [org.osmdroid:osmdroid-android:5.6.4] /home/harry_setiawan/.android/build-cache/a2c220f32126867315c402f5f152625fb52599f6/output/AndroidManifest.xml:11:5-14:40
	android:largeScreens
		ADDED from [com.embarkmobile:zxing-android-minimal:2.0.0] /home/harry_setiawan/.android/build-cache/229e2e8f12407d024745ea931e1ef0d98c3e8828/output/AndroidManifest.xml:39:21-48
	android:smallScreens
		ADDED from [com.embarkmobile:zxing-android-minimal:2.0.0] /home/harry_setiawan/.android/build-cache/229e2e8f12407d024745ea931e1ef0d98c3e8828/output/AndroidManifest.xml:41:21-48
	android:normalScreens
		ADDED from [com.embarkmobile:zxing-android-minimal:2.0.0] /home/harry_setiawan/.android/build-cache/229e2e8f12407d024745ea931e1ef0d98c3e8828/output/AndroidManifest.xml:40:21-49
	android:xlargeScreens
		ADDED from [com.embarkmobile:zxing-android-minimal:2.0.0] /home/harry_setiawan/.android/build-cache/229e2e8f12407d024745ea931e1ef0d98c3e8828/output/AndroidManifest.xml:38:21-49
	android:anyDensity
		ADDED from [com.embarkmobile:zxing-android-minimal:2.0.0] /home/harry_setiawan/.android/build-cache/229e2e8f12407d024745ea931e1ef0d98c3e8828/output/AndroidManifest.xml:42:21-46
activity#com.google.zxing.client.android.CaptureActivity
ADDED from [com.embarkmobile:zxing-android-minimal:2.0.0] /home/harry_setiawan/.android/build-cache/229e2e8f12407d024745ea931e1ef0d98c3e8828/output/AndroidManifest.xml:45:7-50:66
	android:clearTaskOnLaunch
		ADDED from [com.embarkmobile:zxing-android-minimal:2.0.0] /home/harry_setiawan/.android/build-cache/229e2e8f12407d024745ea931e1ef0d98c3e8828/output/AndroidManifest.xml:46:17-49
	android:screenOrientation
		ADDED from [com.embarkmobile:zxing-android-minimal:2.0.0] /home/harry_setiawan/.android/build-cache/229e2e8f12407d024745ea931e1ef0d98c3e8828/output/AndroidManifest.xml:47:17-60
	android:stateNotNeeded
		ADDED from [com.embarkmobile:zxing-android-minimal:2.0.0] /home/harry_setiawan/.android/build-cache/229e2e8f12407d024745ea931e1ef0d98c3e8828/output/AndroidManifest.xml:48:17-46
	android:windowSoftInputMode
		ADDED from [com.embarkmobile:zxing-android-minimal:2.0.0] /home/harry_setiawan/.android/build-cache/229e2e8f12407d024745ea931e1ef0d98c3e8828/output/AndroidManifest.xml:50:17-64
	android:theme
		ADDED from [com.embarkmobile:zxing-android-minimal:2.0.0] /home/harry_setiawan/.android/build-cache/229e2e8f12407d024745ea931e1ef0d98c3e8828/output/AndroidManifest.xml:49:17-58
	android:name
		ADDED from [com.embarkmobile:zxing-android-minimal:2.0.0] /home/harry_setiawan/.android/build-cache/229e2e8f12407d024745ea931e1ef0d98c3e8828/output/AndroidManifest.xml:45:17-79
activity#com.google.zxing.client.android.HelpActivity
ADDED from [com.embarkmobile:zxing-android-minimal:2.0.0] /home/harry_setiawan/.android/build-cache/229e2e8f12407d024745ea931e1ef0d98c3e8828/output/AndroidManifest.xml:51:7-54:48
	android:screenOrientation
		ADDED from [com.embarkmobile:zxing-android-minimal:2.0.0] /home/harry_setiawan/.android/build-cache/229e2e8f12407d024745ea931e1ef0d98c3e8828/output/AndroidManifest.xml:53:17-49
	android:label
		ADDED from [com.embarkmobile:zxing-android-minimal:2.0.0] /home/harry_setiawan/.android/build-cache/229e2e8f12407d024745ea931e1ef0d98c3e8828/output/AndroidManifest.xml:52:17-56
	android:stateNotNeeded
		ADDED from [com.embarkmobile:zxing-android-minimal:2.0.0] /home/harry_setiawan/.android/build-cache/229e2e8f12407d024745ea931e1ef0d98c3e8828/output/AndroidManifest.xml:54:17-46
	android:name
		ADDED from [com.embarkmobile:zxing-android-minimal:2.0.0] /home/harry_setiawan/.android/build-cache/229e2e8f12407d024745ea931e1ef0d98c3e8828/output/AndroidManifest.xml:51:17-76
activity#com.google.zxing.client.android.encode.EncodeActivity
ADDED from [com.embarkmobile:zxing-android-minimal:2.0.0] /home/harry_setiawan/.android/build-cache/229e2e8f12407d024745ea931e1ef0d98c3e8828/output/AndroidManifest.xml:55:7-56:51
	android:screenOrientation
		ADDED from [com.embarkmobile:zxing-android-minimal:2.0.0] /home/harry_setiawan/.android/build-cache/229e2e8f12407d024745ea931e1ef0d98c3e8828/output/AndroidManifest.xml:56:17-49
	android:name
		ADDED from [com.embarkmobile:zxing-android-minimal:2.0.0] /home/harry_setiawan/.android/build-cache/229e2e8f12407d024745ea931e1ef0d98c3e8828/output/AndroidManifest.xml:55:17-85
activity#com.google.zxing.client.androidlegacy.CaptureActivity
ADDED from [com.embarkmobile:zxing-android-legacy:2.0.0] /home/harry_setiawan/.android/build-cache/f81e4864cf3de7587e861a8682c8b0d70c3a5fba/output/AndroidManifest.xml:44:7-309
	android:clearTaskOnLaunch
		ADDED from [com.embarkmobile:zxing-android-legacy:2.0.0] /home/harry_setiawan/.android/build-cache/f81e4864cf3de7587e861a8682c8b0d70c3a5fba/output/AndroidManifest.xml:44:17-49
	android:screenOrientation
		ADDED from [com.embarkmobile:zxing-android-legacy:2.0.0] /home/harry_setiawan/.android/build-cache/f81e4864cf3de7587e861a8682c8b0d70c3a5fba/output/AndroidManifest.xml:44:133-170
	android:stateNotNeeded
		ADDED from [com.embarkmobile:zxing-android-legacy:2.0.0] /home/harry_setiawan/.android/build-cache/f81e4864cf3de7587e861a8682c8b0d70c3a5fba/output/AndroidManifest.xml:44:171-200
	android:windowSoftInputMode
		ADDED from [com.embarkmobile:zxing-android-legacy:2.0.0] /home/harry_setiawan/.android/build-cache/f81e4864cf3de7587e861a8682c8b0d70c3a5fba/output/AndroidManifest.xml:44:260-307
	android:configChanges
		ADDED from [com.embarkmobile:zxing-android-legacy:2.0.0] /home/harry_setiawan/.android/build-cache/f81e4864cf3de7587e861a8682c8b0d70c3a5fba/output/AndroidManifest.xml:44:50-100
	android:theme
		ADDED from [com.embarkmobile:zxing-android-legacy:2.0.0] /home/harry_setiawan/.android/build-cache/f81e4864cf3de7587e861a8682c8b0d70c3a5fba/output/AndroidManifest.xml:44:201-259
	android:name
		ADDED from [com.embarkmobile:zxing-android-legacy:2.0.0] /home/harry_setiawan/.android/build-cache/f81e4864cf3de7587e861a8682c8b0d70c3a5fba/output/AndroidManifest.xml:44:101-132
activity#com.google.zxing.client.androidlegacy.HelpActivity
ADDED from [com.embarkmobile:zxing-android-legacy:2.0.0] /home/harry_setiawan/.android/build-cache/f81e4864cf3de7587e861a8682c8b0d70c3a5fba/output/AndroidManifest.xml:45:7-80
	android:screenOrientation
		ADDED from [com.embarkmobile:zxing-android-legacy:2.0.0] /home/harry_setiawan/.android/build-cache/f81e4864cf3de7587e861a8682c8b0d70c3a5fba/output/AndroidManifest.xml:45:46-78
	android:name
		ADDED from [com.embarkmobile:zxing-android-legacy:2.0.0] /home/harry_setiawan/.android/build-cache/f81e4864cf3de7587e861a8682c8b0d70c3a5fba/output/AndroidManifest.xml:45:17-45
activity#com.google.zxing.client.androidlegacy.encode.EncodeActivity
ADDED from [com.embarkmobile:zxing-android-legacy:2.0.0] /home/harry_setiawan/.android/build-cache/f81e4864cf3de7587e861a8682c8b0d70c3a5fba/output/AndroidManifest.xml:46:7-89
	android:screenOrientation
		ADDED from [com.embarkmobile:zxing-android-legacy:2.0.0] /home/harry_setiawan/.android/build-cache/f81e4864cf3de7587e861a8682c8b0d70c3a5fba/output/AndroidManifest.xml:46:55-87
	android:name
		ADDED from [com.embarkmobile:zxing-android-legacy:2.0.0] /home/harry_setiawan/.android/build-cache/f81e4864cf3de7587e861a8682c8b0d70c3a5fba/output/AndroidManifest.xml:46:17-54
service#com.google.firebase.messaging.FirebaseMessagingService
ADDED from [com.google.firebase:firebase-messaging:10.2.1] /home/harry_setiawan/.android/build-cache/ac56a6af0f48494c40c4c0c0504a075fc35b6368/output/AndroidManifest.xml:23:9-27:19
	android:exported
		ADDED from [com.google.firebase:firebase-messaging:10.2.1] /home/harry_setiawan/.android/build-cache/ac56a6af0f48494c40c4c0c0504a075fc35b6368/output/AndroidManifest.xml:23:88-111
	android:name
		ADDED from [com.google.firebase:firebase-messaging:10.2.1] /home/harry_setiawan/.android/build-cache/ac56a6af0f48494c40c4c0c0504a075fc35b6368/output/AndroidManifest.xml:23:18-87
uses-feature#android.hardware.location.network
ADDED from [org.osmdroid:osmdroid-android:5.6.4] /home/harry_setiawan/.android/build-cache/a2c220f32126867315c402f5f152625fb52599f6/output/AndroidManifest.xml:24:5-26:36
	android:required
		ADDED from [org.osmdroid:osmdroid-android:5.6.4] /home/harry_setiawan/.android/build-cache/a2c220f32126867315c402f5f152625fb52599f6/output/AndroidManifest.xml:26:9-33
	android:name
		ADDED from [org.osmdroid:osmdroid-android:5.6.4] /home/harry_setiawan/.android/build-cache/a2c220f32126867315c402f5f152625fb52599f6/output/AndroidManifest.xml:25:9-57
uses-feature#android.hardware.location.gps
ADDED from [org.osmdroid:osmdroid-android:5.6.4] /home/harry_setiawan/.android/build-cache/a2c220f32126867315c402f5f152625fb52599f6/output/AndroidManifest.xml:27:5-29:36
	android:required
		ADDED from [org.osmdroid:osmdroid-android:5.6.4] /home/harry_setiawan/.android/build-cache/a2c220f32126867315c402f5f152625fb52599f6/output/AndroidManifest.xml:29:9-33
	android:name
		ADDED from [org.osmdroid:osmdroid-android:5.6.4] /home/harry_setiawan/.android/build-cache/a2c220f32126867315c402f5f152625fb52599f6/output/AndroidManifest.xml:28:9-53
uses-feature#android.hardware.telephony
ADDED from [org.osmdroid:osmdroid-android:5.6.4] /home/harry_setiawan/.android/build-cache/a2c220f32126867315c402f5f152625fb52599f6/output/AndroidManifest.xml:30:5-32:36
	android:required
		ADDED from [org.osmdroid:osmdroid-android:5.6.4] /home/harry_setiawan/.android/build-cache/a2c220f32126867315c402f5f152625fb52599f6/output/AndroidManifest.xml:32:9-33
	android:name
		ADDED from [org.osmdroid:osmdroid-android:5.6.4] /home/harry_setiawan/.android/build-cache/a2c220f32126867315c402f5f152625fb52599f6/output/AndroidManifest.xml:31:9-50
receiver#com.google.android.gms.measurement.AppMeasurementReceiver
ADDED from [com.google.firebase:firebase-analytics:10.2.1] /home/harry_setiawan/.android/build-cache/834ef20128b5b247debe7898d2270bf7da24c64e/output/AndroidManifest.xml:25:7-26:18
MERGED from [com.google.firebase:firebase-analytics-impl:10.2.1] /home/harry_setiawan/.android/build-cache/80eeec0bddad5ab33ad7d955bdbf1d1d94500053/output/AndroidManifest.xml:25:7-26:18
	android:enabled
		ADDED from [com.google.firebase:firebase-analytics:10.2.1] /home/harry_setiawan/.android/build-cache/834ef20128b5b247debe7898d2270bf7da24c64e/output/AndroidManifest.xml:25:90-112
	android:exported
		ADDED from [com.google.firebase:firebase-analytics:10.2.1] /home/harry_setiawan/.android/build-cache/834ef20128b5b247debe7898d2270bf7da24c64e/output/AndroidManifest.xml:25:113-137
	android:name
		ADDED from [com.google.firebase:firebase-analytics:10.2.1] /home/harry_setiawan/.android/build-cache/834ef20128b5b247debe7898d2270bf7da24c64e/output/AndroidManifest.xml:25:17-89
receiver#com.google.android.gms.measurement.AppMeasurementInstallReferrerReceiver
ADDED from [com.google.firebase:firebase-analytics:10.2.1] /home/harry_setiawan/.android/build-cache/834ef20128b5b247debe7898d2270bf7da24c64e/output/AndroidManifest.xml:27:7-31:18
	android:enabled
		ADDED from [com.google.firebase:firebase-analytics:10.2.1] /home/harry_setiawan/.android/build-cache/834ef20128b5b247debe7898d2270bf7da24c64e/output/AndroidManifest.xml:27:162-184
	android:permission
		ADDED from [com.google.firebase:firebase-analytics:10.2.1] /home/harry_setiawan/.android/build-cache/834ef20128b5b247debe7898d2270bf7da24c64e/output/AndroidManifest.xml:27:105-161
	android:name
		ADDED from [com.google.firebase:firebase-analytics:10.2.1] /home/harry_setiawan/.android/build-cache/834ef20128b5b247debe7898d2270bf7da24c64e/output/AndroidManifest.xml:27:17-104
intent-filter#com.android.vending.INSTALL_REFERRER
ADDED from [com.google.firebase:firebase-analytics:10.2.1] /home/harry_setiawan/.android/build-cache/834ef20128b5b247debe7898d2270bf7da24c64e/output/AndroidManifest.xml:28:11-30:27
action#com.android.vending.INSTALL_REFERRER
ADDED from [com.google.firebase:firebase-analytics:10.2.1] /home/harry_setiawan/.android/build-cache/834ef20128b5b247debe7898d2270bf7da24c64e/output/AndroidManifest.xml:29:15-76
	android:name
		ADDED from [com.google.firebase:firebase-analytics:10.2.1] /home/harry_setiawan/.android/build-cache/834ef20128b5b247debe7898d2270bf7da24c64e/output/AndroidManifest.xml:29:23-74
service#com.google.android.gms.measurement.AppMeasurementService
ADDED from [com.google.firebase:firebase-analytics:10.2.1] /home/harry_setiawan/.android/build-cache/834ef20128b5b247debe7898d2270bf7da24c64e/output/AndroidManifest.xml:32:7-137
MERGED from [com.google.firebase:firebase-analytics-impl:10.2.1] /home/harry_setiawan/.android/build-cache/80eeec0bddad5ab33ad7d955bdbf1d1d94500053/output/AndroidManifest.xml:27:7-137
	android:enabled
		ADDED from [com.google.firebase:firebase-analytics:10.2.1] /home/harry_setiawan/.android/build-cache/834ef20128b5b247debe7898d2270bf7da24c64e/output/AndroidManifest.xml:32:88-110
	android:exported
		ADDED from [com.google.firebase:firebase-analytics:10.2.1] /home/harry_setiawan/.android/build-cache/834ef20128b5b247debe7898d2270bf7da24c64e/output/AndroidManifest.xml:32:111-135
	android:name
		ADDED from [com.google.firebase:firebase-analytics:10.2.1] /home/harry_setiawan/.android/build-cache/834ef20128b5b247debe7898d2270bf7da24c64e/output/AndroidManifest.xml:32:16-87
receiver#com.google.firebase.iid.FirebaseInstanceIdReceiver
ADDED from [com.google.firebase:firebase-iid:10.2.1] /home/harry_setiawan/.android/build-cache/17da2f9da2d533fa88c07d3346a165da1a3664cb/output/AndroidManifest.xml:30:9-35:20
	android:exported
		ADDED from [com.google.firebase:firebase-iid:10.2.1] /home/harry_setiawan/.android/build-cache/17da2f9da2d533fa88c07d3346a165da1a3664cb/output/AndroidManifest.xml:30:85-108
	android:permission
		ADDED from [com.google.firebase:firebase-iid:10.2.1] /home/harry_setiawan/.android/build-cache/17da2f9da2d533fa88c07d3346a165da1a3664cb/output/AndroidManifest.xml:30:109-169
	android:name
		ADDED from [com.google.firebase:firebase-iid:10.2.1] /home/harry_setiawan/.android/build-cache/17da2f9da2d533fa88c07d3346a165da1a3664cb/output/AndroidManifest.xml:30:19-84
intent-filter#${applicationId}+com.google.android.c2dm.intent.RECEIVE
ADDED from [com.google.firebase:firebase-iid:10.2.1] /home/harry_setiawan/.android/build-cache/17da2f9da2d533fa88c07d3346a165da1a3664cb/output/AndroidManifest.xml:31:13-34:29
action#com.google.android.c2dm.intent.RECEIVE
ADDED from [com.google.firebase:firebase-iid:10.2.1] /home/harry_setiawan/.android/build-cache/17da2f9da2d533fa88c07d3346a165da1a3664cb/output/AndroidManifest.xml:32:17-80
	android:name
		ADDED from [com.google.firebase:firebase-iid:10.2.1] /home/harry_setiawan/.android/build-cache/17da2f9da2d533fa88c07d3346a165da1a3664cb/output/AndroidManifest.xml:32:25-78
category#${applicationId}
ADDED from [com.google.firebase:firebase-iid:10.2.1] /home/harry_setiawan/.android/build-cache/17da2f9da2d533fa88c07d3346a165da1a3664cb/output/AndroidManifest.xml:33:17-60
	android:name
		ADDED from [com.google.firebase:firebase-iid:10.2.1] /home/harry_setiawan/.android/build-cache/17da2f9da2d533fa88c07d3346a165da1a3664cb/output/AndroidManifest.xml:33:27-58
receiver#com.google.firebase.iid.FirebaseInstanceIdInternalReceiver
ADDED from [com.google.firebase:firebase-iid:10.2.1] /home/harry_setiawan/.android/build-cache/17da2f9da2d533fa88c07d3346a165da1a3664cb/output/AndroidManifest.xml:39:9-119
	android:exported
		ADDED from [com.google.firebase:firebase-iid:10.2.1] /home/harry_setiawan/.android/build-cache/17da2f9da2d533fa88c07d3346a165da1a3664cb/output/AndroidManifest.xml:39:93-117
	android:name
		ADDED from [com.google.firebase:firebase-iid:10.2.1] /home/harry_setiawan/.android/build-cache/17da2f9da2d533fa88c07d3346a165da1a3664cb/output/AndroidManifest.xml:39:19-92
service#com.google.firebase.iid.FirebaseInstanceIdService
ADDED from [com.google.firebase:firebase-iid:10.2.1] /home/harry_setiawan/.android/build-cache/17da2f9da2d533fa88c07d3346a165da1a3664cb/output/AndroidManifest.xml:43:9-47:19
	android:exported
		ADDED from [com.google.firebase:firebase-iid:10.2.1] /home/harry_setiawan/.android/build-cache/17da2f9da2d533fa88c07d3346a165da1a3664cb/output/AndroidManifest.xml:43:83-106
	android:name
		ADDED from [com.google.firebase:firebase-iid:10.2.1] /home/harry_setiawan/.android/build-cache/17da2f9da2d533fa88c07d3346a165da1a3664cb/output/AndroidManifest.xml:43:18-82
provider#com.google.firebase.provider.FirebaseInitProvider
ADDED from [com.google.firebase:firebase-common:10.2.1] /home/harry_setiawan/.android/build-cache/9331e37e87baeaccc66c38376acf250ed0ee799d/output/AndroidManifest.xml:6:9-194
	android:authorities
		ADDED from [com.google.firebase:firebase-common:10.2.1] /home/harry_setiawan/.android/build-cache/9331e37e87baeaccc66c38376acf250ed0ee799d/output/AndroidManifest.xml:6:19-78
	android:exported
		ADDED from [com.google.firebase:firebase-common:10.2.1] /home/harry_setiawan/.android/build-cache/9331e37e87baeaccc66c38376acf250ed0ee799d/output/AndroidManifest.xml:6:144-168
	android:initOrder
		ADDED from [com.google.firebase:firebase-common:10.2.1] /home/harry_setiawan/.android/build-cache/9331e37e87baeaccc66c38376acf250ed0ee799d/output/AndroidManifest.xml:6:169-192
	android:name
		ADDED from [com.google.firebase:firebase-common:10.2.1] /home/harry_setiawan/.android/build-cache/9331e37e87baeaccc66c38376acf250ed0ee799d/output/AndroidManifest.xml:6:79-143
meta-data#com.google.android.gms.version
ADDED from [com.google.android.gms:play-services-basement:10.2.1] /home/harry_setiawan/.android/build-cache/72fe356702d162acc755c42b4fdcfb2ad5218198/output/AndroidManifest.xml:20:9-121
	android:value
		ADDED from [com.google.android.gms:play-services-basement:10.2.1] /home/harry_setiawan/.android/build-cache/72fe356702d162acc755c42b4fdcfb2ad5218198/output/AndroidManifest.xml:20:66-119
	android:name
		ADDED from [com.google.android.gms:play-services-basement:10.2.1] /home/harry_setiawan/.android/build-cache/72fe356702d162acc755c42b4fdcfb2ad5218198/output/AndroidManifest.xml:20:20-65
