{
  "displayName": {
    "en_us": "Набір Prisma"
  },
  "color": "#f47fff",
  "contents": [
    {
      "type": "ic2:nano_saber",
      "meta": 26,
      "nbt": {},
      "amount": 1
    },
    {
      "type": "gravisuite:advanceddrill",
      "meta": 0,
      "amount": 1
    },
    {
      "type": "gravisuite:advancedchainsaw",
      "meta": 0,
      "amount": 1
    },
    {
      "type": "bloodarsenal:glass_sacrificial_dagger",
      "meta": 0,
      "nbt": {
        "sacrifice": 0
      },
      "amount": 1
    },
    {
      "type": "thermalexpansion:satchel",
      "meta": 4,
      "nbt": {
        "Accessible": 1
      },
      "amount": 1
    },
    {
      "type": "advanced_solar_panels:hybridsolarhelmet",
      "meta": 0,
      "amount": 1
    },
    {
      "type": "gravisuite:gravichestplate",
      "meta": 0,
      "amount": 1
    },
    {
      "type": "ic2:quantum_leggings",
      "meta": 26,
      "amount": 1
    },
    {
      "type": "ic2:quantum_boots",
      "meta": 26,
      "amount": 1
    },
    {
      "type": "advanced_solar_panels:machines",
      "meta": 0,
      "amount": 1
    },
    {
      "type": "appliedenergistics2:interface",
      "meta": 0,
      "amount": 4
    },
    {
      "type": "appliedenergistics2:drive",
      "meta": 0,
      "amount": 1
    },
    {
      "type": "appliedenergistics2:part",
      "meta": 56,
      "amount": 24
    },
    {
      "type": "mekanism:transmitter",
      "meta": 0,
      "nbt": {
        "tier": 2
      },
      "amount": 24
    },
    {
      "type": "mekanism:energyupgrade",
      "meta": 0,
      "amount": 8
    },
    {
      "type": "mekanism:speedupgrade",
      "meta": 0,
      "amount": 8
    },
    {
      "type": "bloodmagic:blood_rune",
      "meta": 6,
      "amount": 8
    },
    {
      "type": "mekanism:machineblock",
      "meta": 4,
      "amount": 1
    },
    {
      "type": "ic2:upgrade",
      "meta": 0,
      "amount": 32
    },
    {
      "type": "ic2:cable",
      "meta": 1,
      "nbt": {
        "type": 1,
        "insulation": 0
      },
      "amount": 24
    },
    {
      "type": "advanced_solar_panels:machines",
      "meta": 4,
      "amount": 2
    },
    {
      "type": "ic2:te",
      "meta": 75,
      "nbt": {},
      "amount": 1
    },
    {
      "type": "appliedenergistics2:part",
      "meta": 360,
      "amount": 1
    },
    {
      "type": "appliedenergistics2:controller",
      "meta": 0,
      "amount": 4
    },
    {
      "type": "appliedenergistics2:part",
      "meta": 76,
      "amount": 16
    },
    {
      "type": "appliedenergistics2:material",
      "meta": 39,
      "amount": 2
    },
    {
      "type": "appliedenergistics2:material",
      "meta": 38,
      "amount": 2
    },
	{
      "type": "enderio:block_alloy_smelter",
      "meta": 0,
      "amount": 1
    },
    {
      "type": "botania:pool",
      "meta": 3,
      "amount": 2
    },
    {
      "type": "botania:spreader",
      "meta": 3,
      "amount": 2
    },
    {
      "type": "botania:pylon",
      "meta": 2,
      "amount": 4
    },
    {
      "type": "botania:specialflower",
      "meta": 0,
      "nbt": {
        "type": "gourmaryllis"
      },
      "amount": 8
    },
    {
      "type": "enderio:item_basic_capacitor",
      "meta": 1,
      "amount": 4
    },
    {
      "type": "enderio:item_magnet",
      "meta": 0,
      "amount": 1
    },
    {
      "type": "bloodmagic:blood_rune",
      "meta": 1,
      "amount": 16
    }
  ]
}