{
  "ZsoZi752SRlLgYD9": {
    "bHtiNI2dXhAeP0NP": "#CC3333CC"
  },
  "u7VjJXRxdxSWqrlf": {
    "bHtiNI2dXhAeP0NP": "#CC4C4CCC"
  },
  "NWhbQNTzpAKNWgd": {
    "bHtiNI2dXhAeP0NP": "#33CC33CC"
  },
  "XuyQyG8xSDcA8LFH": {
    "bHtiNI2dXhAeP0NP": "#3333CCCC"
  },
  "B2XPvIBh1n8y589S": {
    "bHtiNI2dXhAeP0NP": "#CC3333CC"
  },
  "GI5EOcsrYgsCTUvC": {
    "bHtiNI2dXhAeP0NP": "#CC4C4CCC"
  },
  "PG6OnHDr78w6zP0V": {
    "bHtiNI2dXhAeP0NP": "#33CCCCCC"
  },
  "WTBvjeOrNjQV4Bmc": {
    "bHtiNI2dXhAeP0NP": "#CC4C4CCC"
  },
  "lO1T8Aqs5XZpUV7Z": {
    "bHtiNI2dXhAeP0NP": "#CCCC33CC"
  },
  "YcbZeEZvJyJRcpqd": {
    "bHtiNI2dXhAeP0NP": "#CC3333CC"
  },
  "yJ3AGWviM8kPnlXm": {
    "bHtiNI2dXhAeP0NP": "#CC4C4CCC"
  },
  "fkIdmANhTiGd0tOF": {
    "bHtiNI2dXhAeP0NP": "#CC33CCCC"
  }
}