// Jest Snapshot v1, https://goo.gl/fbAQLP

exports[`the name input component when requireAuth is falsey matches the view snapshot 1`] = `
<body>
  <div>
    
      
  
    <div
      class="gl-flex gl-align-center gl-mb-2"
    >
      
    
      <div
        class="gl-text-heavy gl-max-w-30 gl-text-overflow-ellipsis gl-overflow-hidden gl-white-space-nowrap"
      >
        
      Review for merge request
      
        <a
          class="gl-blue-600 gl-no-underline"
          href="undefined/undefined/merge_requests/undefined"
          rel="noopener noreferrer"
          target="_blank"
        >
          !undefined
        </a>
        
    
      </div>
      
    
      <div
        class="gl-ml-auto gl-mr-3 gl-border-w-1 gl-border-left-solid gl-border-left-gray-200 gl-pl-2 gl-line-height-normal"
      >
        
      
        <button
          class="gl-blue-600 gl-no-underline gl-underline-hover gitlab-link-button gl-text-heavy"
          id="gitlab-change-mr"
        >
          Change MR
        </button>
        
    
      </div>
      
  
    </div>
    

      
    
    <div
      id="gitlab-name-fields-wrapper"
    >
      
      
      <div>
        
        
        <label
          class="gl-inline-block gl-text-heavy gl-w-100p gl-mb-1"
          for="gitlab-add-name"
        >
          Reviewer name
        </label>
        
        
        <input
          aria-required="true"
          class="gl-w-100p gl-border-gray-200 gl-border-solid gl-border-w-1 gl-border-r-1 gl-py-05 gl-px-2 gl-min-h-5 gl-text-normal gl-box-sizing-border-box"
          id="gitlab-add-name"
          name="gitlab-add-name"
          placeholder="John Doe or Anonymous"
          type="text"
          value=""
        />
        
      
      </div>
      
      
      <div
        class="gl-mt-2"
      >
        
        
        <label
          class="gl-inline-block gl-text-heavy gl-w-100p gl-mb-1"
          for="gitlab-add-email"
        >
          Reviewer email (optional)
        </label>
        
        
        <input
          aria-required="true"
          class="gl-w-100p gl-border-gray-200 gl-border-solid gl-border-w-1 gl-border-r-1 gl-py-05 gl-px-2 gl-min-h-5 gl-text-normal gl-box-sizing-border-box"
          id="gitlab-add-email"
          name="gitlab-add-email"
          placeholder="john.doe@gitlab.com"
          type="text"
          value=""
        />
        
      
      </div>
      
    
    </div>
    
  
      
    <div
      class="gl-flex gl-justify-flex-end gl-mt-4"
    >
      
        
      <button
        class="gitlab-button gitlab-button-secondary"
        id="gitlab-add-name-cancel-button"
        style="
  -webkit-appearance: none;
"
        type="button"
      >
        Change review
      </button>
      
        
      <button
        class="gitlab-button gitlab-button-success"
        id="gitlab-add-name-button"
        style="
  -webkit-appearance: none;
"
        type="button"
      >
        Submit review
      </button>
      
      
    </div>
    
    
  </div>
  
  
</body>
`;

exports[`the name input component when requireAuth is truthy matches the view snapshot 1`] = `
<body>
  <div>
    
      
  
    <div
      class="gl-flex gl-align-center gl-mb-2"
    >
      
    
      <div
        class="gl-text-heavy gl-max-w-30 gl-text-overflow-ellipsis gl-overflow-hidden gl-white-space-nowrap"
      >
        
      Review for merge request
      
        <a
          class="gl-blue-600 gl-no-underline"
          href="undefined/undefined/merge_requests/undefined"
          rel="noopener noreferrer"
          target="_blank"
        >
          !undefined
        </a>
        
    
      </div>
      
    
      <div
        class="gl-ml-auto gl-mr-3 gl-border-w-1 gl-border-left-solid gl-border-left-gray-200 gl-pl-2 gl-line-height-normal"
      >
        
      
        <button
          class="gl-blue-600 gl-no-underline gl-underline-hover gitlab-link-button gl-text-heavy"
          id="gitlab-change-mr"
        >
          Change MR
        </button>
        
    
      </div>
      
  
    </div>
    

      
    
    <div
      id="gitlab-pat-field-wrapper"
    >
      
      
      <label
        class="gl-inline-block gl-text-heavy gl-w-100p gl-mb-1"
        for="gitlab-add-pat"
      >
        Personal Access Token
      </label>
      
      
      <input
        aria-required="true"
        class="gl-w-100p gl-border-gray-200 gl-border-solid gl-border-w-1 gl-border-r-1 gl-py-05 gl-px-2 gl-min-h-5 gl-text-normal gl-box-sizing-border-box"
        id="gitlab-add-pat"
        name="gitlab-add-pat"
        type="password"
        value=""
      />
      
      
      <div
        class="gl-gray-700 gl-my-2 gl-text-light"
      >
        
        You must provide a 
        <a
          class="gl-blue-600 gl-no-underline"
          href="https://docs.gitlab.com/ee/user/profile/personal_access_tokens.html#creating-a-personal-access-token"
          rel="noopener noreferrer"
          target="_blank"
        >
          personal access token
        </a>
         that is granted the "api" scope.
      
      </div>
      
    
    </div>
    
  
      
    <div
      class="gl-flex gl-justify-flex-end gl-mt-4"
    >
      
        
      <button
        class="gitlab-button gitlab-button-secondary"
        id="gitlab-add-pat-cancel-button"
        style="
  -webkit-appearance: none;
"
        type="button"
      >
        Change review
      </button>
      
        
      <button
        class="gitlab-button gitlab-button-success"
        id="gitlab-add-pat-button"
        style="
  -webkit-appearance: none;
"
        type="button"
      >
        Submit review
      </button>
      
      
    </div>
    
    
  </div>
  
  
</body>
`;

exports[`the name input component when requireAuth is undefined matches the view snapshot 1`] = `
<body>
  <div>
    
      
  
    <div
      class="gl-flex gl-align-center gl-mb-2"
    >
      
    
      <div
        class="gl-text-heavy gl-max-w-30 gl-text-overflow-ellipsis gl-overflow-hidden gl-white-space-nowrap"
      >
        
      Review for merge request
      
        <a
          class="gl-blue-600 gl-no-underline"
          href="undefined/undefined/merge_requests/undefined"
          rel="noopener noreferrer"
          target="_blank"
        >
          !undefined
        </a>
        
    
      </div>
      
    
      <div
        class="gl-ml-auto gl-mr-3 gl-border-w-1 gl-border-left-solid gl-border-left-gray-200 gl-pl-2 gl-line-height-normal"
      >
        
      
        <button
          class="gl-blue-600 gl-no-underline gl-underline-hover gitlab-link-button gl-text-heavy"
          id="gitlab-change-mr"
        >
          Change MR
        </button>
        
    
      </div>
      
  
    </div>
    

      
    
    <div
      id="gitlab-name-fields-wrapper"
    >
      
      
      <div>
        
        
        <label
          class="gl-inline-block gl-text-heavy gl-w-100p gl-mb-1"
          for="gitlab-add-name"
        >
          Reviewer name
        </label>
        
        
        <input
          aria-required="true"
          class="gl-w-100p gl-border-gray-200 gl-border-solid gl-border-w-1 gl-border-r-1 gl-py-05 gl-px-2 gl-min-h-5 gl-text-normal gl-box-sizing-border-box"
          id="gitlab-add-name"
          name="gitlab-add-name"
          placeholder="John Doe or Anonymous"
          type="text"
          value=""
        />
        
      
      </div>
      
      
      <div
        class="gl-mt-2"
      >
        
        
        <label
          class="gl-inline-block gl-text-heavy gl-w-100p gl-mb-1"
          for="gitlab-add-email"
        >
          Reviewer email (optional)
        </label>
        
        
        <input
          aria-required="true"
          class="gl-w-100p gl-border-gray-200 gl-border-solid gl-border-w-1 gl-border-r-1 gl-py-05 gl-px-2 gl-min-h-5 gl-text-normal gl-box-sizing-border-box"
          id="gitlab-add-email"
          name="gitlab-add-email"
          placeholder="john.doe@gitlab.com"
          type="text"
          value=""
        />
        
      
      </div>
      
    
    </div>
    
  
      
    <div
      class="gl-flex gl-justify-flex-end gl-mt-4"
    >
      
        
      <button
        class="gitlab-button gitlab-button-secondary"
        id="gitlab-add-name-cancel-button"
        style="
  -webkit-appearance: none;
"
        type="button"
      >
        Change review
      </button>
      
        
      <button
        class="gitlab-button gitlab-button-success"
        id="gitlab-add-name-button"
        style="
  -webkit-appearance: none;
"
        type="button"
      >
        Submit review
      </button>
      
      
    </div>
    
    
  </div>
  
  
</body>
`;
