Ashburn,96857
New York,73606
East Lansing,68135
Fremont,59389
Mountain View,56637
Galloway,47498
Menlo Park,41849
Provo,35775
Los Angeles,30781
Potwin,27618
Pasadena,25347
San Jose,23640
Columbus,19230
Scottsdale,18850
San Francisco,18762
Manassas,13485
Las Vegas,11261
Boston,10336
N/A,9934
San Mateo,9307
San Antonio,9267
Chicago,8686
Houston,8659
Kansas City,8637
Rochester,8533
Seattle,7352
Bradenton,7188
McLean,6757
San Diego,6696
Orange,6633
Atlanta,6078
Austin,5575
Burbank,5545
Newark,5446
Philadelphia,5383
Cambridge,4662
Riverside,4623
Pittsburgh,4531
Washington,4365
Millville,4327
Dallas,4249
Ann Arbor,4017
San Leandro,3955
Torrance,3950
Walnut,3862
Bethesda,3497
Sunnyvale,3355
Berkeley,3231
Tempe,3168
Lexington,3077
Cincinnati,2958
Omaha,2753
New Haven,2738
Pleasantville,2632
Sacramento,2626
Orlando,2607
Portland,2563
Cupertino,2539
Honolulu,2503
Denver,2295
Baltimore,2232
Arlington,2197
Lebanon,2075
Charlotte,2065
Wilmington,2019
Phoenix,1985
St. Louis,1942
Madison,1924
Buffalo,1921
Matawan,1913
Minneapolis,1886
Bellevue,1879
Tampa,1806
Lubbock,1789
Miami,1728
Evanston,1718
State College,1683
Allentown,1666
Salt Lake City,1641
Albany,1627
Athens,1598
Stanford,1592
Fayetteville,1530
Waldo,1502
Cleveland,1488
Columbia,1483
Henrietta,1471
Bellaire,1459
New Iberia,1453
Millbury,1434
Starkville,1398
Gainesville,1355
Raleigh,1344
Durham,1313
Jackson,1288
Hattiesburg,1267
Oakland,1266
Santa Clara,1230
University City,1225
Birmingham,1222
Fulton,1131
Toledo,1123
Worcester,1102
Akron,1098
Milwaukee,1069
Santa Clarita,1063
Tulsa,1043
Nashville,1030
Fort Worth,1029
Somerville,1023
Wynantskill,1021
Lafayette,1019
Goulds,1018
Indianapolis,1011
Baton Rouge,1000
Brookings,994
Tallahassee,989
Wichita,986
Piscataway Township,985
College Station,976
Albuquerque,966
West Lafayette,955
Dixon,953
Cookeville,951
O'Fallon,948
Tucson,946
Herndon,940
Richmond,937
Norman,936
Oxford,933
Redmond,891
Princeton,890
Redwood City,881
Cannon Falls,857
Lawrence,854
Irvine,849
Louisville,830
Secaucus,793
Elk Grove Village,788
Corvallis,763
Des Moines,751
New Orleans,745
Knoxville,742
Winthrop,737
Carbondale,732
Reynoldsburg,725
Henderson,725
Lincoln,716
Miami Springs,705
Forsyth,701
Marion,689
Fort Lauderdale,685
Blacksburg,676
Mansfield,670
League City,669
Jupiter,666
Aurora,658
Rapid City,657
Huntsville,650
Eugene,650
Boydton,627
Charlottesville,626
Brookline,617
Carlsbad,616
Palo Alto,616
DeKalb,605
Bryan,605
Woburn,602
Walnut Creek,588
Ashland,586
Auburn,584
Dover,581
Burlington,574
Springfield,574
Alfred,572
Troy,571
Johnson City,547
Roslyn Heights,538
Ruston,535
Murrieta,533
Providence,532
Plano,527
Raritan,524
Avon,523
Urbana,522
Savannah,516
Cold Spring Harbor,512
Winter Haven,509
Jamestown,504
Shreveport,502
Draper,501
Jacksonville,501
Bloomington,495
Andover,494
Wyomissing,491
Waltham,489
Asheville,488
Pullman,488
Reno,484
North Potomac,481
Morgan Hill,478
Creswell,466
Bowling Green,458
Bethlehem,456
Detroit,452
Silver Spring,452
Emeryville,451
Little Rock,450
Greensboro,444
South Bend,434
Beltsville,430
Rockville,429
Stone Mountain,428
Statesboro,426
Santa Barbara,422
North Brunswick Township,419
Coral Gables,417
Pelham,411
Santa Cruz,407
Dayton,404
Fort Collins,403
Belmont,402
Grand Rapids,393
Boulder,386
Chapel Hill,383
Chantilly,379
Colfax,377
Tustin,375
Arcata,372
Ithaca,372
Jersey City,370
Hayward,366
Charleston,361
Beverly Hills,356
Reading,356
Kensington,351
Christiansburg,349
Diamond Bar,349
Morgantown,347
Syracuse,346
Bellingham,346
North Kansas City,343
Fairborn,342
Newton,342
Grand Forks,339
Fairfax,336
Tamarac,336
Westford,334
Sand Springs,329
Ames,328
Castaic,327
Needham,322
Long Beach,318
Saint Paul,317
Brentwood,317
Decatur,313
Winston-Salem,308
South Kingstown,307
Erlanger,306
El Cajon,304
Scarsdale,303
Cheyenne,302
Walla Walla,302
Watertown,299
Salinas,299
Dunwoody,299
Middletown,298
Greenville,298
Camp Hill,295
El Paso,293
Hillsborough,292
Colorado Springs,291
Potsdam,291
Lakewood,288
Palmdale,285
Montclair,284
Dearborn,282
Boca Raton,281
Lake Worth,280
Glen Mills,277
Rancho Santa Fe,275
Russellville,275
Atlantic Mine,275
Utica,275
Sioux Falls,275
Arcadia,274
Woodbury,274
Toney,269
Morristown,269
Lady Lake,268
Stillwater,268
Shaker Heights,267
Tacoma,267
Hamburg,266
Rolla,266
Vashon,264
Whittier,263
Milford,262
Marietta,262
Ridge,255
Tioga,255
Bothell,254
LaCrosse,252
Roanoke,250
Beaverton,248
Winter Park,247
San Luis Obispo,246
Davidson,246
Vancouver,245
Richardson,242
Edison,240
District Heights,240
Montgomery Village,239
Ypsilanti,238
Evansville,238
Augusta,237
Alameda,234
Corpus Christi,234
Duluth,234
Lowell,233
Elizabethton,230
Memphis,229
Auburn Hills,229
Morrisville,228
Potomac,225
Kirkland,223
Waialua,222
Hephzibah,221
New City,221
Amherst,219
South Orange,218
Redondo Beach,218
Damascus,218
Liberty,217
Windham,217
Hyattsville,214
Glen Haven,213
Peoria,213
Santa Rosa,212
Huntington,212
Apopka,212
Fargo,211
Frederick,211
Solana Beach,209
Anchorage,209
Alpharetta,206
Waynesboro,206
Lancaster,205
New Rochelle,204
Alexandria,202
Arlington Heights,200
Natick,198
Spring,198
Clarksville,197
Norfolk,196
Edinburg,195
Glendale,195
Bakersfield,195
San Marcos,193
Weymouth,192
Everett,188
Medford,188
Stony Brook,188
Golden,186
Denton,185
Apex,184
Fort Lee,184
Iowa City,183
Setauket- East Setauket,183
Schertz,182
Jefferson City,182
Lombard,180
Tuxedo Park,176
Hoboken,176
Champaign,175
Merrimack,174
Pantego,174
Quincy,174
Culver City,174
Smithtown,172
Carmel,172
Thornton,172
Santa Fe,171
Ellicott City,171
Miamisburg,171
Mishawaka,171
Goleta,170
Catonsville,169
Lansing,169
Shoreline,168
Saint Johns,168
Las Cruces,168
Ontario,168
Gaithersburg,167
Carrollton,166
New Albany,166
Chevy Chase,165
West Columbia,165
Holden,164
Friendswood,164
Meriden,164
Claremont,162
Rye,160
Terre Haute,159
Palm Beach Gardens,159
Katy,159
Milpitas,158
Hialeah,157
Mesquite,157
Hummelstown,156
Conley,156
Boise,156
Farmington Hills,156
Arvada,154
Salem,154
San Carlos,153
Overland Park,153
McCammon,153
Wellsville,152
Galveston,151
Danvers,150
Huntington Beach,150
Sherman,150
Dublin,149
Weatherford,149
Warner Robins,149
Ravenna,148
Mount Pleasant,148
South Lyon,148
Pleasanton,148
Green Brook Township,147
Parma,147
Melbourne,147
Riverhead,147
Falls Church,147
Sugar Land,147
Kent,146
Oak Ridge,146
Indio,145
West Valley City,145
Missoula,145
Oak Park,145
Malden,145
Franklin,145
Oregon,144
Mesa,144
Parkville,144
Fenton,143
Annandale,143
Ankeny,142
Melrose,142
Pacifica,141
Loveland,141
Concord,140
Woodbine,140
Wauwatosa,140
Anaheim,139
Largo,139
Springfield Township,139
Vestal,139
Warrenton,139
Vermillion,138
LaFayette,137
Yorktown Heights,137
White Plains,136
Chandler,134
Nevada,134
Hicksville,133
Yonkers,133
Elizabeth,133
Kaneohe,132
Saint Peters,131
Clemson,131
Maryville,130
Manchester,129
Binghamton,128
Cherry Hill,128
Cleveland Heights,128
Rockford,127
Pennsauken Township,127
Fairbanks,126
Delaware City,126
Lynnwood,125
Monroe,124
Spring Valley,124
Commerce,124
Stockton,123
Pensacola,121
Keller,121
Rochester Hills,118
McKinney,118
Gibsonia,118
Pomona,118
Westminster,117
Laredo,117
Clinton,116
Olympia,116
Swartz Creek,116
Murfreesboro,116
Carrboro,115
Aptos,115
Queen Creek,115
La Habra,115
Cortlandt,114
Corona,114
Tukwila,113
Toms River,113
Hyde Park,113
Kalamazoo,112
Blue Bell,112
Mission Viejo,112
Jonesborough,112
Fairfield,112
Hanover,111
Absecon,111
North Miami Beach,111
Chesterfield,111
Cuyahoga Falls,111
Plainsboro Center,111
Costa Mesa,109
Winters,109
Ogden,108
Pflugerville,108
Nashua,107
Buena Park,107
Lilburn,107
Eureka,107
Sherborn,107
Grover Beach,106
Purcellville,106
Ukiah,106
Wheaton,106
College Park,106
San Rafael,105
Schenectady,104
Jonesboro,103
Santee,103
Doral,103
Northport,103
Skokie,102
Country Lake Estates,102
Macomb,102
Sarasota,100
Hendersonville,99
Pembroke Pines,99
Danbury,99
Highland Park,99
Kuna,99
Erie,99
Mount Laurel,98
Gilbert,98
Hamilton,98
Placerville,98
Murray,98
Hesperia,98
Lee,98
Brockton,97
Plymouth,97
Saint Peter,96
Carmel-by-the-Sea,96
Hamden,96
Hemet,95
Santa Ana,95
Brownsville,95
Warrensville Heights,95
North Haven,95
Saratoga Springs,94
Centereach,93
Hilo,92
Garland,92
Loma Linda,92
Spring Hill,92
Lynchburg,92
Northampton,91
Hudson,91
Camarillo,91
Tuskegee,91
Monrovia,90
Fullerton,89
Olean,88
Clayton,88
New Brunswick,88
Middlesex,87
Empire,87
Westmont,87
Miramar,86
Framingham,86
Muskogee,86
Bentonville,86
Acton,85
Sebastopol,85
Topanga,85
Greenwood,85
Commerce Charter Township,85
Newington,84
Midland,84
Pringle,84
Penn Valley,84
Hershey,84
Falmouth,83
Martinez,83
Garden Grove,83
Woodbridge,83
Spokane,83
Montgomery,83
Danville,83
Evans,82
Hockessin,82
Alhambra,82
Mandeville,82
Union,81
Corinth,81
Saginaw,81
Fort Myers,81
Northfield,81
South Miami,81
Metairie,80
Union City,80
Clemmons,80
Orangeburg,80
Cary,80
Eastlake,79
Pearland,79
Vallejo,78
Winchester,78
El Segundo,78
Newport News,78
Santa Monica,78
Grapevine,78
Joliet,78
River Falls,78
Town 'n' Country,77
Franklin Township,77
Worthington,77
West Haven,77
El Cerrito,77
Richland,77
Eau Claire,77
Pawtucket,77
Sparks,76
Greenlawn,76
Fort Wayne,76
Woodland,75
Lakeville,75
Georgetown,75
San Bruno,74
Lillington,73
Tuscaloosa,73
Folsom,73
Groton,73
Farmington,73
Los Alamos,73
Ashford,72
Caldwell,72
Cranston,72
Goffstown,72
Woodford,72
Salisbury,72
Marlborough,72
Leesburg,72
Helotes,72
Ochopee,71
Poughkeepsie,71
Duarte,71
Conway,71
Dix Hills,70
Doylestown,70
New Brighton,70
Temple Terrace,70
Woodridge,70
Glen Burnie,69
Eden Prairie,69
Webster Groves,69
Zionsville,69
Dedham,69
San Anselmo,68
Glencoe,68
Chino,68
Arnold,68
Keene,68
Lakewood Township,68
Bridgeport,67
Altadena,67
Flint,67
Fresno,67
Chelmsford,67
Hightstown,67
Bozeman,67
Peterborough,66
Lyndhurst,66
Oswego,66
Aliso Viejo,66
Canonsburg,65
Hartford,65
Hempstead,65
Suwanee,65
Flagstaff,65
Central,64
Deerfield Beach,64
South Lake Tahoe,64
West Linn,64
Jenkintown,64
Broken Arrow,63
Sandy,63
West Hartford,63
Roseville,63
Hopatcong,63
Laramie,63
Lawrenceville,63
Shorewood,63
Byron,63
Reston,63
Wakefield,63
Thonotosassa,62
Virginia Beach,62
West Boylston,62
Westlake Village,62
Shepherdstown,62
Northborough,62
Spring House,62
Laurel,62
Miami Beach,62
Attleboro,62
Scranton,61
Mobile,61
Woodburn,61
Lindenhurst,61
Issaquah,61
El Dorado Hills,61
Gardena,61
Bedford,61
Belleview,60
Topeka,60
Downers Grove,60
Felton,60
Sterling,60
Murphys,60
Saint Cloud,60
Abilene,60
Baytown,60
Novato,60
Los Altos Hills,59
Cayce,59
Potomac Falls,59
Johnston,59
Lee's Summit,59
Millbrook,58
Boone,58
Macon,58
Longmeadow,58
Irving,58
Allendale Charter Township,58
Elyria,57
Chelsea,57
Marquette,57
Canton,57
Cypress,56
Moscow,56
Davie,56
Weston,56
Pine Hill,56
Normal,56
Lemont,56
Escondido,56
Norwich,56
Springdale,56
Monroe Township,56
Rio Rancho,56
Jericho,56
Harahan,55
Moreno Valley,55
Euclid,55
Culpeper,55
Saint Petersburg,55
Thousand Oaks,55
Beaumont,55
Round Rock,55
Appleton,55
Winton,55
Newport,54
Magnolia,54
Price,54
Billerica,54
Lansdowne,54
Mission,54
West Des Moines,54
Denham Springs,54
York,54
Logan,53
Lansdale,53
Ventura,53
Harrison,53
Butte,53
Stafford,53
Acworth,53
Farmingdale,53
Grinnell,53
Bend,53
Overland,53
Wells,52
King City,52
Centennial,52
Fairport,52
Lexington Park,51
New Britain,51
Mankato,51
Norton,51
Clifton,51
Hopkins,51
Vestavia Hills,51
Florham Park,51
Garden City,51
Pottstown,51
Brea,50
Towson,50
Clarks Summit,50
Harrisonburg,50
Chickasha,50
Williamsburg,50
Bethel,50
Somerdale,50
Palos Verdes Estates,50
Layton,50
Orting,50
Wellesley,50
Edmond,50
Biddeford,49
Ellenwood,49
Davis,49
Woodstock,49
Littleton,49
Palmyra,49
Milwaukie,49
Methuen,49
Temple City,49
West Windsor Township,48
Coventry,48
Ballwin,48
Holland,48
East Lyme,48
Ocean View,48
Orem,48
Wappingers Falls,47
Oviedo,47
Brown Deer,47
Stamford,47
Grand Junction,47
Scotts Valley,47
Palatine,47
Grants Pass,47
Glenview,47
Blaine,47
North Little Rock,47
Moorestown,47
Westfield,46
Lompoc,46
Bel Air,46
Campbell,46
Shirley,46
Lake Forest,46
Yorktown,46
Half Moon Bay,46
Howell,46
Trumbull,46
Pendleton,45
Panama City,45
Plainfield,45
Old Westbury,45
Conroe,45
Riverview,45
Owosso,45
Greenfield,45
Weaverville,45
Warren,45
Maynard,45
Maplewood,45
Barre,45
Harrisonville,45
Savoy,45
Windermere,44
Monticello,44
Rancho Palos Verdes,44
Westwood,44
North Chicago,44
Covington,44
Merced,44
Flint Hill,44
Redding,44
Paramount,44
Villanova,44
Westerville,44
Moraga,44
La Mesa,43
Castro Valley,43
Lititz,43
Vista,43
Glassboro,43
Wilsonville,43
Broomfield,43
Streetsboro,43
Vienna,43
Summerville,42
Elkhart,42
Myrtle Beach,42
Kingsport,42
Owings Mills,42
Farmers Branch,42
Florida,42
Pikesville,42
Hagerstown,42
Bayonne,42
Ardsley,42
Waukegan,42
Bridgewater,42
La Vergne,42
Norcross,42
Naples,42
Interlaken,42
Cedar Rapids,41
Cocoa Beach,41
Brookfield,41
Redlands,41
Guilderland,40
Shinnston,40
Middleburg,40
Webster,40
Pollock,40
Berwyn,40
La Verne,40
Moorhead,40
Marina,39
Conyers,39
Ossining,39
Manlius,39
Shrewsbury,39
Cranberry Township,39
New Kensington,39
Irvington,39
Haslet,39
Warsaw,39
Excelsior,39
Fair Lawn,39
Hutchinson,39
Buxton,38
Hebron,38
Coppell,38
Mamaroneck,38
Valparaiso,38
Beaver Falls,38
Albertville,38
East Rutherford,38
Irmo,38
Circleville,38
Coral Springs,37
Waco,37
San Ramon,37
New Castle,37
Jefferson,37
Livonia,37
East Providence,37
Sudbury,37
Minnetonka,36
Cornwall,36
Coatesville,36
Wausau,36
Pinecrest,36
Strafford,36
Mill Valley,36
Williston,36
East Orange,36
Hornell,36
Winter Springs,36
Ada,36
Mequon,36
Swarthmore,35
Millbrae,35
Creve Coeur,35
Sparta Township,35
Pocatello,35
Red Hook,35
Daly City,35
Sunderland,35
Oak Harbor,35
Douglasville,35
Englewood,35
Parsippany-Troy Hills,35
Woodinville,35
West Monroe,34
Sanford,34
Maryland Heights,34
Little Elm,34
Arlee,34
Cabot,34
Randolph,34
Triadelphia,34
Eastover,34
Lake Villa,34
Shoreview,34
Cape Girardeau,34
Lynwood,34
Falcon Heights,34
Trenton,34
Portsmouth,34
Littlerock,34
Brunswick,34
Irwin,33
San Bernardino,33
Pleasant Prairie,33
Avondale,33
Menomonie,33
Aberdeen,33
Traverse City,33
Gastonia,33
Clovis,33
Dyer,33
Bacliff,33
Wexford,33
North Bend,33
Idaho Falls,33
Savage,33
Fitchburg,33
Montecito,33
Poway,33
Muncie,33
Rancho Cucamonga,33
Bennett,33
Superior,33
Marina del Rey,33
Warwick,33
Helena,33
Longwood,33
Valley Cottage,32
Saugus,32
West Allis,32
Oregon City,32
Kearns,32
Wooster,32
Wyckoff,32
Greenwood Village,32
Allen,32
Sharon,32
Bangor,32
Apple Valley,32
Southampton,32
Chaska,32
Winston,32
Paramus,31
Chesapeake,31
Rockport,31
Sterling Heights,31
Waipahu,31
Lake Jackson,31
Frankfort,31
Florence,31
Kenmore,31
Fredericksburg,31
Kissimmee,31
Covina,31
Crossville,31
Westlake,31
Rohnert Park,31
Colonie,31
Greeley,31
Dartmouth,31
Chula Vista,31
Norwalk,31
Sycamore,31
South Euclid,31
East Haven,31
Oak Lawn,31
Lewiston,31
Roswell,31
West Palm Beach,31
Batavia,31
Northbrook,30
Medley,30
Lake Oswego,30
Bismarck,30
Manhattan Beach,30
Pepper Pike,30
Chino Hills,30
Kenosha,30
Herriman,30
Renton,30
Haverford,30
Longmont,30
Robinson,30
Greenbelt,30
Livingston,30
Cockeysville,30
Chico,30
La Crosse,30
Granite Bay,30
Harrisburg,30
Royersford,30
Lewisburg,30
Tarrytown,30
Addison,30
Highland,30
Rehoboth,30
Collegeville,30
Lutherville-Timonium,30
McFarland,30
Federal Heights,29
Victorville,29
Cedar Falls,29
Strongsville,29
Kirksville,29
Fairmont,29
Rowland Heights,29
Spokane Valley,29
Sheldon,29
Pekin,29
Kailua-Kona,29
Dracut,29
Bourbonnais,29
Rutherford,29
Manhasset,29
Hodgkins,29
Elizabethtown,29
Ooltewah,29
Watkinsville,29
Manalapan Township,29
Zanesville,29
Lake Forest Park,28
Cathlamet,28
Emporia,28
Troutville,28
Gardner,28
Kokomo,28
DeLand,28
Hackensack,28
Bound Brook,28
Lake Charles,28
Humble,28
Sevierville,28
Fishers,28
Watervliet,28
Los Gatos,28
Commerce City,28
Watsonville,28
Elkton,28
Essex,28
Oldsmar,28
Roslyn,28
West Chester,28
Dubuque,27
King of Prussia,27
Palmetto Bay,27
Glenmont,27
Beverly,27
Olivette,27
Wadsworth,27
Rancho Cordova,27
Prior Lake,27
Martinsburg,27
Owensboro,27
Lake Stevens,27
Pinole,27
Wilmette,27
Philomath,27
Shelby,27
Ellington,27
Elmont,27
Meridian,27
Hillsboro,27
Milton,27
Northville,27
Hastings,27
Gig Harbor,27
Decorah,27
Buford,26
Lewisville,26
Rhinebeck,26
Cedar City,26
West Orange,26
Waterbury,26
Lithonia,26
Glen Ellyn,26
Harrisville,26
Ganado,26
Sidney,26
West New York,26
Meridian charter Township,26
Searcy,26
Bremerton,26
Newcastle,26
Olathe,26
Mauldin,26
Saint Augustine,26
Highland Heights,26
Stow,26
Huntersville,26
Hawthorne,26
Cliffside Park,26
Upper Darby,26
Glenshaw,26
Atherton,26
Wolcott,26
Rialto,26
Peabody,25
Wixom,25
Missouri City,25
Hoffman Estates,25
Sandpoint,25
Pleasant Hill,25
Clearwater,25
Frisco,25
Pennington,25
New Paltz,25
Lakeland,25
Centreville,25
Annapolis,25
Ocoee,25
Stratford,25
Smithsburg,25
Green Bay,25
Gulfport,25
Monument,24
Darien,24
Mentor,24
Downingtown,24
Maywood,24
Waverly,24
Elkridge,24
Hinsdale,24
Branford,24
Grafton,24
Shawnee,24
Niagara Falls,24
New Carrollton,24
Fontana,24
Elmhurst,24
Citrus Heights,24
Pearblossom,24
Shelter Island,24
Frankford,24
Rye Brook,24
Simi Valley,24
Ridgefield,24
Nyack,24
Chamblee,23
Yankton,23
Bloomfield Hills,23
Dawsonville,23
Senatobia,23
Chappaqua,23
Cumming,23
Federal Way,23
Beloit,23
Bloomingdale,23
Waterford,23
Duncan,23
Lunenburg,23
Grovetown,23
Belton,23
Plainville,23
Boardman,23
Brick,23
Graham,23
Greensburg,23
Lihue,23
Novi,23
Jeffersonville,23
Wentzville,23
West Springfield,23
Hickory,23
Elk Grove,23
Fort Smith,23
Geneva,23
Indialantic,23
Glenwood,23
Spotsylvania Courthouse,23
Sioux City,23
Youngstown,22
West Warwick,22
Perrysburg,22
Woodway,22
Fort Yates,22
Topsham,22
Norco,22
Tafton,22
Easton,22
South San Francisco,22
South Salem,22
Bellefonte,22
Valley Stream,22
Davenport,22
Sayreville,22
Naperville,22
Calabasas,22
Kearny,22
Taunton,22
Ocala,22
New Bethlehem,22
Longview,22
Smithfield,22
Verona,21
Exeter,21
Asheboro,21
Delmar,21
Amelia,21
Cortland,21
Johnstown,21
Wayne,21
Cedar Park,21
East Brunswick,21
Glenville,21
Alamo,21
Norristown,21
Oakdale,21
Upper Marlboro,21
Twinsburg,21
Oyster Bay,21
Tucker,21
Winona,21
Gresham,21
Guilford,21
Burke,21
Lawrence Township,21
New Berlin,21
West Jordan,21
Port Orange,21
New Milford,21
Smyrna,21
Spartanburg,21
Tulalip,21
Hammond,21
Plattsburgh,21
Bowie,21
Pinehurst,21
North Plainfield,21
Mount Vernon,21
Roy,21
Lenoir,20
Kinston,20
Orrville,20
Old Tappan,20
Bristow,20
East Amherst,20
Oceanside,20
Wenham,20
Kennesaw,20
Fridley,20
Selinsgrove,20
Great Falls,20
Flower Mound,20
Saint George,20
Hampton,20
Signal Mountain,20
Toccoa,20
Lake City,20
Calverton,20
White Bear Lake,20
Antioch,20
Cathedral City,19
Oneonta,19
Maple Grove,19
Wildwood,19
University Place,19
Nacogdoches,19
Painesville,19
Eagan,19
Ridgeland,19
Kearney,19
Hampstead,19
Bastrop,19
Marysville,19
City of Orange,19
Chicopee,19
Oxnard,19
Harrington,19
Princess Anne,19
South Pasadena,19
Cape Coral,19
Morgan,19
Thorn Hill,19
Wilson,19
Independence,19
Puyallup,19
Miller Place,19
Benton City,19
Casselberry,19
Bethany,19
Indiana,19
Galesburg,19
Winnetka,19
Merchantville,19
Summit,19
Prosser,19
Pleasant Grove,19
West Lake Hills,19
Great Barrington,19
Mason,19
Hull,18
Dover Plains,18
Gloucester,18
Massapequa,18
Wellington,18
Sweetwater,18
Front Royal,18
Macungie,18
San Gabriel,18
Hilliard,18
Edmonds,18
Rock Island,18
Matteson,18
Eatontown,18
Owasso,18
Selah,18
Bedminster Township,18
Waitsfield,18
Camas,18
Fairway,18
North Bergen,18
Santa Maria,18
Floresville,18
Hollywood,18
South Gate,18
Canyon Lake,18
Tracy,18
Holladay,18
Sunol,18
Burnsville,18
Forest Park,18
Neptune City,18
Portola Valley,18
High Point,18
Water Valley,18
Malvern,18
Chester Springs,18
Kailua,18
Olivet,18
New Providence,17
Spring Creek,17
McHenry,17
Teterboro,17
New Bedford,17
Ellensburg,17
Monroeville,17
Newburgh,17
Moses Lake,17
Teaneck,17
Barrington,17
Napa,17
Blairsville,17
Visalia,17
Scituate,17
Temecula,17
Uniontown,17
Solon,17
Lochearn,17
Billings,17
Edinboro,17
Downey,17
Amesbury,17
Saint Francis,17
Bar Harbor,17
Hercules,17
Gonzales,17
Marble Falls,17
Cumberland,17
Indian Trail,17
Royal Oak,17
Big Rapids,16
McMinnville,16
Rockaway,16
Chester,16
Logansport,16
East Riverdale,16
Pittsboro,16
Rome,16
New Holland,16
Glastonbury,16
Stevens Point,16
Stroudsburg,16
North Pole,16
Papillion,16
Pittsford,16
Endicott,16
Seminole,16
Mooresville,16
Vacaville,16
Collingswood,16
Lincoln City,16
Olde West Chester,16
Paterson,16
Fort Mill,16
Sedona,16
Kingsville,16
Hopewell,16
Plainview,16
Modesto,16
Mableton,16
Kennewick,16
Medina,16
Tenafly,16
Anderson,16
Candler,16
Yacolt,16
Lake Ozark,16
Petaluma,16
Rocklin,16
Atwater,16
Surprise,16
Cosby,16
Amarillo,16
Brier,15
Trumansburg,15
Bethel Park,15
Shelby charter Township,15
Hamilton Township,15
Royston,15
Orange Park,15
Neenah,15
Liverpool,15
New Braunfels,15
Glenside,15
Hackettstown,15
Bonney Lake,15
Swansea,15
Park Ridge,15
Evington,15
Perkasie,15
Lisle,15
Desert Hot Springs,15
West Islip,15
White Hall,15
Gaston,15
Grosse Pointe Park,15
Rosemead,15
Merrick,15
Keaau,15
Holyoke,15
Nebo,15
Mercer Island,15
Riviera Beach,15
Chalmette,15
Quitman,15
Parrish,15
Carnation,15
Cocoa,15
Syosset,15
Yucaipa,15
Carmichael,15
South Portland,15
Sellersburg,15
Odessa,15
Waukesha,15
Grand Blanc,15
Cerritos,15
Wylie,15
San Dimas,15
Boynton Beach,14
Newport Beach,14
Rock Springs,14
Tyler,14
Des Plaines,14
Elko,14
Sammamish,14
Levittown,14
Red Lion,14
U.S. Air Force Academy,14
Gladwyne,14
Stevensville,14
Woonsocket,14
Lodi,14
North Wales,14
Saint Charles,14
Lusby,14
De Pere,14
Mountainair,14
Bessemer,14
Sunrise,14
Greer,14
Land O' Lakes,14
Mundelein,14
Meredith,14
Central Point,14
Grosse Pointe Farms,14
Seffner,14
Upland,14
Ben Lomond,14
Oshkosh,14
Noblesville,14
Germantown,14
Joplin,14
Hopedale,14
Wilkes-Barre,14
Landenberg,14
Egg Harbor City,14
Pico Rivera,14
Murrysville,14
Mattoon,14
Roxbury Township,14
Port Jefferson Station,14
Coffeyville,14
Olivehurst,13
Orinda,13
South Burlington,13
Southgate,13
Great Mills,13
Thomasville,13
Severn,13
Bala Cynwyd,13
Fair Oaks,13
Sun Prairie,13
Morton,13
Beaver City,13
Grand Prairie,13
Mastic,13
New Freedom,13
Taylor,13
Southbury,13
Crofton,13
Carpentersville,13
Sylva,13
Stoughton,13
Montauk,13
Spanaway,13
Town of Rockingham,13
Rancho Santa Margarita,13
Orono,13
Brewster,13
Fountain Valley,13
Kalispell,13
Yellow Springs,13
Laconia,13
Port Washington,13
Gorham,13
Huntingtown,13
Olney,13
Wolfeboro,13
Kaysville,13
Lynn,13
Robbinsville,13
Birdsboro,13
Dobbs Ferry,13
Middleburg Heights,13
Windsor,12
Flemington,12
Baden,12
Highland Village,12
Cody,12
Carlisle,12
Pearl,12
Menands,12
Brandon,12
Plains,12
Cicero,12
Ferndale,12
Bogart,12
Minot,12
Wake Forest,12
Port Saint Lucie,12
North Kingstown,12
Evergreen,12
Lauderhill,12
Oaklyn,12
Perth Amboy,12
Maple Valley,12
Rochelle,12
Bear,12
Eleanor,12
Natchitoches,12
Urbandale,12
Montevallo,12
Encinitas,12
Durango,12
West Chicago,12
Deer Park,12
Wynnewood,12
Hopkinton,12
Montville,12
Rockledge,12
McKeesport,12
Ramsey,12
Nogales,12
Leonia,12
Palm Bay,12
Delray Beach,12
Lake Butler,12
Plantation,12
Egg Harbor Township,12
Jordan,12
Gilroy,12
Garwood,12
West Frankfort,12
North Charleston,12
New Park,12
Cartersville,12
Prescott,12
Abington,12
Mahomet,12
Raytown,11
Hacienda Heights,11
New Smyrna Beach,11
Pontiac,11
Newtown,11
Wailuku,11
Richfield,11
Ruther Glen,11
Riverwoods,11
Benton,11
Jacksonville Beach,11
Odenton,11
Texarkana,11
North Chili,11
Sebring,11
Ceres,11
Foxborough,11
West Long Branch,11
Lanesborough,11
Kingston,11
Lahaina,11
Gunnison,11
Floral Park,11
Alice,11
Port Deposit,11
Waterloo,11
Media,11
Panama City Beach,11
Stoneham,11
Buffalo Grove,11
Destin,11
Bensalem,11
Ormond Beach,11
Baldwin,11
Yorba Linda,11
Lincolnshire,11
Avon Lake,11
Clintwood,11
Black Mountain,11
Mariposa,11
Kettering,11
Centralia,11
DuBois,11
Lake Grove,11
Bartlett,11
Wichita Falls,11
McPherson,11
Madison Heights,11
Fishersville,11
Harleysville,11
Sequim,11
Munising,11
Artesia,11
Carson,11
Cedarburg,11
Lemitar,10
Fraser,10
Kentwood,10
Byron Center,10
Stowe,10
Hilton Head Island,10
Claremore,10
Sag Harbor,10
Mount Prospect,10
San Clemente,10
North Tonawanda,10
Bainbridge Island,10
Seneca,10
South Jordan,10
Crestview,10
Republic,10
Marshalltown,10
Kannapolis,10
Willoughby,10
Pfafftown,10
Niceville,10
San Lorenzo,10
Oberlin,10
Wildwood Crest,10
Pompano Beach,10
Staunton,10
Los Alamitos,10
Marrero,10
Elk City,10
Monterey,10
Compton,10
Lewis Center,10
Fall City,10
Kapaa,10
Lima,10
Ardmore,10
Bexley,10
Inglewood,10
East Nassau,10
Getzville,10
Mocksville,10
Brownsburg,10
Discovery Bay,10
Spencer,10
Marlboro Township,10
Loganville,10
Sparta,10
Marshfield,10
Kenai,10
American Canyon,10
Holly Springs,10
Garner,10
Healdsburg,10
Nickerson,10
Aiken,10
Waunakee,10
Smoaks,10
Leawood,10
Lakeport,10
Shelbyville,10
Cottonwood,10
Bogota,10
Pittsfield,10
South Amherst,10
Larkfield-Wikiup,10
Durand,10
Saint Albans City,10
Long Hill,10
Greencastle,10
Solomons,10
Casper,10
Palm Springs,10
Fort Pierce,10
Laguna Woods,10
Rahway,10
Benicia,10
Wapakoneta,9
San Jacinto,9
Dripping Springs,9
North Andover,9
Shelburne Falls,9
Forest Heights,9
Franklin Square,9
South Brunswick Township,9
Streamwood,9
Hays,9
Superior Charter Township,9
Woodbridge Township,9
Norwood,9
Gilbertsville,9
River Hills,9
Pawling,9
Springboro,9
Chattanooga,9
Douglas,9
East Los Angeles,9
Mammoth Lakes,9
Kutztown,9
Friday Harbor,9
Berlin,9
South Beloit,9
Great Neck,9
Keizer,9
Westland,9
Atascadero,9
Wheeling,9
North Royalton,9
Normandy Park,9
Nazareth,9
La Puente,9
Punxsutawney,9
Johnston City,9
Reddick,9
Dearborn Heights,9
Cross,9
Koloa,9
Bronxville,9
San Benito,9
Warrensburg,9
Albion,9
Lenexa,9
Weldon Spring,9
Rockwall,9
Suquamish,9
Vero Beach,9
Roseburg,9
Hope Mills,9
College Place,9
Cresson,9
Wethersfield,9
Rootstown,9
Bethpage,9
Honeoye Falls,9
Osceola Mills,9
Mahopac,9
Agawam,9
Cedartown,9
Niles,9
Souderton,9
Deep River,9
Pulaski,9
Palm Desert,9
Lamoni,9
Hartland,9
Peosta,9
Newfane,8
Churubusco,8
Greenwich,8
Hermosa Beach,8
Union Beach,8
Valrico,8
Williamson,8
Chagrin Falls,8
Shingle Springs,8
Lumberton,8
Amsterdam,8
Southington,8
Freeport,8
Port Huron,8
Port Charlotte,8
Parkland,8
Oil City,8
Burien,8
Truckee,8
Lynbrook,8
Latrobe,8
Saint Marys,8
Antelope,8
Park City,8
Trabuco Canyon,8
Bristol,8
Des Peres,8
Alabaster,8
Paonia,8
Temple,8
Chambersburg,8
Ringwood,8
Pickerington,8
Delta,8
Crested Butte,8
Marco Island,8
Klamath Falls,8
Rock Hill,8
Cheshire,8
Rushville,8
Geneseo,8
Mount Dora,8
Parkersburg,8
Owatonna,8
Tenino,8
Lake Zurich,8
Pine Bush,8
Lawton,8
New Cumberland,8
Sun City Center,8
Selden,8
Sheboygan Falls,8
Stuart,8
Port Jefferson,8
Wheatley Heights,8
Yellville,8
Annville,8
Shaw,8
Mattawan,8
North Miami,8
Shelton,8
Mechanicsburg,8
Menifee,8
Ewing Township,8
Leominster,8
Winterville,8
Lockport,8
Morris,8
Orion charter Township,8
Maumee,8
Plant City,8
Hackberry,8
Goshen,8
Fort Bragg,8
Grove City,8
Forest Grove,8
Merritt Island,8
Paoli,8
Mount Juliet,8
Belleville,8
Ilion,8
Battle Creek,8
South Daytona,8
Newnan,7
Guthrie,7
Crystal Lake,7
Fuquay Varina,7
Columbiana,7
De Soto,7
Mechanicsville,7
Sierra Vista,7
Haymarket,7
Harker Heights,7
Council Bluffs,7
Hayden,7
Oakley,7
Sturgeon Bay,7
Rockland,7
Dawson Springs,7
Yakima,7
New Baltimore,7
Ocean Township,7
San Marino,7
Jensen Beach,7
Maple Shade Township,7
Garfield,7
Los Lunas,7
Morro Bay,7
Accomac,7
Orangevale,7
Daphne,7
Honokaa,7
La Crescenta-Montrose,7
Adrian,7
Forney,7
Bolingbrook,7
Penfield,7
Nutley,7
Long Branch,7
Alexander City,7
Coraopolis,7
Carthage,7
Bath,7
Middlebury,7
Coralville,7
Killeen,7
Granville,7
Sunbury,7
Deerfield,7
Ojai,7
Tiverton,7
Crescent City,7
Dunmore,7
West Point,7
Taylors,7
Saint Clair Shores,7
New Port Richey,7
Emporium,7
Horseheads,7
Massapequa Park,7
Slidell,7
Westport,7
Fergus Falls,7
Cinnaminson,7
Lakeside,7
Port Orchard,7
Colchester,7
Stanchfield,7
Del City,7
Sugar Grove,7
North Richland Hills,7
South Amboy,7
Meadville,7
Ephrata,7
Royal Center,7
Milan,7
Brazil,7
Springville,7
Burton,7
Slippery Rock,7
Clarksburg,7
Sisters,7
Naugatuck,7
Tipp City,6
Havertown,6
Batesville,6
Telluride,6
Evesham Township,6
Archer,6
Platteville,6
Algonquin,6
Kyle,6
Beulah,6
Grand Island,6
Pearl City,6
Excelsior Springs,6
Watauga,6
Brevard,6
New Carlisle,6
Swannanoa,6
Boring,6
East Northport,6
La Crescent,6
Mount Clare,6
North Liberty,6
La Quinta,6
Valdosta,6
Maynardville,6
Marathon,6
Fort Walton Beach,6
Mebane,6
Ottumwa,6
Huntingdon,6
Byesville,6
Pascagoula,6
Butler,6
Ponte Vedra Beach,6
Yuma,6
Castle Rock,6
West Covina,6
National City,6
Point Pleasant,6
Cameron,6
Vernon,6
Sheridan,6
Montrose,6
Eagle Mountain,6
Ocean Springs,6
Dumas,6
Hanford,6
Steamboat Springs,6
Mead,6
The Colony,6
Seaside,6
Dumont,6
Middle River,6
Delaware,6
Lake Tapawingo,6
Lathrup Village,6
Nesconset,6
Denison,6
Mount Kisco,6
Tewksbury,6
Willow Grove,6
Reisterstown,6
Port Jervis,6
Safety Harbor,6
Fayette,6
Alton,6
Apache Junction,6
Paradise,6
Moore,6
Cottage Grove,6
George West,6
Lehigh Acres,6
Hazen,6
Vail,6
Hazel Park,6
Albemarle,6
Daytona Beach,6
Amanda,6
North Port,6
Anniston,6
Tarpon Springs,6
Wood Dale,6
Bensenville,6
Vineyard,6
Park Hills,6
North Fort Myers,6
Poquoson,6
Monongahela,6
Abingdon,6
Dyersburg,6
Torrington,6
Red Wing,6
Pottsville,6
Palm Coast,6
Onalaska,6
Winslow,6
Dothan,6
Menomonee Falls,6
Beaufort,6
Marana,6
Dalton Gardens,6
Seabrook,6
Jamesville,6
Rifle,5
Smethport,5
Wall Township,5
Moss Beach,5
Florissant,5
Seymour,5
Mokena,5
Lake Katrine,5
Houma,5
East Meadow,5
Holt,5
Union Grove,5
Pineville,5
Haleyville,5
Chalfont,5
McKinleyville,5
Sheboygan,5
Bullhead City,5
Chuckey,5
Melbourne Beach,5
Canal Winchester,5
Beach Park,5
Morehead,5
Wantagh,5
Nebraska City,5
North Attleborough,5
Agoura Hills,5
Sykesville,5
Bloomfield,5
Edinburgh,5
Corning,5
Bemidji,5
Peekskill,5
Portage,5
Roscoe,5
Brandywine,5
Moorpark,5
Redford Charter Township,5
Cedaredge,5
Turlock,5
Greeneville,5
Brookhaven,5
Pittsburg,5
McAllen,5
Chatham,5
Atchison,5
East Longmeadow,5
Minden,5
Harrington Park,5
Briarcliff Manor,5
Sebastian,5
Cranford,5
Pacific Grove,5
Simpsonville,5
La Grange Park,5
Haddonfield,5
Fredonia,5
Clark,5
Scott City,5
Opelika,5
Old Orchard Beach,5
Saint Pete Beach,5
Leslie,5
Owens Cross Roads,5
East Moline,5
Gilford,5
Saint Helena Island,5
Haddon Heights,5
North Syracuse,5
Detroit Lakes,5
Oak Forest,5
Xenia,5
Owego,5
Findlay,5
East Aurora,5
Berea,5
Collegedale,5
Suffern,5
Midlothian,5
Tigerville,5
Orrtanna,5
Sylacauga,5
Mount Morris,5
Hauppauge,5
River Edge,5
Sussex,5
Middle Island,5
Martin,5
Matthews,5
Sumrall,5
Cullman,5
Fall River,5
Atkinson,5
Maysville,5
Azusa,5
Kenner,5
Kilauea,5
Vicksburg,5
Coronado,5
Baldwinsville,5
West Bend,5
Hanover Park,5
Brighton,5
Paul,5
San Angelo,5
Tallmadge,5
Flushing,5
Placentia,5
Comstock Park,5
Edgewood,5
Ridgecrest,5
Nanty-Glo,5
Loretto,5
Spearfish,5
Saluda,5
Scotch Plains,5
Alta,5
Saint John,5
West Fargo,5
Corsicana,5
Malibu,5
Oak Creek,5
Pleasant Valley,5
Lander,5
Burr Ridge,5
Neola,5
Bay Shore,5
Fort Gibson,5
North Highlands,5
Birch Run,5
La Farge,5
Chardon,5
Sumter,5
Newberry,5
Fort Garland,5
New London,5
Yucca Valley,5
Voorhees Township,5
Whitefish,5
Marshall,5
Griffin,5
Waxhaw,5
West Sand Lake,5
Mahwah,5
Romeoville,5
Suffield,5
East Hampton,5
Gardnerville,4
Yaphank,4
Brackenridge,4
Cedarville,4
Berthoud,4
El Mirage,4
Munster,4
Stacy,4
Powder Springs,4
Show Low,4
Yukon,4
Walkersville,4
Whiteland,4
Fairhaven,4
Hanson,4
Chesterton,4
Peyton,4
Eltopia,4
Buckhannon,4
Ferrum,4
Bridgton,4
Powell,4
La Grande,4
La Center,4
High Ridge,4
Snohomish,4
Olmsted Falls,4
Mendota Heights,4
Key Largo,4
San Juan Capistrano,4
Ava,4
Santa Rosa Beach,4
Yuba City,4
Pinellas Park,4
Seekonk,4
Lindstrom,4
Alden,4
Pinckney,4
Newberg,4
Lone Tree,4
Edgewater,4
East Machias,4
Royse City,4
Poinciana,4
Gary,4
Queensbury,4
Little Egg Harbor Township,4
Cullowhee,4
DeBary,4
Enterprise,4
Pembroke,4
Keyser,4
Ewa Beach,4
Glen Dale,4
Hallowell,4
Monmouth,4
Round Lake,4
Titusville,4
Filer,4
Westbury,4
Sonoma,4
Hubbard,4
Monterey Park,4
Roanoke Rapids,4
Ashland City,4
Manor,4
Bellflower,4
Warr Acres,4
Junction City,4
Ramona,4
Wasilla,4
Pompton Lakes,4
Whitewater,4
Angels Camp,4
Rossville,4
Ponca City,4
Clanton,4
Hoschton,4
Grayson,4
North Providence,4
Astoria,4
Kirkwood,4
Dunedin,4
Salida,4
Union Hall,4
Osprey,4
Beacon,4
Ladera Ranch,4
Benton Harbor,4
Guin,4
Fallston,4
Pinson,4
Kenilworth,4
West Richland,4
Whitmore Lake,4
Cairo,4
Mukwonago,4
Grass Valley,4
Cohoes,4
Janesville,4
York Haven,4
Yelm,4
Seneca Falls,4
Cedar Crest,4
Live Oak,4
Parish,4
Pueblo,4
Mars Hill,4
Bow,4
Spring Lake,4
Tulare,4
Oakhurst,4
Swedesboro,4
Mount Shasta,4
Hewitt,4
Hutto,4
Palatka,4
Wamego,4
Mount Holly,4
Ansonia,4
Peachtree City,4
Palm City,4
Lake Saint Louis,4
Nahant,4
Mint Hill,4
West Branch,4
Raeford,4
West Bloomfield Township,4
Altamonte Springs,4
Camden,4
West Milford,4
Saint Joseph,4
New Canaan,4
The Dalles,4
Salina,4
Vermilion,4
Leander,4
Saint Helens,4
Ipswich,4
Cape May,4
Plattsmouth,4
Merkel,4
Weidman,4
Timberville,4
Vernal,4
Leavenworth,4
Bluffton,4
Palmetto,4
Tualatin,4
Liberal,4
Saco,4
Charles Town,4
Millsboro,4
Bryce,4
Running Springs,4
Winfield,4
Glendale Heights,4
Key West,4
Raphine,4
Nicholasville,4
Grandview,4
Venice,4
The Village,4
South Hadley,4
Cibolo,4
Melville,4
Newville,4
Spicewood,4
Loomis,3
Closter,3
Metuchen,3
Magna,3
Sandown,3
Beaver Dam,3
Almont,3
Forest City,3
Sweet Home,3
North Manchester,3
Camano Island,3
Granby,3
Hurst,3
Pocomoke City,3
Wheatland,3
Falfurrias,3
Paso Robles,3
Oliver Springs,3
Alliance,3
Suffolk,3
Hampton Township,3
Morrison,3
Sherwood,3
Rutland,3
Horsham,3
Hatfield,3
Boonville,3
Cresskill,3
Goodlettsville,3
Riverdale,3
Reinholds,3
Lathrop,3
Lake Elsinore,3
Olive Branch,3
Mountlake Terrace,3
Copiague,3
Latham,3
Lambertville,3
Corsica,3
Ridgewood,3
Cape Elizabeth,3
Wenatchee,3
Seville,3
Knightdale,3
Fallbrook,3
Nome,3
Ellsworth,3
Poulsbo,3
McDonough,3
Tolland,3
Old Bridge Township,3
New Windsor,3
Woodland Park,3
Collingdale,3
Forest,3
San Elizario,3
Braintree,3
Piqua,3
Griswold,3
Jasper,3
Gray,3
Berkley,3
Stone Ridge,3
Bettendorf,3
Hillsdale,3
West Plains,3
Bucyrus,3
Milledgeville,3
Mound,3
Willows,3
Aventura,3
West End,3
Oneida,3
Belgrade,3
Kiowa,3
Richmond Heights,3
Apollo Beach,3
Chatham Township,3
Brownfield,3
Collinsville,3
Archie,3
Shippensburg,3
Wisconsin Rapids,3
Rumford,3
Lake Success,3
Phenix City,3
Hauser,3
Gurnee,3
Lake Bluff,3
Elmira,3
Arundel,3
Manteca,3
Barnstable,3
Southaven,3
Speedway,3
Lafayette Hill,3
Mineola,3
Inverness,3
Hewlett,3
Nashotah,3
North Sioux City,3
Susanville,3
Red Bank,3
Fairview Heights,3
Genoa City,3
Bountiful,3
Yarmouth,3
Quakertown,3
Fond du Lac,3
Winter Garden,3
Fowler,3
Willmar,3
Colton,3
Petersburg,3
Medway,3
Southlake,3
Brainerd,3
Big Lake,3
Valley Center,3
Lithia,3
Brecksville,3
Silverton,3
Laguna Niguel,3
Woodlyn,3
Crawfordsville,3
Langhorne,3
Greenbrier,3
DeWitt,3
Soddy-Daisy,3
Hadley,3
Alma,3
Madisonville,3
Statham,3
Sylvania,3
Merrillville,3
Passaic,3
Franklin Lakes,3
Prairie Village,3
Lutz,3
Homer Glen,3
Homestead,3
Calcutta,3
Southfield,3
Gentry,3
Cummington,3
Tunbridge,3
Arapahoe,3
Derby,3
Nampa,3
Ennis,3
Oakland Park,3
Haverhill,3
Okeechobee,3
Williamston,3
Ellerbe,3
Fort Rucker,3
Boulder Creek,3
Delavan,3
Wellsboro,3
Sullivan,3
Grand Saline,3
Kill Devil Hills,3
Bealeton,3
Linthicum Heights,3
Poland,3
Cheney,3
Shakopee,3
Moline,3
Mount Sinai,3
Jamaica Beach,3
Pikeville,3
New Pekin,3
Hobart,3
Glyndon,3
Coconut Creek,3
The Villages,3
Spanish Fork,3
Savonburg,3
Port Townsend,3
Kingfisher,3
Morton Grove,3
Lake Arrowhead,3
Dexter,3
Iron River,3
Bloomsburg,3
Severna Park,3
North Las Vegas,3
Hartsville,3
Pickens,3
Edwardsville,3
Jamul,3
Metamora,3
West Babylon,3
Seal Beach,3
Effingham,3
Aspen,3
Clarkston,3
Angleton,3
Saddle Brook,3
Finleyville,3
Leonardtown,3
Universal City,3
Carteret,3
Eldridge,3
Dunbar,3
Buchanan,3
White Lake charter Township,3
Tullahoma,3
Del Rio,3
Whitesboro,3
Carlinville,3
North Olmsted,3
Holmes,3
Fountain Hills,3
Clive,3
Wallingford,3
Yorkville,3
Pequannock Township,3
Enumclaw,3
East Grand Forks,3
Piedmont,3
Seven Devils,3
Meridianville,3
Poughquag,3
Monroe Center,3
Weehawken,3
Lomita,3
Myakka City,2
Mount Rainier,2
Milford Center,2
Temperance,2
Margate,2
Two Harbors,2
Wild Rose,2
Eastpointe,2
Holbrook,2
Parlier,2
Drums,2
Hot Springs,2
North Arlington,2
West Grove,2
Bellmawr,2
Tahlequah,2
Pahrump,2
Palisades Park,2
Stephentown,2
Taylorsville,2
Gloversville,2
Glendora,2
East Hanover,2
Macedon,2
Grantham,2
Moyock,2
Jessup,2
Wyandotte,2
Cylinder,2
Taylorville,2
Chino Valley,2
Dana Point,2
California,2
Port Arthur,2
Elgin,2
Fort White,2
Foley,2
Monessen,2
Carlton,2
Kerman,2
Enfield,2
Porter,2
Zeeland,2
Hot Springs Village,2
Celina,2
Cedar Lake,2
Fryeburg,2
Scarborough,2
Glen Rose,2
Broomall,2
Harlan,2
Congers,2
Virgie,2
Pepperell,2
Bernville,2
Springview,2
Elburn,2
Greenvale,2
Newburyport,2
Nederland,2
Clare,2
Makawao,2
Maumelle,2
Youngsville,2
Bandon,2
Skowhegan,2
Wapato,2
Chowchilla,2
Galva,2
Choctaw,2
Racine,2
Helena-West Helena,2
Lawndale,2
Bisbee,2
Spring Branch,2
Sanger,2
Smithton,2
Standish,2
Larkspur,2
Ashtabula,2
Fort Payne,2
Heflin,2
Clermont,2
Scottsbluff,2
Coupeville,2
Nolensville,2
Coldwater,2
Hilton,2
Harbor Springs,2
Georgetown Township,2
Rensselaer,2
Furlong,2
Brownwood,2
Boalsburg,2
Commack,2
Crosby,2
Ida Grove,2
Delphi,2
Coos Bay,2
South Windsor,2
Huntley,2
Luray,2
Ozark,2
Española,2
Lorton,2
Tidewater,2
Tomahawk,2
Twentynine Palms,2
Prairieville,2
Elsah,2
Stevenson Ranch,2
Good Hope,2
Ledbetter,2
Battle Ground,2
El Monte,2
Pawleys Island,2
Oradell,2
Myersville,2
Bolton,2
Jamison,2
Litchfield,2
Waldorf,2
Saraland,2
Paris,2
Baldwyn,2
Carmine,2
Selkirk,2
Leon,2
Garfield Heights,2
Roselle Park,2
Harvest,2
Canaan,2
Spring Hope,2
Warrenville,2
Bellvue,2
Cologne,2
London,2
Kings Park,2
Dahlonega,2
Coalville,2
Livingston Manor,2
Saint Johnsbury,2
Narragansett,2
Malta,2
Knox,2
Blue Springs,2
Milbank,2
Oconomowoc,2
Borrego Springs,2
Henry,2
New Gloucester,2
Wenonah,2
New Ulm,2
Pleasant Ridge,2
Tobyhanna,2
Zachary,2
Locust Grove,2
Thibodaux,2
Catasauqua,2
Lenoir City,2
Bell Gardens,2
Alpine,2
Creston,2
South Bound Brook,2
Rochelle Park,2
Elk River,2
Blacklick,2
Parker City,2
Wilton,2
Havelock,2
Eureka Springs,2
Argenta,2
New Lenox,2
Kittanning,2
Hallandale Beach,2
South Plainfield,2
Bixby,2
Shoreham,2
Cloverdale,2
Freehold,2
Lake George,2
Holiday,2
Axton,2
Massillon,2
Lindsborg,2
Imperial,2
Malden Bridge,2
Munith,2
Quinlan,2
Swampscott,2
Pevely,2
Fort Meade,2
Rocky Point,2
Brandenburg,2
Brookville,2
Brooklyn Park,2
Roselle,2
Palm Harbor,2
Englewood Cliffs,2
Paia,2
Oakwood,2
Coram,2
Lincolnwood,2
Haverstraw,2
Montebello,2
East Wenatchee,2
Boiling Springs,2
Millington,2
Ulysses,2
Dagsboro,2
Sewickley,2
Haddam,2
Parsons,2
Tyngsborough,2
Moody,2
Valhalla,2
Hinckley,2
Centerton,2
Fort McDowell,2
Bonita Springs,2
Laurens,2
Lufkin,2
Blythewood,2
Satellite Beach,2
Lavonia,2
East Haddam,2
Huntington Park,2
Katonah,2
Charlton,2
Sesser,2
Vineland,2
Rosemount,2
Osceola,2
Clearfield,2
Tellico Plains,2
King George,2
Middlesboro,2
Blair,2
Santa Paula,2
East Amwell Township,2
Beaver,2
Cherry Hills Village,2
Purvis,2
Sioux Center,2
Eustis,2
Orange Beach,2
Silverthorne,2
Red Bluff,2
Auburndale,2
Forest Hill,2
Perry,2
Coldspring,2
Pitman,2
Pooler,2
Pasco,2
China Township,2
Rainsville,2
Jermyn,2
West Bath,2
Paducah,2
Girard,2
Corbin,2
Wayland,2
Norton Shores,2
Cazadero,2
Parker,2
Sheffield,2
Gadsden,2
Northlake,2
McLeansville,2
Washington Township,2
Odem,2
Bulverde,2
Point Comfort,2
Bolivia,2
Vernon Township,2
Myrtle Point,2
Incline Village,2
Ripon,2
Woodbourne-Hyde Park,2
Grand Terrace,2
Harwich,2
Pell City,2
Anacortes,2
Londonderry,2
Louisburg,2
Waterville,2
Forest Falls,2
Wyoming,2
Fairview,2
Ballston Spa,2
Keansburg,2
South Salt Lake,2
Rocky Hill,2
Wapwallopen,2
Williamsport,2
Sumner,1
Haines Falls,1
Bella Vista,1
Opelousas,1
Fallon,1
Monmouth Beach,1
Burleson,1
Willow Creek,1
Gillett,1
Hurricane,1
Cooper City,1
Kathleen,1
Eastham,1
Lavallette,1
Sophia,1
New Oxford,1
Saint James,1
Canfield,1
Glen Cove,1
South Roxana,1
Pharr,1
Brisbane,1
Peru,1
Vernon Hills,1
Palos Heights,1
Casa Grande,1
Moravia,1
Bordentown,1
Mount Ephraim,1
Erin,1
Homewood,1
Royal,1
Calistoga,1
Mitchell,1
Broadview Heights,1
Manteo,1
Rocky Mount,1
Carroll,1
Canyon,1
New Hope,1
Swisher,1
Maineville,1
Stony Point,1
Alvarado,1
Collierville,1
Saint Simons Island,1
Bloomdale,1
Dewey Beach,1
Portales,1
Bernardsville,1
Stanfordville,1
Westby,1
Cadiz,1
Cut Off,1
West Chazy,1
La Grange,1
Baldwin City,1
Osseo,1
Windom,1
Depew,1
Big Bear,1
Maitland,1
Rhome,1
Shannon,1
Van Buren,1
Pound Ridge,1
Rotonda West,1
Cabin John,1
Bonners Ferry,1
Elkins,1
Cooperstown,1
Chebeague Island,1
Nipomo,1
Berwick,1
Nicholls,1
Cloquet,1
Eden,1
Tiffin,1
Bellmore,1
Altus,1
Fort Dodge,1
Oroville,1
South Point,1
Wallace,1
Raymondville,1
Leighton,1
Okoboji,1
Mount Olive Township,1
Walnutport,1
Crestline,1
Kernersville,1
Stockbridge,1
Prospect,1
Ruidoso,1
Juneau,1
Ottawa,1
North Palm Beach,1
New Tazewell,1
Wallkill,1
Stafford Township,1
Chicago Ridge,1
Frankenmuth,1
Lone Jack,1
Lamar,1
Pisgah,1
Damariscotta,1
Bellport,1
West Gardiner,1
Prince Frederick,1
Kilgore,1
Dauphin Island,1
Goose Creek,1
Mounds,1
Sarcoxie,1
Nelsonville,1
Urbanna,1
Lennox,1
Chanhassen,1
Stanton,1
Mashpee,1
Shepherdsville,1
De Motte,1
Globe,1
South Milwaukee,1
Elverta,1
Elberta,1
Waiʻanae,1
Belfair,1
Jarrettsville,1
Norwell,1
Flowery Branch,1
Fortuna,1
Leesport,1
Tinley Park,1
Kennebunk,1
Gillette,1
Dieterich,1
Burnet,1
Vincennes,1
Cass City,1
McBain,1
Rockville Centre,1
Fort Gratiot Township,1
Leland,1
Brooklyn Center,1
Lincolnton,1
Darrington,1
Walworth,1
DeSoto,1
Fife,1
Punta Gorda,1
Dalton,1
Bellwood,1
Tomball,1
Encampment,1
Owingsville,1
McDonald,1
Hartford City,1
Basile,1
Brooklyn,1
Inver Grove Heights,1
Angier,1
Jessieville,1
Byers,1
South Saint Paul,1
Estes Park,1
Great Bend,1
Williams,1
Moraine,1
Aztec,1
Hazel Green,1
Grandville,1
Waynesville,1
Enid,1
Bohemia,1
Sonora,1
Macedonia,1
Islip,1
Keystone,1
Holtsville,1
Gettysburg,1
Westley,1
Richgrove,1
Texas City,1
Elk Mound,1
Sartell,1
West Liberty,1
Wauconda,1
Walford,1
Cleves,1
Zillah,1
Big Stone Gap,1
Van,1
Midwest City,1
Buda,1
Pampa,1
Hammonton,1
Glade Hill,1
Kennett Square,1
Glen Rock,1
Maunaloa,1
South River,1
Ridgefield Park,1
Galt,1
Hopkinsville,1
Crowley,1
Helper,1
Jenks,1
Centerville,1
Wayzata,1
Underwood,1
Watonga,1
Silt,1
Hinesburg,1
Fairhope,1
Stewartsville,1
Muskego,1
Anson,1
White Swan,1
Woodcreek,1
Bath Township,1
Rogers,1
Waterford Township,1
Munford,1
Palos Hills,1
Franklin Park,1
Bergenfield,1
Pearcy,1
Rosenberg,1
Sulphur Springs,1
Gladewater,1
Blue Hill,1
Hazlet,1
Depoe Bay,1
Little Falls,1
Locust,1
Belvedere Tiburon,1
Killingworth,1
Waldwick,1
Wise,1
Trotwood,1
La Pine,1
Norden,1
Norridge,1
Provincetown,1
Berkeley Township,1
High Springs,1
Babylon,1
Linden,1
Killingly,1
Walhalla,1
Rio Vista,1
Eudora,1
Lake in the Hills,1
Hazard,1
East Rochester,1
Fort Madison,1
Farwell,1
Ville Platte,1
New Market,1
El Reno,1
North Wilkesboro,1
Milford Charter Township,1
Woodbourne,1
Woodcliff Lake,1
Prestonsburg,1
DeForest,1
Dresher,1
Goodyear,1
South Padre Island,1
Schererville,1
Eastport,1
Saline,1
Haines City,1
Gatesville,1
Aiea,1
Boonsboro,1
Carol Stream,1
Burney,1
West Nyack,1
Gainesboro,1
North Salt Lake,1
Gridley,1
Grass Lake charter Township,1
Arizona City,1
Ludington,1
Manchester-by-the-Sea,1
Victor,1
Kelso,1
Lincoln Park,1
Lake Odessa,1
Manhattan,1
Montpelier,1
Sierra Madre,1
Whitehouse,1
Poplar Grove,1
Glasgow,1
Schwenksville,1
Haskell,1
Sayville,1
Delano,1
West Greenwich,1
Sound Beach,1
Clarendon Hills,1
Devine,1
Skaneateles,1
Millersburg,1
Siloam Springs,1
Nitro,1
Wickenburg,1
Mayville,1
Fletcher,1
Clarence Center,1
South Elgin,1
Worden,1
McAlester,1
Zelienople,1
Cordele,1
Reedley,1
Mount Sterling,1
Mountain City,1
Tavares,1
Terrytown,1
Jay,1
Lecanto,1
Ellenburg Depot,1
Lytle Creek,1
Fall Creek,1
Bulls Gap,1
Wagram,1
Manteno,1
Boones Mill,1
Canastota,1
Lynn Haven,1
Arbon,1
Rock Port,1
Barnum,1
Hazleton,1
Benson,1
Keuka Park,1
Blandon,1
Rozet,1
Tyrone,1
Cutler Bay,1
Putney,1
Le Grand,1
Muskegon,1
Nassau,1
Ellettsville,1
Jerseyville,1
Kings Mountain,1
Haltom City,1
Kihei,1
Mary Esther,1
Gate City,1
Shelburne,1
Heppner,1
Bardstown,1
Seaford,1
Ayer,1
Copperopolis,1
Orchard Park,1
Seguin,1
Comfort,1
Soquel,1
Sun City,1
Silver City,1
Swainsboro,1
Mount Clemens,1
Coon Rapids,1
Mena,1
Mannford,1
Kenton,1
Sturbridge,1
New Auburn,1
Dundee,1
Corte Madera,1
Grand Haven,1
Old Saybrook,1
Silverdale,1
Libertyville,1
Copperas Cove,1
Hartsdale,1
Pescadero,1
Kalama,1
New Caney,1
Ballston Lake,1
Westbrook,1
Biloxi,1
Madrid,1
Loudon,1
Arkadelphia,1
Lucas,1
Epsom,1
Ishpeming,1
Walpole,1
Allegan,1
Rainbow City,1
Inkster,1
North Oaks,1
Riverbank,1
East Bridgewater,1
Minooka,1
Claymont,1
Carrizo Springs,1
Pinconning,1
Ossian,1
Brook Park,1
White Stone,1
Newbury,1
Shenandoah,1
Cortez,1
Waubeka,1
Dansville,1
Groveport,1
Luck,1
Mason City,1
Carencro,1
Laie,1
Crownsville,1
Walton,1
Canandaigua,1
Moncks Corner,1
Cadott,1
Yulee,1
Pemberton,1
Peggs,1
Brockport,1
Floyd,1
Southborough,1
Mendon,1
Davison,1
Barksdale Air Force Base,1
Elmwood Park,1
Struthers,1
Reidsville,1
Garrison,1
Monsey,1
Beardstown,1
Glocester,1
Sawyer,1
Colleyville,1
Breckenridge,1
Stanwood,1
Plain City,1
Homosassa,1
Carl Junction,1
Quarryville,1
Eagle Pass,1
Friendsville,1
West Haverstraw,1
Cañon City,1
Sun Valley,1
Belle Fourche,1
Murphysboro,1
Bourne,1
Maysel,1
Perris,1
Plentywood,1
Randallstown,1
Zephyrhills,1
Belvidere,1
Ironwood,1
San Luis,1
Somers Point,1
Bartlesville,1
Stephenville,1
Page,1
Hopewell Junction,1
Pilot Hill,1
Easley,1
Wrightstown,1
Bushnell,1
Snow Hill,1
Boerne,1
Holliston,1
East Cleveland,1
Wildomar,1
Laguna Beach,1
Waelder,1
Mannington,1
Ocean City,1
Weare,1
Veneta,1
Kerrville,1
Warner,1
Gardendale,1
Mount Orab,1
Breaux Bridge,1
Ladson,1
Bay City,1
Uvalde,1
Arden,1
Three Rivers,1
Swanton,1
Burtonsville,1
Camp Point,1
Canadian,1
Belle Chasse,1
Delhi,1
Defiance,1
Petal,1
White Oak,1
Helendale,1
LaGrange,1
Hollister,1
Stewartstown,1
Lapeer,1
Solvang,1
Sachse,1
Alexander,1
Euless,1
Lake Dallas,1
Hingham,1
Kula,1
Talbott,1
Caledonia,1
Kyburz,1
Croton-on-Hudson,1
Barboursville,1
Fernandina Beach,1
Evergreen Park,1
Gaylord,1
Mount Zion,1
Cadillac,1
Waynesburg,1
Blue Ridge,1
Victoria,1
Villa Rica,1
Highlands,1
Ellijay,1
Bells,1
Randleman,1
Montesano,1
Lemon Grove,1
Rouses Point,1
DeFuniak Springs,1
Sardinia,1
Boyce,1
Willingboro,1
Pine Bluffs,1
Virginia,1
Lyme,1
Cordova,1
Trussville,1
Mountain Home,1
Risingsun,1
Pierre,1
Tillamook,1
Batson,1
Avon-by-the-Sea,1
Coweta,1
Topsfield,1
American Fork,1
Grayling,1
Giddings,1
Paradise Valley,1
Curwensville,1
Illinois City,1
Murtaugh,1
Ecorse,1
Sutton,1
Taft,1
Porterville,1
Johnsonville,1
Greenport,1
Radford,1
Gaffney,1
Grundy,1
East Stroudsburg,1
Adams,1
Hernando,1
Seldovia,1
Bishop,1
Wiscasset,1
