+ JARFILE=/usr/hdp/current/hadoop-mapreduce-client/hadoop-streaming.jar
+ logfile=/cslu/homes/harmang/hw/hw1/logfiles/log.txt
+ alg=1
+ outDir=wc_alg_1_wrk_20_corp_70
+ corpus=70
+ num_worker=20
+ hadoop fs -rm -r /user/harmang/wc_alg_1_wrk_20_corp_70
rm: `/user/harmang/wc_alg_1_wrk_20_corp_70': No such file or directory
+ yarn jar /usr/hdp/current/hadoop-mapreduce-client/hadoop-streaming.jar -files ./mapper_1.py,./reducer_1.py -numReduceTasks 20 -mapper mapper_1.py -reducer reducer_1.py -input /data/nyt_splits/nyt_eng.70.txt -output wc_alg_1_wrk_20_corp_70
packageJobJar: [] [/usr/hdp/2.6.3.0-235/hadoop-mapreduce/hadoop-streaming-2.7.3.2.6.3.0-235.jar] /var/lib/ambari-agent/tmp/hadoop_java_io_tmpdir/streamjob292565869419405704.jar tmpDir=null
20/01/20 21:31:09 INFO client.RMProxy: Connecting to ResourceManager at ambari.cslu.ohsu.edu/10.95.39.226:8050
20/01/20 21:31:10 INFO client.AHSProxy: Connecting to Application History server at ambari.cslu.ohsu.edu/10.95.39.226:10200
20/01/20 21:31:10 INFO client.RMProxy: Connecting to ResourceManager at ambari.cslu.ohsu.edu/10.95.39.226:8050
20/01/20 21:31:10 INFO client.AHSProxy: Connecting to Application History server at ambari.cslu.ohsu.edu/10.95.39.226:10200
20/01/20 21:31:12 INFO mapred.FileInputFormat: Total input paths to process : 1
20/01/20 21:31:12 INFO mapreduce.JobSubmitter: number of splits:42
20/01/20 21:31:12 INFO mapreduce.JobSubmitter: Submitting tokens for job: job_1548355429605_0410
20/01/20 21:31:13 INFO impl.YarnClientImpl: Submitted application application_1548355429605_0410
20/01/20 21:31:13 INFO mapreduce.Job: The url to track the job: http://ambari.cslu.ohsu.edu:8088/proxy/application_1548355429605_0410/
20/01/20 21:31:13 INFO mapreduce.Job: Running job: job_1548355429605_0410
20/01/20 21:31:20 INFO mapreduce.Job: Job job_1548355429605_0410 running in uber mode : false
20/01/20 21:31:20 INFO mapreduce.Job:  map 0% reduce 0%
20/01/20 21:31:48 INFO mapreduce.Job:  map 1% reduce 0%
20/01/20 21:31:58 INFO mapreduce.Job:  map 2% reduce 0%
20/01/20 21:32:02 INFO mapreduce.Job:  map 3% reduce 0%
20/01/20 21:32:06 INFO mapreduce.Job:  map 4% reduce 0%
20/01/20 21:32:10 INFO mapreduce.Job:  map 5% reduce 0%
20/01/20 21:32:14 INFO mapreduce.Job:  map 6% reduce 0%
20/01/20 21:32:17 INFO mapreduce.Job:  map 7% reduce 0%
20/01/20 21:32:20 INFO mapreduce.Job:  map 8% reduce 0%
20/01/20 21:32:22 INFO mapreduce.Job:  map 9% reduce 0%
20/01/20 21:32:25 INFO mapreduce.Job:  map 10% reduce 0%
20/01/20 21:32:27 INFO mapreduce.Job:  map 11% reduce 0%
20/01/20 21:32:30 INFO mapreduce.Job:  map 12% reduce 0%
20/01/20 21:32:33 INFO mapreduce.Job:  map 13% reduce 0%
20/01/20 21:32:36 INFO mapreduce.Job:  map 14% reduce 0%
20/01/20 21:32:38 INFO mapreduce.Job:  map 15% reduce 0%
20/01/20 21:32:41 INFO mapreduce.Job:  map 16% reduce 0%
20/01/20 21:32:44 INFO mapreduce.Job:  map 17% reduce 0%
20/01/20 21:32:46 INFO mapreduce.Job:  map 18% reduce 0%
20/01/20 21:32:49 INFO mapreduce.Job:  map 19% reduce 0%
20/01/20 21:32:51 INFO mapreduce.Job:  map 20% reduce 0%
20/01/20 21:32:53 INFO mapreduce.Job:  map 22% reduce 0%
20/01/20 21:32:54 INFO mapreduce.Job:  map 24% reduce 0%
20/01/20 21:32:55 INFO mapreduce.Job:  map 25% reduce 0%
20/01/20 21:32:56 INFO mapreduce.Job:  map 26% reduce 0%
20/01/20 21:32:57 INFO mapreduce.Job:  map 28% reduce 0%
20/01/20 21:32:59 INFO mapreduce.Job:  map 29% reduce 0%
20/01/20 21:33:00 INFO mapreduce.Job:  map 31% reduce 0%
20/01/20 21:33:01 INFO mapreduce.Job:  map 32% reduce 0%
20/01/20 21:33:03 INFO mapreduce.Job:  map 35% reduce 0%
20/01/20 21:33:05 INFO mapreduce.Job:  map 36% reduce 0%
20/01/20 21:33:06 INFO mapreduce.Job:  map 38% reduce 0%
20/01/20 21:33:07 INFO mapreduce.Job:  map 39% reduce 0%
20/01/20 21:33:08 INFO mapreduce.Job:  map 40% reduce 0%
20/01/20 21:33:09 INFO mapreduce.Job:  map 42% reduce 0%
20/01/20 21:33:10 INFO mapreduce.Job:  map 43% reduce 0%
20/01/20 21:33:12 INFO mapreduce.Job:  map 45% reduce 0%
20/01/20 21:33:13 INFO mapreduce.Job:  map 46% reduce 0%
20/01/20 21:33:14 INFO mapreduce.Job:  map 47% reduce 0%
20/01/20 21:33:15 INFO mapreduce.Job:  map 49% reduce 0%
20/01/20 21:33:16 INFO mapreduce.Job:  map 50% reduce 0%
20/01/20 21:33:18 INFO mapreduce.Job:  map 52% reduce 0%
20/01/20 21:33:19 INFO mapreduce.Job:  map 53% reduce 0%
20/01/20 21:33:21 INFO mapreduce.Job:  map 54% reduce 0%
20/01/20 21:33:22 INFO mapreduce.Job:  map 55% reduce 0%
20/01/20 21:33:24 INFO mapreduce.Job:  map 57% reduce 0%
20/01/20 21:33:27 INFO mapreduce.Job:  map 60% reduce 0%
20/01/20 21:33:29 INFO mapreduce.Job:  map 61% reduce 0%
20/01/20 21:33:30 INFO mapreduce.Job:  map 63% reduce 0%
20/01/20 21:33:32 INFO mapreduce.Job:  map 64% reduce 0%
20/01/20 21:33:33 INFO mapreduce.Job:  map 65% reduce 0%
20/01/20 21:33:35 INFO mapreduce.Job:  map 67% reduce 0%
20/01/20 21:33:37 INFO mapreduce.Job:  map 68% reduce 0%
20/01/20 21:33:39 INFO mapreduce.Job:  map 69% reduce 0%
20/01/20 21:33:43 INFO mapreduce.Job:  map 70% reduce 0%
20/01/20 21:33:52 INFO mapreduce.Job:  map 71% reduce 0%
20/01/20 21:33:55 INFO mapreduce.Job:  map 72% reduce 0%
20/01/20 21:33:56 INFO mapreduce.Job:  map 73% reduce 0%
20/01/20 21:33:58 INFO mapreduce.Job:  map 75% reduce 0%
20/01/20 21:34:02 INFO mapreduce.Job:  map 76% reduce 0%
20/01/20 21:34:03 INFO mapreduce.Job:  map 78% reduce 0%
20/01/20 21:34:04 INFO mapreduce.Job:  map 80% reduce 0%
20/01/20 21:34:05 INFO mapreduce.Job:  map 83% reduce 0%
20/01/20 21:34:09 INFO mapreduce.Job:  map 85% reduce 0%
20/01/20 21:34:11 INFO mapreduce.Job:  map 87% reduce 0%
20/01/20 21:34:13 INFO mapreduce.Job:  map 88% reduce 0%
20/01/20 21:34:15 INFO mapreduce.Job:  map 89% reduce 0%
20/01/20 21:34:16 INFO mapreduce.Job:  map 91% reduce 0%
20/01/20 21:34:17 INFO mapreduce.Job:  map 92% reduce 0%
20/01/20 21:34:18 INFO mapreduce.Job:  map 94% reduce 0%
20/01/20 21:34:19 INFO mapreduce.Job:  map 96% reduce 0%
20/01/20 21:34:20 INFO mapreduce.Job:  map 97% reduce 0%
20/01/20 21:34:21 INFO mapreduce.Job:  map 98% reduce 0%
20/01/20 21:34:25 INFO mapreduce.Job:  map 100% reduce 0%
20/01/20 21:34:32 INFO mapreduce.Job:  map 100% reduce 3%
20/01/20 21:34:33 INFO mapreduce.Job:  map 100% reduce 4%
20/01/20 21:34:34 INFO mapreduce.Job:  map 100% reduce 10%
20/01/20 21:34:35 INFO mapreduce.Job:  map 100% reduce 14%
20/01/20 21:34:37 INFO mapreduce.Job:  map 100% reduce 16%
20/01/20 21:34:38 INFO mapreduce.Job:  map 100% reduce 19%
20/01/20 21:34:39 INFO mapreduce.Job:  map 100% reduce 22%
20/01/20 21:34:41 INFO mapreduce.Job:  map 100% reduce 27%
20/01/20 21:34:42 INFO mapreduce.Job:  map 100% reduce 28%
20/01/20 21:34:43 INFO mapreduce.Job:  map 100% reduce 29%
20/01/20 21:34:44 INFO mapreduce.Job:  map 100% reduce 32%
20/01/20 21:34:45 INFO mapreduce.Job:  map 100% reduce 33%
20/01/20 21:34:46 INFO mapreduce.Job:  map 100% reduce 34%
20/01/20 21:34:47 INFO mapreduce.Job:  map 100% reduce 36%
20/01/20 21:34:48 INFO mapreduce.Job:  map 100% reduce 37%
20/01/20 21:34:49 INFO mapreduce.Job:  map 100% reduce 38%
20/01/20 21:34:50 INFO mapreduce.Job:  map 100% reduce 40%
20/01/20 21:34:51 INFO mapreduce.Job:  map 100% reduce 41%
20/01/20 21:34:52 INFO mapreduce.Job:  map 100% reduce 42%
20/01/20 21:34:53 INFO mapreduce.Job:  map 100% reduce 45%
20/01/20 21:34:54 INFO mapreduce.Job:  map 100% reduce 46%
20/01/20 21:34:55 INFO mapreduce.Job:  map 100% reduce 47%
20/01/20 21:34:56 INFO mapreduce.Job:  map 100% reduce 49%
20/01/20 21:34:57 INFO mapreduce.Job:  map 100% reduce 51%
20/01/20 21:34:59 INFO mapreduce.Job:  map 100% reduce 53%
20/01/20 21:35:00 INFO mapreduce.Job:  map 100% reduce 55%
20/01/20 21:35:01 INFO mapreduce.Job:  map 100% reduce 56%
20/01/20 21:35:02 INFO mapreduce.Job:  map 100% reduce 58%
20/01/20 21:35:03 INFO mapreduce.Job:  map 100% reduce 59%
20/01/20 21:35:05 INFO mapreduce.Job:  map 100% reduce 61%
20/01/20 21:35:06 INFO mapreduce.Job:  map 100% reduce 62%
20/01/20 21:35:08 INFO mapreduce.Job:  map 100% reduce 63%
20/01/20 21:35:09 INFO mapreduce.Job:  map 100% reduce 64%
20/01/20 21:35:10 INFO mapreduce.Job:  map 100% reduce 65%
20/01/20 21:35:11 INFO mapreduce.Job:  map 100% reduce 66%
20/01/20 21:35:14 INFO mapreduce.Job:  map 100% reduce 67%
20/01/20 21:35:15 INFO mapreduce.Job:  map 100% reduce 68%
20/01/20 21:35:17 INFO mapreduce.Job:  map 100% reduce 69%
20/01/20 21:35:18 INFO mapreduce.Job:  map 100% reduce 70%
20/01/20 21:35:20 INFO mapreduce.Job:  map 100% reduce 71%
20/01/20 21:35:22 INFO mapreduce.Job:  map 100% reduce 72%
20/01/20 21:35:24 INFO mapreduce.Job:  map 100% reduce 73%
20/01/20 21:35:27 INFO mapreduce.Job:  map 100% reduce 74%
20/01/20 21:35:30 INFO mapreduce.Job:  map 100% reduce 75%
20/01/20 21:35:32 INFO mapreduce.Job:  map 100% reduce 76%
20/01/20 21:35:35 INFO mapreduce.Job:  map 100% reduce 77%
20/01/20 21:35:38 INFO mapreduce.Job:  map 100% reduce 78%
20/01/20 21:35:40 INFO mapreduce.Job:  map 100% reduce 79%
20/01/20 21:35:42 INFO mapreduce.Job:  map 100% reduce 80%
20/01/20 21:35:47 INFO mapreduce.Job:  map 100% reduce 81%
20/01/20 21:35:49 INFO mapreduce.Job:  map 100% reduce 82%
20/01/20 21:35:51 INFO mapreduce.Job:  map 100% reduce 83%
20/01/20 21:35:54 INFO mapreduce.Job:  map 100% reduce 84%
20/01/20 21:35:57 INFO mapreduce.Job:  map 100% reduce 85%
20/01/20 21:36:01 INFO mapreduce.Job:  map 100% reduce 86%
20/01/20 21:36:03 INFO mapreduce.Job:  map 100% reduce 87%
20/01/20 21:36:06 INFO mapreduce.Job:  map 100% reduce 88%
20/01/20 21:36:12 INFO mapreduce.Job:  map 100% reduce 89%
20/01/20 21:36:18 INFO mapreduce.Job:  map 100% reduce 90%
20/01/20 21:36:24 INFO mapreduce.Job:  map 100% reduce 91%
20/01/20 21:36:26 INFO mapreduce.Job:  map 100% reduce 92%
20/01/20 21:36:27 INFO mapreduce.Job:  map 100% reduce 93%
20/01/20 21:36:36 INFO mapreduce.Job:  map 100% reduce 94%
20/01/20 21:36:42 INFO mapreduce.Job:  map 100% reduce 95%
20/01/20 21:36:54 INFO mapreduce.Job:  map 100% reduce 96%
20/01/20 21:37:03 INFO mapreduce.Job:  map 100% reduce 97%
20/01/20 21:37:14 INFO mapreduce.Job:  map 100% reduce 98%
20/01/20 21:37:42 INFO mapreduce.Job:  map 100% reduce 99%
20/01/20 21:38:25 INFO mapreduce.Job:  map 100% reduce 100%
20/01/20 21:38:32 INFO mapreduce.Job: Job job_1548355429605_0410 completed successfully
20/01/20 21:38:32 INFO mapreduce.Job: Counters: 50
	File System Counters
		FILE: Number of bytes read=10942320103
		FILE: Number of bytes written=21894169060
		FILE: Number of read operations=0
		FILE: Number of large read operations=0
		FILE: Number of write operations=0
		HDFS: Number of bytes read=5626842191
		HDFS: Number of bytes written=28510
		HDFS: Number of read operations=186
		HDFS: Number of large read operations=0
		HDFS: Number of write operations=40
	Job Counters 
		Launched map tasks=42
		Launched reduce tasks=20
		Data-local map tasks=21
		Rack-local map tasks=21
		Total time spent by all maps in occupied slots (ms)=9258146
		Total time spent by all reduces in occupied slots (ms)=11141528
		Total time spent by all map tasks (ms)=4629073
		Total time spent by all reduce tasks (ms)=2785382
		Total vcore-milliseconds taken by all map tasks=4629073
		Total vcore-milliseconds taken by all reduce tasks=2785382
		Total megabyte-milliseconds taken by all map tasks=9480341504
		Total megabyte-milliseconds taken by all reduce tasks=11408924672
	Map-Reduce Framework
		Map input records=47645999
		Map output records=1064171340
		Map output bytes=8813977303
		Map output materialized bytes=10942325023
		Input split bytes=4956
		Combine input records=0
		Combine output records=0
		Reduce input groups=2410996
		Reduce shuffle bytes=10942325023
		Reduce input records=1064171340
		Reduce output records=2000
		Spilled Records=2128342680
		Shuffled Maps =840
		Failed Shuffles=0
		Merged Map outputs=840
		GC time elapsed (ms)=79017
		CPU time spent (ms)=8389070
		Physical memory (bytes) snapshot=88641232896
		Virtual memory (bytes) snapshot=256676724736
		Total committed heap usage (bytes)=95887032320
	Shuffle Errors
		BAD_ID=0
		CONNECTION=0
		IO_ERROR=0
		WRONG_LENGTH=0
		WRONG_MAP=0
		WRONG_REDUCE=0
	File Input Format Counters 
		Bytes Read=5626837235
	File Output Format Counters 
		Bytes Written=28510
20/01/20 21:38:32 INFO streaming.StreamJob: Output directory: wc_alg_1_wrk_20_corp_70
++ date +%s
+ toc=453
+ '[' '!' -e /cslu/homes/harmang/hw/hw1/logfiles/log.txt ']'
+ echo 1 nyt_eng.70 20 453
