alg,nyt_perc,ntasks,time,input,output
1,70,90,313,47645999,1064171340
2,100,50,79,67425935,14774921
2,30,20,104,20050348,4175587
1,70,20,453,47645999,1064171340
2,70,50,108,47645999,10155555
2,100,90,94,67425935,14774921
2,10,90,96,6711065,1401049
1,10,20,257,6711065,151889459
2,70,90,90,47645999,10155555
2,50,50,100,33893319,7132392
1,30,20,284,20050348,454396447
1,50,90,298,33893319,759799333
1,50,20,349,33893319,759799333
2,50,90,83,33893319,7132392
1,30,90,244,20050348,454396447
2,30,50,105,20050348,4175587
1,30,50,283,20050348,454396447
1,10,50,196,6711065,151889459
2,30,90,93,20050348,4175587
1,50,50,338,33893319,759799333
2,10,20,109,6711065,1401049
1,100,20,566,67425935,1520382667
1,100,90,373,67425935,1520382667
2,50,20,111,33893319,7132392
1,10,90,181,6711065,151889459
1,70,50,382,47645999,1064171340
2,100,20,108,67425935,14774921
2,70,20,111,47645999,10155555
1,100,50,429,67425935,1520382667
2,10,50,101,6711065,1401049
