++ JARFILE=/usr/hdp/current/hadoop-mapreduce-client/hadoop-streaming.jar
++ abbrv=dr
++ outDir=problem_2_dr_corp_50_wkr_20
++ corpusIn=50
++ corpus=/data/nyt_splits/nyt_eng.50.txt
++ num_worker=20
++ hadoop fs -rm -r /user/harmang/problem_2_dr_corp_50_wkr_20
20/01/21 16:22:37 INFO fs.TrashPolicyDefault: Moved: 'hdfs://hadoopns1.cslu.ohsu.edu:8020/user/harmang/problem_2_dr_corp_50_wkr_20' to trash at: hdfs://hadoopns1.cslu.ohsu.edu:8020/user/harmang/.Trash/Current/user/harmang/problem_2_dr_corp_50_wkr_201579652557207
++ yarn jar /usr/hdp/current/hadoop-mapreduce-client/hadoop-streaming.jar -files ./mapper_dr.py,./reducer_dr.py -numReduceTasks 20 -mapper mapper_dr.py -reducer reducer_dr.py -input /data/nyt_splits/nyt_eng.50.txt -output problem_2_dr_corp_50_wkr_20
packageJobJar: [] [/usr/hdp/2.6.3.0-235/hadoop-mapreduce/hadoop-streaming-2.7.3.2.6.3.0-235.jar] /var/lib/ambari-agent/tmp/hadoop_java_io_tmpdir/streamjob5127120154457090629.jar tmpDir=null
20/01/21 16:22:41 INFO client.RMProxy: Connecting to ResourceManager at ambari.cslu.ohsu.edu/10.95.39.226:8050
20/01/21 16:22:41 INFO client.AHSProxy: Connecting to Application History server at ambari.cslu.ohsu.edu/10.95.39.226:10200
20/01/21 16:22:42 INFO client.RMProxy: Connecting to ResourceManager at ambari.cslu.ohsu.edu/10.95.39.226:8050
20/01/21 16:22:42 INFO client.AHSProxy: Connecting to Application History server at ambari.cslu.ohsu.edu/10.95.39.226:10200
20/01/21 16:22:43 INFO mapred.FileInputFormat: Total input paths to process : 1
20/01/21 16:22:44 INFO mapreduce.JobSubmitter: number of splits:30
20/01/21 16:22:44 INFO mapreduce.JobSubmitter: Submitting tokens for job: job_1548355429605_0669
20/01/21 16:22:44 INFO impl.YarnClientImpl: Submitted application application_1548355429605_0669
20/01/21 16:22:45 INFO mapreduce.Job: The url to track the job: http://ambari.cslu.ohsu.edu:8088/proxy/application_1548355429605_0669/
20/01/21 16:22:45 INFO mapreduce.Job: Running job: job_1548355429605_0669
20/01/21 16:22:51 INFO mapreduce.Job: Job job_1548355429605_0669 running in uber mode : false
20/01/21 16:22:51 INFO mapreduce.Job:  map 0% reduce 0%
20/01/21 16:23:02 INFO mapreduce.Job:  map 1% reduce 0%
20/01/21 16:23:03 INFO mapreduce.Job:  map 2% reduce 0%
20/01/21 16:23:05 INFO mapreduce.Job:  map 4% reduce 0%
20/01/21 16:23:06 INFO mapreduce.Job:  map 5% reduce 0%
20/01/21 16:23:08 INFO mapreduce.Job:  map 10% reduce 0%
20/01/21 16:23:09 INFO mapreduce.Job:  map 11% reduce 0%
20/01/21 16:23:10 INFO mapreduce.Job:  map 12% reduce 0%
20/01/21 16:23:11 INFO mapreduce.Job:  map 15% reduce 0%
20/01/21 16:23:12 INFO mapreduce.Job:  map 17% reduce 0%
20/01/21 16:23:13 INFO mapreduce.Job:  map 18% reduce 0%
20/01/21 16:23:14 INFO mapreduce.Job:  map 20% reduce 0%
20/01/21 16:23:15 INFO mapreduce.Job:  map 23% reduce 0%
20/01/21 16:23:16 INFO mapreduce.Job:  map 24% reduce 0%
20/01/21 16:23:17 INFO mapreduce.Job:  map 26% reduce 0%
20/01/21 16:23:18 INFO mapreduce.Job:  map 29% reduce 0%
20/01/21 16:23:19 INFO mapreduce.Job:  map 30% reduce 0%
20/01/21 16:23:20 INFO mapreduce.Job:  map 32% reduce 0%
20/01/21 16:23:21 INFO mapreduce.Job:  map 34% reduce 0%
20/01/21 16:23:22 INFO mapreduce.Job:  map 35% reduce 0%
20/01/21 16:23:23 INFO mapreduce.Job:  map 38% reduce 0%
20/01/21 16:23:24 INFO mapreduce.Job:  map 41% reduce 0%
20/01/21 16:23:25 INFO mapreduce.Job:  map 42% reduce 0%
20/01/21 16:23:26 INFO mapreduce.Job:  map 44% reduce 0%
20/01/21 16:23:27 INFO mapreduce.Job:  map 47% reduce 0%
20/01/21 16:23:28 INFO mapreduce.Job:  map 48% reduce 0%
20/01/21 16:23:29 INFO mapreduce.Job:  map 49% reduce 0%
20/01/21 16:23:30 INFO mapreduce.Job:  map 52% reduce 0%
20/01/21 16:23:31 INFO mapreduce.Job:  map 54% reduce 0%
20/01/21 16:23:32 INFO mapreduce.Job:  map 56% reduce 0%
20/01/21 16:23:33 INFO mapreduce.Job:  map 60% reduce 0%
20/01/21 16:23:34 INFO mapreduce.Job:  map 63% reduce 0%
20/01/21 16:23:35 INFO mapreduce.Job:  map 66% reduce 0%
20/01/21 16:23:36 INFO mapreduce.Job:  map 70% reduce 0%
20/01/21 16:23:37 INFO mapreduce.Job:  map 73% reduce 0%
20/01/21 16:23:38 INFO mapreduce.Job:  map 77% reduce 0%
20/01/21 16:23:39 INFO mapreduce.Job:  map 88% reduce 0%
20/01/21 16:23:40 INFO mapreduce.Job:  map 91% reduce 0%
20/01/21 16:23:42 INFO mapreduce.Job:  map 93% reduce 0%
20/01/21 16:23:43 INFO mapreduce.Job:  map 95% reduce 0%
20/01/21 16:23:44 INFO mapreduce.Job:  map 97% reduce 0%
20/01/21 16:23:45 INFO mapreduce.Job:  map 99% reduce 0%
20/01/21 16:23:47 INFO mapreduce.Job:  map 100% reduce 0%
20/01/21 16:23:54 INFO mapreduce.Job:  map 100% reduce 35%
20/01/21 16:23:55 INFO mapreduce.Job:  map 100% reduce 65%
20/01/21 16:23:56 INFO mapreduce.Job:  map 100% reduce 100%
20/01/21 16:23:57 INFO mapreduce.Job: Job job_1548355429605_0669 completed successfully
20/01/21 16:23:57 INFO mapreduce.Job: Counters: 50
	File System Counters
		FILE: Number of bytes read=5615493
		FILE: Number of bytes written=18915976
		FILE: Number of read operations=0
		FILE: Number of large read operations=0
		FILE: Number of write operations=0
		HDFS: Number of bytes read=4019135470
		HDFS: Number of bytes written=1776807
		HDFS: Number of read operations=150
		HDFS: Number of large read operations=0
		HDFS: Number of write operations=40
	Job Counters 
		Launched map tasks=30
		Launched reduce tasks=20
		Data-local map tasks=19
		Rack-local map tasks=11
		Total time spent by all maps in occupied slots (ms)=2718962
		Total time spent by all reduces in occupied slots (ms)=357632
		Total time spent by all map tasks (ms)=1359481
		Total time spent by all reduce tasks (ms)=89408
		Total vcore-milliseconds taken by all map tasks=1359481
		Total vcore-milliseconds taken by all reduce tasks=89408
		Total megabyte-milliseconds taken by all map tasks=2784217088
		Total megabyte-milliseconds taken by all reduce tasks=366215168
	Map-Reduce Framework
		Map input records=33893319
		Map output records=104323
		Map output bytes=5406727
		Map output materialized bytes=5618973
		Input split bytes=3540
		Combine input records=0
		Combine output records=0
		Reduce input groups=2876
		Reduce shuffle bytes=5618973
		Reduce input records=104323
		Reduce output records=62652
		Spilled Records=208646
		Shuffled Maps =600
		Failed Shuffles=0
		Merged Map outputs=600
		GC time elapsed (ms)=33361
		CPU time spent (ms)=1181190
		Physical memory (bytes) snapshot=51623071744
		Virtual memory (bytes) snapshot=213872578560
		Total committed heap usage (bytes)=54265380864
	Shuffle Errors
		BAD_ID=0
		CONNECTION=0
		IO_ERROR=0
		WRONG_LENGTH=0
		WRONG_MAP=0
		WRONG_REDUCE=0
	File Input Format Counters 
		Bytes Read=4019131930
	File Output Format Counters 
		Bytes Written=1776807
20/01/21 16:23:57 INFO streaming.StreamJob: Output directory: problem_2_dr_corp_50_wkr_20
+++ date +%s
++ toc=84
++ echo dr nyt_eng./data/nyt_splits/nyt_eng.50.txt 20 84
dr nyt_eng./data/nyt_splits/nyt_eng.50.txt 20 84
++ /cslu/homes/harmang/hw/hw1_map_reduce/problem_2/postRun.sh dr problem_2_dr_corp_50_wkr_20 50 20
