+ JARFILE=/usr/hdp/current/hadoop-mapreduce-client/hadoop-streaming.jar
+ logfile=/cslu/homes/harmang/hw/hw1/logfiles/log.txt
+ alg=2
+ outDir=wc_alg_2_wrk_20_corp_10
+ corpus=10
+ num_worker=20
+ hadoop fs -rm -r /user/harmang/wc_alg_2_wrk_20_corp_10
rm: `/user/harmang/wc_alg_2_wrk_20_corp_10': No such file or directory
+ yarn jar /usr/hdp/current/hadoop-mapreduce-client/hadoop-streaming.jar -files ./mapper_2.py,./reducer_2.py -numReduceTasks 20 -mapper mapper_2.py -reducer reducer_2.py -input /data/nyt_splits/nyt_eng.10.txt -output wc_alg_2_wrk_20_corp_10
packageJobJar: [] [/usr/hdp/2.6.3.0-235/hadoop-mapreduce/hadoop-streaming-2.7.3.2.6.3.0-235.jar] /var/lib/ambari-agent/tmp/hadoop_java_io_tmpdir/streamjob5159562723565921788.jar tmpDir=null
20/01/20 21:31:09 INFO client.RMProxy: Connecting to ResourceManager at ambari.cslu.ohsu.edu/10.95.39.226:8050
20/01/20 21:31:09 INFO client.AHSProxy: Connecting to Application History server at ambari.cslu.ohsu.edu/10.95.39.226:10200
20/01/20 21:31:09 INFO client.RMProxy: Connecting to ResourceManager at ambari.cslu.ohsu.edu/10.95.39.226:8050
20/01/20 21:31:09 INFO client.AHSProxy: Connecting to Application History server at ambari.cslu.ohsu.edu/10.95.39.226:10200
20/01/20 21:31:11 INFO mapred.FileInputFormat: Total input paths to process : 1
20/01/20 21:31:11 INFO mapreduce.JobSubmitter: number of splits:6
20/01/20 21:31:11 INFO mapreduce.JobSubmitter: Submitting tokens for job: job_1548355429605_0398
20/01/20 21:31:12 INFO impl.YarnClientImpl: Submitted application application_1548355429605_0398
20/01/20 21:31:12 INFO mapreduce.Job: The url to track the job: http://ambari.cslu.ohsu.edu:8088/proxy/application_1548355429605_0398/
20/01/20 21:31:12 INFO mapreduce.Job: Running job: job_1548355429605_0398
20/01/20 21:31:18 INFO mapreduce.Job: Job job_1548355429605_0398 running in uber mode : false
20/01/20 21:31:18 INFO mapreduce.Job:  map 0% reduce 0%
20/01/20 21:31:29 INFO mapreduce.Job:  map 7% reduce 0%
20/01/20 21:31:31 INFO mapreduce.Job:  map 9% reduce 0%
20/01/20 21:31:32 INFO mapreduce.Job:  map 13% reduce 0%
20/01/20 21:31:33 INFO mapreduce.Job:  map 14% reduce 0%
20/01/20 21:31:35 INFO mapreduce.Job:  map 18% reduce 0%
20/01/20 21:31:36 INFO mapreduce.Job:  map 19% reduce 0%
20/01/20 21:31:38 INFO mapreduce.Job:  map 23% reduce 0%
20/01/20 21:31:39 INFO mapreduce.Job:  map 24% reduce 0%
20/01/20 21:31:40 INFO mapreduce.Job:  map 25% reduce 0%
20/01/20 21:31:41 INFO mapreduce.Job:  map 28% reduce 0%
20/01/20 21:31:43 INFO mapreduce.Job:  map 29% reduce 0%
20/01/20 21:31:44 INFO mapreduce.Job:  map 30% reduce 0%
20/01/20 21:31:45 INFO mapreduce.Job:  map 34% reduce 0%
20/01/20 21:31:46 INFO mapreduce.Job:  map 35% reduce 0%
20/01/20 21:31:47 INFO mapreduce.Job:  map 36% reduce 0%
20/01/20 21:31:48 INFO mapreduce.Job:  map 37% reduce 0%
20/01/20 21:31:49 INFO mapreduce.Job:  map 39% reduce 0%
20/01/20 21:31:50 INFO mapreduce.Job:  map 41% reduce 0%
20/01/20 21:31:51 INFO mapreduce.Job:  map 42% reduce 0%
20/01/20 21:31:52 INFO mapreduce.Job:  map 44% reduce 0%
20/01/20 21:31:53 INFO mapreduce.Job:  map 45% reduce 0%
20/01/20 21:31:54 INFO mapreduce.Job:  map 51% reduce 0%
20/01/20 21:31:55 INFO mapreduce.Job:  map 53% reduce 0%
20/01/20 21:31:56 INFO mapreduce.Job:  map 54% reduce 0%
20/01/20 21:31:57 INFO mapreduce.Job:  map 55% reduce 0%
20/01/20 21:31:58 INFO mapreduce.Job:  map 57% reduce 0%
20/01/20 21:31:59 INFO mapreduce.Job:  map 59% reduce 0%
20/01/20 21:32:01 INFO mapreduce.Job:  map 60% reduce 0%
20/01/20 21:32:02 INFO mapreduce.Job:  map 66% reduce 0%
20/01/20 21:32:03 INFO mapreduce.Job:  map 67% reduce 0%
20/01/20 21:32:04 INFO mapreduce.Job:  map 69% reduce 0%
20/01/20 21:32:05 INFO mapreduce.Job:  map 70% reduce 0%
20/01/20 21:32:07 INFO mapreduce.Job:  map 72% reduce 0%
20/01/20 21:32:08 INFO mapreduce.Job:  map 73% reduce 0%
20/01/20 21:32:09 INFO mapreduce.Job:  map 74% reduce 0%
20/01/20 21:32:10 INFO mapreduce.Job:  map 75% reduce 0%
20/01/20 21:32:11 INFO mapreduce.Job:  map 81% reduce 0%
20/01/20 21:32:12 INFO mapreduce.Job:  map 87% reduce 0%
20/01/20 21:32:13 INFO mapreduce.Job:  map 88% reduce 0%
20/01/20 21:32:15 INFO mapreduce.Job:  map 94% reduce 0%
20/01/20 21:32:17 INFO mapreduce.Job:  map 100% reduce 0%
20/01/20 21:32:46 INFO mapreduce.Job:  map 100% reduce 20%
20/01/20 21:32:47 INFO mapreduce.Job:  map 100% reduce 40%
20/01/20 21:32:48 INFO mapreduce.Job:  map 100% reduce 80%
20/01/20 21:32:49 INFO mapreduce.Job:  map 100% reduce 100%
20/01/20 21:32:49 INFO mapreduce.Job: Job job_1548355429605_0398 completed successfully
20/01/20 21:32:49 INFO mapreduce.Job: Counters: 50
	File System Counters
		FILE: Number of bytes read=20580617
		FILE: Number of bytes written=45149800
		FILE: Number of read operations=0
		FILE: Number of large read operations=0
		FILE: Number of write operations=0
		HDFS: Number of bytes read=803722323
		HDFS: Number of bytes written=25313
		HDFS: Number of read operations=78
		HDFS: Number of large read operations=0
		HDFS: Number of write operations=40
	Job Counters 
		Launched map tasks=6
		Launched reduce tasks=20
		Data-local map tasks=1
		Rack-local map tasks=5
		Total time spent by all maps in occupied slots (ms)=572260
		Total time spent by all reduces in occupied slots (ms)=502092
		Total time spent by all map tasks (ms)=286130
		Total time spent by all reduce tasks (ms)=125523
		Total vcore-milliseconds taken by all map tasks=286130
		Total vcore-milliseconds taken by all reduce tasks=125523
		Total megabyte-milliseconds taken by all map tasks=585994240
		Total megabyte-milliseconds taken by all reduce tasks=514142208
	Map-Reduce Framework
		Map input records=6711065
		Map output records=1401049
		Map output bytes=17778399
		Map output materialized bytes=20581217
		Input split bytes=708
		Combine input records=0
		Combine output records=0
		Reduce input groups=1206217
		Reduce shuffle bytes=20581217
		Reduce input records=1401049
		Reduce output records=2000
		Spilled Records=2802098
		Shuffled Maps =120
		Failed Shuffles=0
		Merged Map outputs=120
		GC time elapsed (ms)=12008
		CPU time spent (ms)=358490
		Physical memory (bytes) snapshot=14995640320
		Virtual memory (bytes) snapshot=128691019776
		Total committed heap usage (bytes)=15467544576
	Shuffle Errors
		BAD_ID=0
		CONNECTION=0
		IO_ERROR=0
		WRONG_LENGTH=0
		WRONG_MAP=0
		WRONG_REDUCE=0
	File Input Format Counters 
		Bytes Read=803721615
	File Output Format Counters 
		Bytes Written=25313
20/01/20 21:32:49 INFO streaming.StreamJob: Output directory: wc_alg_2_wrk_20_corp_10
++ date +%s
+ toc=109
+ '[' '!' -e /cslu/homes/harmang/hw/hw1/logfiles/log.txt ']'
+ echo 2 nyt_eng.10 20 109
