++ JARFILE=/usr/hdp/current/hadoop-mapreduce-client/hadoop-streaming.jar
++ abbrv=dr
++ outDir=problem_2_dr_corp_100_wkr_90
++ corpusIn=100
++ corpus=/data/nyt_splits/nyt_eng.100.txt
++ num_worker=90
++ hadoop fs -rm -r /user/harmang/problem_2_dr_corp_100_wkr_90
20/01/21 16:22:38 INFO fs.TrashPolicyDefault: Moved: 'hdfs://hadoopns1.cslu.ohsu.edu:8020/user/harmang/problem_2_dr_corp_100_wkr_90' to trash at: hdfs://hadoopns1.cslu.ohsu.edu:8020/user/harmang/.Trash/Current/user/harmang/problem_2_dr_corp_100_wkr_901579652558263
++ yarn jar /usr/hdp/current/hadoop-mapreduce-client/hadoop-streaming.jar -files ./mapper_dr.py,./reducer_dr.py -numReduceTasks 90 -mapper mapper_dr.py -reducer reducer_dr.py -input /data/nyt_splits/nyt_eng.100.txt -output problem_2_dr_corp_100_wkr_90
packageJobJar: [] [/usr/hdp/2.6.3.0-235/hadoop-mapreduce/hadoop-streaming-2.7.3.2.6.3.0-235.jar] /var/lib/ambari-agent/tmp/hadoop_java_io_tmpdir/streamjob3489468924448356838.jar tmpDir=null
20/01/21 16:22:42 INFO client.RMProxy: Connecting to ResourceManager at ambari.cslu.ohsu.edu/10.95.39.226:8050
20/01/21 16:22:42 INFO client.AHSProxy: Connecting to Application History server at ambari.cslu.ohsu.edu/10.95.39.226:10200
20/01/21 16:22:42 INFO client.RMProxy: Connecting to ResourceManager at ambari.cslu.ohsu.edu/10.95.39.226:8050
20/01/21 16:22:42 INFO client.AHSProxy: Connecting to Application History server at ambari.cslu.ohsu.edu/10.95.39.226:10200
20/01/21 16:22:44 INFO mapred.FileInputFormat: Total input paths to process : 1
20/01/21 16:22:44 INFO mapreduce.JobSubmitter: number of splits:60
20/01/21 16:22:45 INFO mapreduce.JobSubmitter: Submitting tokens for job: job_1548355429605_0679
20/01/21 16:22:45 INFO impl.YarnClientImpl: Submitted application application_1548355429605_0679
20/01/21 16:22:46 INFO mapreduce.Job: The url to track the job: http://ambari.cslu.ohsu.edu:8088/proxy/application_1548355429605_0679/
20/01/21 16:22:46 INFO mapreduce.Job: Running job: job_1548355429605_0679
20/01/21 16:22:52 INFO mapreduce.Job: Job job_1548355429605_0679 running in uber mode : false
20/01/21 16:22:52 INFO mapreduce.Job:  map 0% reduce 0%
20/01/21 16:23:06 INFO mapreduce.Job:  map 1% reduce 0%
20/01/21 16:23:09 INFO mapreduce.Job:  map 3% reduce 0%
20/01/21 16:23:10 INFO mapreduce.Job:  map 4% reduce 0%
20/01/21 16:23:12 INFO mapreduce.Job:  map 6% reduce 0%
20/01/21 16:23:13 INFO mapreduce.Job:  map 7% reduce 0%
20/01/21 16:23:14 INFO mapreduce.Job:  map 9% reduce 0%
20/01/21 16:23:15 INFO mapreduce.Job:  map 11% reduce 0%
20/01/21 16:23:16 INFO mapreduce.Job:  map 14% reduce 0%
20/01/21 16:23:17 INFO mapreduce.Job:  map 15% reduce 0%
20/01/21 16:23:18 INFO mapreduce.Job:  map 18% reduce 0%
20/01/21 16:23:19 INFO mapreduce.Job:  map 20% reduce 0%
20/01/21 16:23:20 INFO mapreduce.Job:  map 21% reduce 0%
20/01/21 16:23:21 INFO mapreduce.Job:  map 23% reduce 0%
20/01/21 16:23:22 INFO mapreduce.Job:  map 26% reduce 0%
20/01/21 16:23:23 INFO mapreduce.Job:  map 27% reduce 0%
20/01/21 16:23:24 INFO mapreduce.Job:  map 29% reduce 0%
20/01/21 16:23:25 INFO mapreduce.Job:  map 32% reduce 0%
20/01/21 16:23:26 INFO mapreduce.Job:  map 33% reduce 0%
20/01/21 16:23:27 INFO mapreduce.Job:  map 35% reduce 0%
20/01/21 16:23:28 INFO mapreduce.Job:  map 38% reduce 0%
20/01/21 16:23:29 INFO mapreduce.Job:  map 39% reduce 0%
20/01/21 16:23:30 INFO mapreduce.Job:  map 41% reduce 0%
20/01/21 16:23:31 INFO mapreduce.Job:  map 44% reduce 0%
20/01/21 16:23:32 INFO mapreduce.Job:  map 46% reduce 0%
20/01/21 16:23:33 INFO mapreduce.Job:  map 48% reduce 0%
20/01/21 16:23:34 INFO mapreduce.Job:  map 54% reduce 0%
20/01/21 16:23:35 INFO mapreduce.Job:  map 56% reduce 0%
20/01/21 16:23:36 INFO mapreduce.Job:  map 59% reduce 0%
20/01/21 16:23:37 INFO mapreduce.Job:  map 63% reduce 0%
20/01/21 16:23:38 INFO mapreduce.Job:  map 65% reduce 0%
20/01/21 16:23:39 INFO mapreduce.Job:  map 72% reduce 0%
20/01/21 16:23:40 INFO mapreduce.Job:  map 76% reduce 0%
20/01/21 16:23:41 INFO mapreduce.Job:  map 81% reduce 0%
20/01/21 16:23:42 INFO mapreduce.Job:  map 84% reduce 0%
20/01/21 16:23:43 INFO mapreduce.Job:  map 86% reduce 0%
20/01/21 16:23:44 INFO mapreduce.Job:  map 87% reduce 0%
20/01/21 16:23:45 INFO mapreduce.Job:  map 89% reduce 0%
20/01/21 16:23:46 INFO mapreduce.Job:  map 91% reduce 0%
20/01/21 16:23:47 INFO mapreduce.Job:  map 93% reduce 0%
20/01/21 16:23:49 INFO mapreduce.Job:  map 95% reduce 0%
20/01/21 16:23:51 INFO mapreduce.Job:  map 96% reduce 0%
20/01/21 16:23:52 INFO mapreduce.Job:  map 97% reduce 0%
20/01/21 16:23:54 INFO mapreduce.Job:  map 98% reduce 0%
20/01/21 16:23:59 INFO mapreduce.Job:  map 99% reduce 0%
20/01/21 16:24:02 INFO mapreduce.Job:  map 100% reduce 0%
20/01/21 16:24:03 INFO mapreduce.Job:  map 100% reduce 14%
20/01/21 16:24:04 INFO mapreduce.Job:  map 100% reduce 84%
20/01/21 16:24:05 INFO mapreduce.Job:  map 100% reduce 99%
20/01/21 16:24:06 INFO mapreduce.Job:  map 100% reduce 100%
20/01/21 16:24:06 INFO mapreduce.Job: Job job_1548355429605_0679 completed successfully
20/01/21 16:24:07 INFO mapreduce.Job: Counters: 50
	File System Counters
		FILE: Number of bytes read=10658699
		FILE: Number of bytes written=44479598
		FILE: Number of read operations=0
		FILE: Number of large read operations=0
		FILE: Number of write operations=0
		HDFS: Number of bytes read=8038401865
		HDFS: Number of bytes written=2746261
		HDFS: Number of read operations=450
		HDFS: Number of large read operations=0
		HDFS: Number of write operations=180
	Job Counters 
		Launched map tasks=60
		Launched reduce tasks=90
		Data-local map tasks=27
		Rack-local map tasks=33
		Total time spent by all maps in occupied slots (ms)=4959638
		Total time spent by all reduces in occupied slots (ms)=1396788
		Total time spent by all map tasks (ms)=2479819
		Total time spent by all reduce tasks (ms)=349197
		Total vcore-milliseconds taken by all map tasks=2479819
		Total vcore-milliseconds taken by all reduce tasks=349197
		Total megabyte-milliseconds taken by all map tasks=5078669312
		Total megabyte-milliseconds taken by all reduce tasks=1430310912
	Map-Reduce Framework
		Map input records=67425935
		Map output records=198271
		Map output bytes=10261617
		Map output materialized bytes=10690559
		Input split bytes=7140
		Combine input records=0
		Combine output records=0
		Reduce input groups=4347
		Reduce shuffle bytes=10690559
		Reduce input records=198271
		Reduce output records=97072
		Spilled Records=396542
		Shuffled Maps =5400
		Failed Shuffles=0
		Merged Map outputs=5400
		GC time elapsed (ms)=84922
		CPU time spent (ms)=2537240
		Physical memory (bytes) snapshot=115956129792
		Virtual memory (bytes) snapshot=695931015168
		Total committed heap usage (bytes)=120906055680
	Shuffle Errors
		BAD_ID=0
		CONNECTION=0
		IO_ERROR=0
		WRONG_LENGTH=0
		WRONG_MAP=0
		WRONG_REDUCE=0
	File Input Format Counters 
		Bytes Read=8038394725
	File Output Format Counters 
		Bytes Written=2746261
20/01/21 16:24:07 INFO streaming.StreamJob: Output directory: problem_2_dr_corp_100_wkr_90
+++ date +%s
++ toc=94
++ echo dr nyt_eng./data/nyt_splits/nyt_eng.100.txt 90 94
dr nyt_eng./data/nyt_splits/nyt_eng.100.txt 90 94
++ /cslu/homes/harmang/hw/hw1_map_reduce/problem_2/postRun.sh dr problem_2_dr_corp_100_wkr_90 100 90
