++ JARFILE=/usr/hdp/current/hadoop-mapreduce-client/hadoop-streaming.jar
++ abbrv=dr
++ outDir=problem_2_dr_corp_70_wkr_50
++ corpusIn=70
++ corpus=/data/nyt_splits/nyt_eng.70.txt
++ num_worker=50
++ hadoop fs -rm -r /user/harmang/problem_2_dr_corp_70_wkr_50
20/01/21 16:22:37 INFO fs.TrashPolicyDefault: Moved: 'hdfs://hadoopns1.cslu.ohsu.edu:8020/user/harmang/problem_2_dr_corp_70_wkr_50' to trash at: hdfs://hadoopns1.cslu.ohsu.edu:8020/user/harmang/.Trash/Current/user/harmang/problem_2_dr_corp_70_wkr_501579652557241
++ yarn jar /usr/hdp/current/hadoop-mapreduce-client/hadoop-streaming.jar -files ./mapper_dr.py,./reducer_dr.py -numReduceTasks 50 -mapper mapper_dr.py -reducer reducer_dr.py -input /data/nyt_splits/nyt_eng.70.txt -output problem_2_dr_corp_70_wkr_50
packageJobJar: [] [/usr/hdp/2.6.3.0-235/hadoop-mapreduce/hadoop-streaming-2.7.3.2.6.3.0-235.jar] /var/lib/ambari-agent/tmp/hadoop_java_io_tmpdir/streamjob8004408125791536388.jar tmpDir=null
20/01/21 16:22:41 INFO client.RMProxy: Connecting to ResourceManager at ambari.cslu.ohsu.edu/10.95.39.226:8050
20/01/21 16:22:42 INFO client.AHSProxy: Connecting to Application History server at ambari.cslu.ohsu.edu/10.95.39.226:10200
20/01/21 16:22:42 INFO client.RMProxy: Connecting to ResourceManager at ambari.cslu.ohsu.edu/10.95.39.226:8050
20/01/21 16:22:42 INFO client.AHSProxy: Connecting to Application History server at ambari.cslu.ohsu.edu/10.95.39.226:10200
20/01/21 16:22:44 INFO mapred.FileInputFormat: Total input paths to process : 1
20/01/21 16:22:44 INFO mapreduce.JobSubmitter: number of splits:42
20/01/21 16:22:44 INFO mapreduce.JobSubmitter: Submitting tokens for job: job_1548355429605_0673
20/01/21 16:22:45 INFO impl.YarnClientImpl: Submitted application application_1548355429605_0673
20/01/21 16:22:45 INFO mapreduce.Job: The url to track the job: http://ambari.cslu.ohsu.edu:8088/proxy/application_1548355429605_0673/
20/01/21 16:22:45 INFO mapreduce.Job: Running job: job_1548355429605_0673
20/01/21 16:22:51 INFO mapreduce.Job: Job job_1548355429605_0673 running in uber mode : false
20/01/21 16:22:51 INFO mapreduce.Job:  map 0% reduce 0%
20/01/21 16:23:04 INFO mapreduce.Job:  map 1% reduce 0%
20/01/21 16:23:05 INFO mapreduce.Job:  map 2% reduce 0%
20/01/21 16:23:06 INFO mapreduce.Job:  map 3% reduce 0%
20/01/21 16:23:07 INFO mapreduce.Job:  map 5% reduce 0%
20/01/21 16:23:08 INFO mapreduce.Job:  map 8% reduce 0%
20/01/21 16:23:09 INFO mapreduce.Job:  map 10% reduce 0%
20/01/21 16:23:10 INFO mapreduce.Job:  map 11% reduce 0%
20/01/21 16:23:11 INFO mapreduce.Job:  map 14% reduce 0%
20/01/21 16:23:12 INFO mapreduce.Job:  map 15% reduce 0%
20/01/21 16:23:13 INFO mapreduce.Job:  map 17% reduce 0%
20/01/21 16:23:14 INFO mapreduce.Job:  map 19% reduce 0%
20/01/21 16:23:15 INFO mapreduce.Job:  map 21% reduce 0%
20/01/21 16:23:16 INFO mapreduce.Job:  map 22% reduce 0%
20/01/21 16:23:17 INFO mapreduce.Job:  map 25% reduce 0%
20/01/21 16:23:19 INFO mapreduce.Job:  map 27% reduce 0%
20/01/21 16:23:20 INFO mapreduce.Job:  map 28% reduce 0%
20/01/21 16:23:21 INFO mapreduce.Job:  map 31% reduce 0%
20/01/21 16:23:22 INFO mapreduce.Job:  map 33% reduce 0%
20/01/21 16:23:23 INFO mapreduce.Job:  map 35% reduce 0%
20/01/21 16:23:24 INFO mapreduce.Job:  map 38% reduce 0%
20/01/21 16:23:25 INFO mapreduce.Job:  map 40% reduce 0%
20/01/21 16:23:26 INFO mapreduce.Job:  map 41% reduce 0%
20/01/21 16:23:27 INFO mapreduce.Job:  map 44% reduce 0%
20/01/21 16:23:28 INFO mapreduce.Job:  map 46% reduce 0%
20/01/21 16:23:30 INFO mapreduce.Job:  map 50% reduce 0%
20/01/21 16:23:31 INFO mapreduce.Job:  map 52% reduce 0%
20/01/21 16:23:32 INFO mapreduce.Job:  map 53% reduce 0%
20/01/21 16:23:33 INFO mapreduce.Job:  map 56% reduce 0%
20/01/21 16:23:34 INFO mapreduce.Job:  map 58% reduce 0%
20/01/21 16:23:35 INFO mapreduce.Job:  map 60% reduce 0%
20/01/21 16:23:36 INFO mapreduce.Job:  map 64% reduce 0%
20/01/21 16:23:37 INFO mapreduce.Job:  map 69% reduce 0%
20/01/21 16:23:38 INFO mapreduce.Job:  map 73% reduce 0%
20/01/21 16:23:39 INFO mapreduce.Job:  map 78% reduce 0%
20/01/21 16:23:40 INFO mapreduce.Job:  map 84% reduce 0%
20/01/21 16:23:41 INFO mapreduce.Job:  map 91% reduce 0%
20/01/21 16:23:42 INFO mapreduce.Job:  map 95% reduce 0%
20/01/21 16:23:44 INFO mapreduce.Job:  map 96% reduce 0%
20/01/21 16:23:45 INFO mapreduce.Job:  map 98% reduce 0%
20/01/21 16:23:46 INFO mapreduce.Job:  map 99% reduce 0%
20/01/21 16:23:50 INFO mapreduce.Job:  map 100% reduce 0%
20/01/21 16:23:55 INFO mapreduce.Job:  map 100% reduce 8%
20/01/21 16:23:56 INFO mapreduce.Job:  map 100% reduce 54%
20/01/21 16:23:57 INFO mapreduce.Job:  map 100% reduce 84%
20/01/21 16:23:58 INFO mapreduce.Job:  map 100% reduce 100%
20/01/21 16:23:59 INFO mapreduce.Job: Job job_1548355429605_0673 completed successfully
20/01/21 16:23:59 INFO mapreduce.Job: Counters: 50
	File System Counters
		FILE: Number of bytes read=7773740
		FILE: Number of bytes written=29717270
		FILE: Number of read operations=0
		FILE: Number of large read operations=0
		FILE: Number of write operations=0
		HDFS: Number of bytes read=5626842191
		HDFS: Number of bytes written=2180480
		HDFS: Number of read operations=276
		HDFS: Number of large read operations=0
		HDFS: Number of write operations=100
	Job Counters 
		Launched map tasks=42
		Launched reduce tasks=50
		Data-local map tasks=26
		Rack-local map tasks=16
		Total time spent by all maps in occupied slots (ms)=3803176
		Total time spent by all reduces in occupied slots (ms)=842048
		Total time spent by all map tasks (ms)=1901588
		Total time spent by all reduce tasks (ms)=210512
		Total vcore-milliseconds taken by all map tasks=1901588
		Total vcore-milliseconds taken by all reduce tasks=210512
		Total megabyte-milliseconds taken by all map tasks=3894452224
		Total megabyte-milliseconds taken by all reduce tasks=862257152
	Map-Reduce Framework
		Map input records=47645999
		Map output records=144513
		Map output bytes=7484414
		Map output materialized bytes=7786040
		Input split bytes=4956
		Combine input records=0
		Combine output records=0
		Reduce input groups=3428
		Reduce shuffle bytes=7786040
		Reduce input records=144513
		Reduce output records=77042
		Spilled Records=289026
		Shuffled Maps =2100
		Failed Shuffles=0
		Merged Map outputs=2100
		GC time elapsed (ms)=70289
		CPU time spent (ms)=1847880
		Physical memory (bytes) snapshot=77948735488
		Virtual memory (bytes) snapshot=417409339392
		Total committed heap usage (bytes)=81505812480
	Shuffle Errors
		BAD_ID=0
		CONNECTION=0
		IO_ERROR=0
		WRONG_LENGTH=0
		WRONG_MAP=0
		WRONG_REDUCE=0
	File Input Format Counters 
		Bytes Read=5626837235
	File Output Format Counters 
		Bytes Written=2180480
20/01/21 16:23:59 INFO streaming.StreamJob: Output directory: problem_2_dr_corp_70_wkr_50
+++ date +%s
++ toc=87
++ echo dr nyt_eng./data/nyt_splits/nyt_eng.70.txt 50 87
dr nyt_eng./data/nyt_splits/nyt_eng.70.txt 50 87
++ /cslu/homes/harmang/hw/hw1_map_reduce/problem_2/postRun.sh dr problem_2_dr_corp_70_wkr_50 70 50
