++ JARFILE=/usr/hdp/current/hadoop-mapreduce-client/hadoop-streaming.jar
++ abbrv=st
++ outDir=problem_2_st_corp_10_wkr_50
++ corpusIn=10
++ corpus=/data/nyt_splits/nyt_eng.10.txt
++ num_worker=50
++ hadoop fs -rm -r /user/harmang/problem_2_st_corp_10_wkr_50
20/01/21 16:22:38 INFO fs.TrashPolicyDefault: Moved: 'hdfs://hadoopns1.cslu.ohsu.edu:8020/user/harmang/problem_2_st_corp_10_wkr_50' to trash at: hdfs://hadoopns1.cslu.ohsu.edu:8020/user/harmang/.Trash/Current/user/harmang/problem_2_st_corp_10_wkr_501579652558155
++ yarn jar /usr/hdp/current/hadoop-mapreduce-client/hadoop-streaming.jar -files ./mapper_st.py,./reducer_st.py -numReduceTasks 50 -mapper mapper_st.py -reducer reducer_st.py -input /data/nyt_splits/nyt_eng.10.txt -output problem_2_st_corp_10_wkr_50
packageJobJar: [] [/usr/hdp/2.6.3.0-235/hadoop-mapreduce/hadoop-streaming-2.7.3.2.6.3.0-235.jar] /var/lib/ambari-agent/tmp/hadoop_java_io_tmpdir/streamjob7287118829641485900.jar tmpDir=null
20/01/21 16:22:42 INFO client.RMProxy: Connecting to ResourceManager at ambari.cslu.ohsu.edu/10.95.39.226:8050
20/01/21 16:22:42 INFO client.AHSProxy: Connecting to Application History server at ambari.cslu.ohsu.edu/10.95.39.226:10200
20/01/21 16:22:42 INFO client.RMProxy: Connecting to ResourceManager at ambari.cslu.ohsu.edu/10.95.39.226:8050
20/01/21 16:22:42 INFO client.AHSProxy: Connecting to Application History server at ambari.cslu.ohsu.edu/10.95.39.226:10200
20/01/21 16:22:44 INFO mapred.FileInputFormat: Total input paths to process : 1
20/01/21 16:22:44 INFO mapreduce.JobSubmitter: number of splits:6
20/01/21 16:22:45 INFO mapreduce.JobSubmitter: Submitting tokens for job: job_1548355429605_0680
20/01/21 16:22:45 INFO impl.YarnClientImpl: Submitted application application_1548355429605_0680
20/01/21 16:22:45 INFO mapreduce.Job: The url to track the job: http://ambari.cslu.ohsu.edu:8088/proxy/application_1548355429605_0680/
20/01/21 16:22:45 INFO mapreduce.Job: Running job: job_1548355429605_0680
20/01/21 16:22:53 INFO mapreduce.Job: Job job_1548355429605_0680 running in uber mode : false
20/01/21 16:22:53 INFO mapreduce.Job:  map 0% reduce 0%
20/01/21 16:23:04 INFO mapreduce.Job:  map 6% reduce 0%
20/01/21 16:23:07 INFO mapreduce.Job:  map 11% reduce 0%
20/01/21 16:23:08 INFO mapreduce.Job:  map 13% reduce 0%
20/01/21 16:23:10 INFO mapreduce.Job:  map 19% reduce 0%
20/01/21 16:23:11 INFO mapreduce.Job:  map 21% reduce 0%
20/01/21 16:23:13 INFO mapreduce.Job:  map 26% reduce 0%
20/01/21 16:23:14 INFO mapreduce.Job:  map 28% reduce 0%
20/01/21 16:23:16 INFO mapreduce.Job:  map 31% reduce 0%
20/01/21 16:23:17 INFO mapreduce.Job:  map 34% reduce 0%
20/01/21 16:23:19 INFO mapreduce.Job:  map 37% reduce 0%
20/01/21 16:23:20 INFO mapreduce.Job:  map 46% reduce 0%
20/01/21 16:23:22 INFO mapreduce.Job:  map 49% reduce 0%
20/01/21 16:23:23 INFO mapreduce.Job:  map 51% reduce 0%
20/01/21 16:23:25 INFO mapreduce.Job:  map 54% reduce 0%
20/01/21 16:23:26 INFO mapreduce.Job:  map 56% reduce 0%
20/01/21 16:23:28 INFO mapreduce.Job:  map 65% reduce 0%
20/01/21 16:23:29 INFO mapreduce.Job:  map 66% reduce 0%
20/01/21 16:23:31 INFO mapreduce.Job:  map 68% reduce 0%
20/01/21 16:23:32 INFO mapreduce.Job:  map 69% reduce 0%
20/01/21 16:23:33 INFO mapreduce.Job:  map 75% reduce 0%
20/01/21 16:23:35 INFO mapreduce.Job:  map 76% reduce 0%
20/01/21 16:23:36 INFO mapreduce.Job:  map 78% reduce 0%
20/01/21 16:23:39 INFO mapreduce.Job:  map 86% reduce 0%
20/01/21 16:23:40 INFO mapreduce.Job:  map 92% reduce 0%
20/01/21 16:23:41 INFO mapreduce.Job:  map 93% reduce 0%
20/01/21 16:23:44 INFO mapreduce.Job:  map 100% reduce 0%
20/01/21 16:24:05 INFO mapreduce.Job:  map 100% reduce 24%
20/01/21 16:24:06 INFO mapreduce.Job:  map 100% reduce 70%
20/01/21 16:24:07 INFO mapreduce.Job:  map 100% reduce 96%
20/01/21 16:24:08 INFO mapreduce.Job:  map 100% reduce 100%
20/01/21 16:24:08 INFO mapreduce.Job: Job job_1548355429605_0680 completed successfully
20/01/21 16:24:08 INFO mapreduce.Job: Counters: 50
	File System Counters
		FILE: Number of bytes read=937331
		FILE: Number of bytes written=10469620
		FILE: Number of read operations=0
		FILE: Number of large read operations=0
		FILE: Number of write operations=0
		HDFS: Number of bytes read=803722323
		HDFS: Number of bytes written=662187
		HDFS: Number of read operations=168
		HDFS: Number of large read operations=0
		HDFS: Number of write operations=100
	Job Counters 
		Launched map tasks=6
		Launched reduce tasks=50
		Data-local map tasks=1
		Rack-local map tasks=5
		Total time spent by all maps in occupied slots (ms)=469166
		Total time spent by all reduces in occupied slots (ms)=779280
		Total time spent by all map tasks (ms)=234583
		Total time spent by all reduce tasks (ms)=194820
		Total vcore-milliseconds taken by all map tasks=234583
		Total vcore-milliseconds taken by all reduce tasks=194820
		Total megabyte-milliseconds taken by all map tasks=480425984
		Total megabyte-milliseconds taken by all reduce tasks=797982720
	Map-Reduce Framework
		Map input records=6711065
		Map output records=16825
		Map output bytes=903381
		Map output materialized bytes=938831
		Input split bytes=708
		Combine input records=0
		Combine output records=0
		Reduce input groups=2329
		Reduce shuffle bytes=938831
		Reduce input records=16825
		Reduce output records=23340
		Spilled Records=33650
		Shuffled Maps =300
		Failed Shuffles=0
		Merged Map outputs=300
		GC time elapsed (ms)=12397
		CPU time spent (ms)=327480
		Physical memory (bytes) snapshot=22471061504
		Virtual memory (bytes) snapshot=289459253248
		Total committed heap usage (bytes)=23211278336
	Shuffle Errors
		BAD_ID=0
		CONNECTION=0
		IO_ERROR=0
		WRONG_LENGTH=0
		WRONG_MAP=0
		WRONG_REDUCE=0
	File Input Format Counters 
		Bytes Read=803721615
	File Output Format Counters 
		Bytes Written=662187
20/01/21 16:24:08 INFO streaming.StreamJob: Output directory: problem_2_st_corp_10_wkr_50
+++ date +%s
++ toc=96
++ echo st nyt_eng./data/nyt_splits/nyt_eng.10.txt 50 96
st nyt_eng./data/nyt_splits/nyt_eng.10.txt 50 96
++ /cslu/homes/harmang/hw/hw1_map_reduce/problem_2/postRun.sh st problem_2_st_corp_10_wkr_50 10 50
