[{
  "_id": {
    "$oid": "5f93a7d947c621a46f9156ce"
  },
  "judul": "Belajar MongoDB",
  "isi": "ayo belajar mongodb bersama DTS lewat Thematic Academy",
  "penulis": "Harlan oroh",
  "waktu": {
    "$date": "2020-10-24T03:11:25Z"
  },
  "tag": [
    "IT",
    "Database",
    "NoSql"
  ],
  "komentar": [
    {
      "pembaca": "Noel Oroh",
      "komentar": "postinganya sangat menarik gan",
      "rate": 9.2,
      "waktu": {
        "$date": "2020-10-24T03:12:12Z"
      }
    },
    {
      "pembaca": "Nero Oroh",
      "komentar": "terima kasih infonya gan",
      "rate": 8.5,
      "waktu": {
        "$date": "2020-10-24T03:12:20Z"
      }
    },
    {
      "pembaca": "Virginia Koampa",
      "komentar": "Informasi menarik nih",
      "rate": 8.5,
      "waktu": {
        "$date": "2020-10-24T03:12:22Z"
      }
    },
    {
      "pembaca": "Gisel albert",
      "komentar": "Mantul gan",
      "rate": 8.8,
      "waktu": {
        "$date": "2020-10-24T03:12:25Z"
      }
    }
  ]
},{
  "_id": {
    "$oid": "5f93ae5b5996ad448cfc24fd"
  },
  "judul": "Belajar NodeJS",
  "isi": "ayo belajar mongodb bersama DTS lewat Thematic Academy",
  "penulis": "Yordias Ram",
  "waktu": {
    "$date": "2020-10-24T03:11:30Z"
  },
  "tag": [
    "IT",
    "Server-Side"
  ],
  "komentar": [
    {
      "pembaca": "Harlan Oroh",
      "komentar": "Keren materinya",
      "rate": 9.2,
      "waktu": {
        "$date": "2020-10-24T03:12:11Z"
      }
    },
    {
      "pembaca": "Nero Oroh",
      "komentar": "Bermanfaat nih gan",
      "rate": 8.7,
      "waktu": {
        "$date": "2020-10-24T03:12:19Z"
      }
    },
    {
      "pembaca": "Pinki Mentari",
      "komentar": "Informasi menarik nih",
      "rate": 8.6,
      "waktu": {
        "$date": "2020-10-24T03:12:22Z"
      }
    }
  ]
},{
  "_id": {
    "$oid": "5f93b0235996ad448cfc24fe"
  },
  "judul": "Teknik Memotret",
  "isi": "Teknik memotret atau pengambilan gambar sangat berpengaruh terhadap hasil gambar yang bagus",
  "penulis": "Nicol Filadelvia",
  "waktu": {
    "$date": "2020-10-24T03:11:40Z"
  },
  "tag": [
    "Photograph"
  ],
  "komentar": [
    {
      "pembaca": "Mei Mein",
      "komentar": "Keren materinya, ingin belajar",
      "rate": 9.1,
      "waktu": {
        "$date": "2020-10-24T03:18:16Z"
      }
    },
    {
      "pembaca": "Andre And",
      "komentar": "Tambah lagi dong penjelasannya",
      "rate": 7.9,
      "waktu": {
        "$date": "2020-10-24T03:18:19Z"
      }
    },
    {
      "pembaca": "Alfrits Ro",
      "komentar": "Keren banget informasinya",
      "rate": 8.9,
      "waktu": {
        "$date": "2020-10-24T03:18:22Z"
      }
    },
    {
      "pembaca": "Gisel albert",
      "komentar": "Ingin ikut kursusnya",
      "rate": 9.1,
      "waktu": {
        "$date": "2020-10-24T03:18:23Z"
      }
    },
    {
      "pembaca": "Maria Indo",
      "komentar": "Ingin ketemu masternya",
      "rate": 9.1,
      "waktu": {
        "$date": "2020-10-24T03:18:26Z"
      }
    }
  ]
},{
  "_id": {
    "$oid": "5f93b92a5996ad448cfc24ff"
  },
  "judul": "Teknik MySQL",
  "isi": "MySql adalah sistem manajemen database relasional open source (RDBMS) dengan client-server model",
  "penulis": "Nicol Filadelvia",
  "waktu": {
    "$date": "2020-10-24T03:14:40Z"
  },
  "tag": [
    "Mysql",
    "IT",
    "Database"
  ],
  "komentar": [
    {
      "pembaca": "Jhon Ohm",
      "komentar": "Ditunggu postingan lanjutan mysqlnya",
      "rate": 8.5,
      "waktu": {
        "$date": "2020-10-24T03:18:16Z"
      }
    },
    {
      "pembaca": "Andre And",
      "komentar": "Tambah lagi dong penjelasannya",
      "rate": 7.9,
      "waktu": {
        "$date": "2020-10-24T03:18:19Z"
      }
    },
    {
      "pembaca": "Jannifer Finlandia",
      "komentar": "Keren banget informasinya",
      "rate": 8.9,
      "waktu": {
        "$date": "2020-10-24T03:18:22Z"
      }
    },
    {
      "pembaca": "Gisel albert",
      "komentar": "Ingin ikut kursusnya",
      "rate": 9.1,
      "waktu": {
        "$date": "2020-10-24T03:18:23Z"
      }
    },
    {
      "pembaca": "Maria Indo",
      "komentar": "Ingin ketemu masternya",
      "rate": 9.1,
      "waktu": {
        "$date": "2020-10-24T03:18:26Z"
      }
    }
  ]
},{
  "_id": {
    "$oid": "5f93bb7f5996ad448cfc2500"
  },
  "judul": "Modeling MySQL",
  "isi": "Diagram ER biasanya berhubungan langsung dengan diagram data flow untuk menampilkan konten data store.",
  "penulis": "Harlan Oroh",
  "waktu": {
    "$date": "2020-10-24T03:15:40Z"
  },
  "tag": [
    "Mysql",
    "IT",
    "Database"
  ],
  "komentar": [
    {
      "pembaca": "Jhon Ohm",
      "komentar": "Ditunggu postingan lanjutan mysqlnya",
      "rate": 8.1,
      "waktu": {
        "$date": "2020-10-24T03:18:16Z"
      }
    },
    {
      "pembaca": "Andre And",
      "komentar": "Tambah lagi dong penjelasannya",
      "rate": 9.9,
      "waktu": {
        "$date": "2020-10-24T03:18:19Z"
      }
    }
  ]
},{
  "_id": {
    "$oid": "5f93bb875996ad448cfc2501"
  },
  "judul": "Framework",
  "isi": "Dalam pemrograman komputer, kerangka kerja perangkat lunak adalah abstraksi di mana perangkat lunak yang menyediakan fungsionalitas generik dapat diubah secara selektif oleh kode tambahan yang ditulis pengguna, sehingga menyediakan perangkat lunak khusus aplikasi.",
  "penulis": "Harlan Oroh",
  "waktu": {
    "$date": "2020-10-24T04:10:40Z"
  },
  "tag": [
    "Framework",
    "IT"
  ],
  "komentar": [
    {
      "pembaca": "Jannifer Finlandia",
      "komentar": "Framework sangat dibutuhkan kayaknya",
      "rate": 8.9,
      "waktu": {
        "$date": "2020-10-24T04:18:16Z"
      }
    },
    {
      "pembaca": "Mei Mein",
      "komentar": "CI dan Laravel andalan ku",
      "rate": 8.5,
      "waktu": {
        "$date": "2020-10-24T04:18:19Z"
      }
    },
    {
      "pembaca": "Pinky Mentari",
      "komentar": "Referensinya keren",
      "rate": 9.9,
      "waktu": {
        "$date": "2020-10-24T04:18:40Z"
      }
    }
  ]
}]