<?xml version="1.0" encoding="utf-8"?>
<!-- Generator: Adobe Illustrator 22.1.0, SVG Export Plug-In . SVG Version: 6.00 Build 0)  -->
<svg version="1.1" xmlns="http://www.w3.org/2000/svg" xmlns:xlink="http://www.w3.org/1999/xlink" x="0px" y="0px"
	 viewBox="0 0 100 100" style="enable-background:new 0 0 100 100;" xml:space="preserve">
<style type="text/css">
	.st0{display:none;}
	.st1{display:inline;fill:#FF7478;}
	.st2{display:inline;}
	.st3{clip-path:url(#SVGID_2_);}
	.st4{fill:#5E5E5E;}
	.st5{fill:#BD2130;}
	.st6{display:inline;fill:#5E5E5E;}
	.st7{fill:#FF7478;}
	.st8{clip-path:url(#SVGID_4_);}
	.st9{clip-path:url(#SVGID_6_);}
</style>
<g id="Default" class="st0">
	<polygon class="st1" points="50.5,86.3 68.8,61 32.1,61 	"/>
	<g class="st2">
		<defs>
			<polygon id="SVGID_1_" points="50.5,86.3 68.8,61 32.1,61 			"/>
		</defs>
		<clipPath id="SVGID_2_">
			<use xlink:href="#SVGID_1_"  style="overflow:visible;"/>
		</clipPath>
		<g class="st3">
			<circle class="st4" cx="54" cy="54" r="22"/>
		</g>
	</g>
	<g class="st2">
		<circle class="st5" cx="50.5" cy="50.1" r="22"/>
	</g>
	<circle class="st1" cx="50.3" cy="50.1" r="11"/>
	<ellipse class="st6" cx="50.5" cy="88.2" rx="3.5" ry="1.2"/>
</g>
<g id="Layer_2">
	<polygon class="st7" points="50.5,86.3 68.8,61 32.1,61 	"/>
	<g>
		<defs>
			<polygon id="SVGID_3_" points="50.5,86.3 68.8,61 32.1,61 			"/>
		</defs>
		<clipPath id="SVGID_4_">
			<use xlink:href="#SVGID_3_"  style="overflow:visible;"/>
		</clipPath>
		<g class="st8">
			<circle class="st4" cx="54" cy="54" r="22"/>
		</g>
	</g>
	<g>
		<ellipse class="st5" cx="50.5" cy="59.5" rx="22" ry="12.5"/>
	</g>
	<g>
		<defs>
			<ellipse id="SVGID_5_" cx="50.5" cy="59.5" rx="22" ry="12.5"/>
		</defs>
		<clipPath id="SVGID_6_">
			<use xlink:href="#SVGID_5_"  style="overflow:visible;"/>
		</clipPath>
		<g class="st9">
			
				<ellipse transform="matrix(0.1448 -0.9895 0.9895 0.1448 -18.6587 104.9713)" class="st4" cx="51.4" cy="63.3" rx="3.5" ry="12"/>
		</g>
	</g>
	<circle class="st7" cx="51" cy="50" r="11"/>
	<ellipse class="st4" cx="50.5" cy="88.2" rx="3.5" ry="1.2"/>
</g>
</svg>
