#
## Alias OBJ Material File
# Exported from SketchUp, (c) 2000-2012 Trimble Navigation Limited

newmtl M_0133_Gray
Ka 0.000000 0.000000 0.000000
Kd 0.501961 0.501961 0.501961
Ks 0.330000 0.330000 0.330000

newmtl _Color_000_1
Ka 0.000000 0.000000 0.000000
Kd 1.000000 1.000000 1.000000
Ks 0.330000 0.330000 0.330000

newmtl Chrome_02
Ka 0.000000 0.000000 0.000000
Kd 0.878431 0.878431 0.878431
Ks 0.330000 0.330000 0.330000

newmtl M_0136_Charcoal
Ka 0.000000 0.000000 0.000000
Kd 0.086275 0.086275 0.086275
Ks 0.330000 0.330000 0.330000

newmtl _LCD_Screen
Ka 0.000000 0.000000 0.000000
Kd 0.529412 0.098039 0.105882
Ks 0.330000 0.330000 0.330000

newmtl Body_Color
Ka 0.000000 0.000000 0.000000
Kd 0.988235 0.972549 0.949020
Ks 0.330000 0.330000 0.330000

newmtl _Color_007_1
Ka 0.000000 0.000000 0.000000
Kd 0.227451 0.227451 0.227451
Ks 0.330000 0.330000 0.330000

newmtl BMW_X5_2014_Black_Glass
Ka 0.000000 0.000000 0.000000
Kd 0.000000 0.000000 0.000000
Ks 0.330000 0.330000 0.330000
d 0.500000

newmtl PDM_LEM_orange_power_10
Ka 0.000000 0.000000 0.000000
Kd 1.000000 0.447059 0.000000
Ks 0.330000 0.330000 0.330000

newmtl _Translucent_Glass_Gray_1
Ka 0.000000 0.000000 0.000000
Kd 0.501961 0.501961 0.501961
Ks 0.330000 0.330000 0.330000
d 0.270000

newmtl M_0132_LightGray
Ka 0.000000 0.000000 0.000000
Kd 0.662745 0.662745 0.662745
Ks 0.330000 0.330000 0.330000

newmtl M_0131_Silver
Ka 0.000000 0.000000 0.000000
Kd 0.752941 0.752941 0.752941
Ks 0.330000 0.330000 0.330000

newmtl Chrome
Ka 0.000000 0.000000 0.000000
Kd 0.901961 0.949020 1.000000
Ks 0.330000 0.330000 0.330000

newmtl Headlights_1
Ka 0.000000 0.000000 0.000000
Kd 1.000000 1.000000 1.000000
Ks 0.330000 0.330000 0.330000
d 0.550000

newmtl Taillight_Glass
Ka 0.000000 0.000000 0.000000
Kd 0.729412 0.000000 0.000000
Ks 0.330000 0.330000 0.330000
d 0.750000

newmtl M_0129_WhiteSmoke
Ka 0.000000 0.000000 0.000000
Kd 0.960784 0.960784 0.960784
Ks 0.330000 0.330000 0.330000

newmtl Tires1
Ka 0.000000 0.000000 0.000000
Kd 0.066667 0.066667 0.066667
Ks 0.330000 0.330000 0.330000

newmtl M_0135_DarkGray
Ka 0.000000 0.000000 0.000000
Kd 0.317647 0.317647 0.317647
Ks 0.330000 0.330000 0.330000

newmtl Interior_1
Ka 0.000000 0.000000 0.000000
Kd 0.164706 0.164706 0.164706
Ks 0.330000 0.330000 0.330000

newmtl _Carpet
Ka 0.000000 0.000000 0.000000
Kd 0.000000 0.000000 0.000000
Ks 0.330000 0.330000 0.330000
map_Kd red car/_Carpet.jpg

newmtl M_0137_Black
Ka 0.000000 0.000000 0.000000
Kd 0.039216 0.039216 0.039216
Ks 0.330000 0.330000 0.330000

newmtl M_0093_AliceBlue
Ka 0.000000 0.000000 0.000000
Kd 0.941176 0.972549 1.000000
Ks 0.330000 0.330000 0.330000

newmtl Grills
Ka 0.000000 0.000000 0.000000
Kd 0.019608 0.019608 0.019608
Ks 0.330000 0.330000 0.330000
map_Kd red car/Grills.jpg

newmtl MCLS_tex1
Ka 0.000000 0.000000 0.000000
Kd 0.498039 0.498039 0.498039
Ks 0.330000 0.330000 0.330000

newmtl Honda_Gold_Wing_GPS_display_1_
Ka 0.000000 0.000000 0.000000
Kd 0.501961 0.501961 0.501961
Ks 0.000000 0.000000 0.000000
map_Kd red car/Honda_Gold_Wing_GPS_display_1_.jpg

newmtl white_ppc
Ka 0.000000 0.000000 0.000000
Kd 0.858824 0.858824 0.858824
Ks 0.330000 0.330000 0.330000

newmtl opal_glass2
Ka 0.000000 0.000000 0.000000
Kd 0.917647 0.917647 0.917647
Ks 0.330000 0.330000 0.330000
d 0.680000

newmtl Color_008
Ka 0.000000 0.000000 0.000000
Kd 0.117647 0.117647 0.117647
Ks 0.330000 0.330000 0.330000

newmtl FrontColor
Ka 0.000000 0.000000 0.000000
Kd 1.000000 1.000000 1.000000
Ks 0.330000 0.330000 0.330000

newmtl _Color_I17__1
Ka 0.000000 0.000000 0.000000
Kd 0.078431 0.078431 0.400000
Ks 0.330000 0.330000 0.330000

