{
  "images" : [
    {
      "idiom" : "universal",
      "filename" : "right-arrow-png-right-arrow-gray-clip-art-at-clker-com-vector-clip-art-online-royalty-free-public-domain-380.png",
      "scale" : "1x"
    },
    {
      "idiom" : "universal",
      "filename" : "right-arrow-png-right-arrow-gray-clip-art-at-clker-com-vector-clip-art-online-royalty-free-public-domain-379.png",
      "scale" : "2x"
    },
    {
      "idiom" : "universal",
      "filename" : "right-arrow-png-right-arrow-gray-clip-art-at-clker-com-vector-clip-art-online-royalty-free-public-domain-378.png",
      "scale" : "3x"
    }
  ],
  "info" : {
    "version" : 1,
    "author" : "xcode"
  }
}