{
  "info" : {
    "version" : 1,
    "author" : "xcode"
  },
  "data" : [
    {
      "idiom" : "universal",
      "filename" : "Illuminate.mp3",
      "universal-type-identifier" : "public.mp3"
    }
  ]
}