<svg width="20" height="20" viewBox="0 0 20 20" fill="none" xmlns="http://www.w3.org/2000/svg">
<path d="M10.7253 19.6812L19.6755 12.9809L12.2429 12.9027L13.7605 6.12433L7.11312 8.13985L6.48463 0.733438L0.46574 10.1554L10.7253 19.6812Z" fill="#BD8383"/>
</svg>
