{
  "images" : [
    {
      "filename" : "replay_10_black_24dp 2.png",
      "idiom" : "universal",
      "scale" : "1x"
    },
    {
      "filename" : "replay_10_black_24dp 3.png",
      "idiom" : "universal",
      "scale" : "2x"
    },
    {
      "filename" : "replay_10_black_24dp 4.png",
      "idiom" : "universal",
      "scale" : "3x"
    }
  ],
  "info" : {
    "author" : "xcode",
    "version" : 1
  }
}
