<svg width="32" height="32" viewBox="0 0 32 32" fill="none" xmlns="http://www.w3.org/2000/svg">
<circle cx="16" cy="16" r="16" fill="#FFF0B9"/>
<path d="M9 22H23V15.031C23 11.148 19.866 8 16 8C12.134 8 9 11.148 9 15.031V22ZM16 6C20.97 6 25 10.043 25 15.031V24H7V15.031C7 10.043 11.03 6 16 6ZM13.5 25H18.5C18.5 25.663 18.2366 26.2989 17.7678 26.7678C17.2989 27.2366 16.663 27.5 16 27.5C15.337 27.5 14.7011 27.2366 14.2322 26.7678C13.7634 26.2989 13.5 25.663 13.5 25Z" fill="black"/>
</svg>
