<svg width="20" height="20" viewBox="0 0 20 20" fill="none" xmlns="http://www.w3.org/2000/svg">
<g clip-path="url(#clip0_2291_1584)">
<path d="M10.5 6.25C8.154 6.25 6.25 8.154 6.25 10.5C6.25 12.846 8.154 14.75 10.5 14.75C12.846 14.75 14.75 12.846 14.75 10.5C14.75 8.154 12.846 6.25 10.5 6.25ZM10.5 2C5.808 2 2 5.808 2 10.5C2 15.192 5.808 19 10.5 19C15.192 19 19 15.192 19 10.5C19 5.808 15.192 2 10.5 2ZM10.5 17.3C6.743 17.3 3.7 14.257 3.7 10.5C3.7 6.743 6.743 3.7 10.5 3.7C14.257 3.7 17.3 6.743 17.3 10.5C17.3 14.257 14.257 17.3 10.5 17.3Z" fill="white"/>
</g>
<defs>
<clipPath id="clip0_2291_1584">
<rect width="20" height="20" fill="white"/>
</clipPath>
</defs>
</svg>
