<svg width="88" height="37" viewBox="0 0 88 37" fill="none" xmlns="http://www.w3.org/2000/svg">
<rect y="0.5" width="88" height="36" rx="18" fill="white"/>
<path d="M44 8.5C41.243 8.5 39 10.743 39 13.5V15.5H38C36.897 15.5 36 16.397 36 17.5V26.5C36 27.603 36.897 28.5 38 28.5H50C51.103 28.5 52 27.603 52 26.5V17.5C52 16.397 51.103 15.5 50 15.5H49V13.5C49 10.743 46.757 8.5 44 8.5ZM41 13.5C41 11.846 42.346 10.5 44 10.5C45.654 10.5 47 11.846 47 13.5V15.5H41V13.5ZM50.002 26.5H45V24.222C45.595 23.875 46 23.237 46 22.5C46 21.397 45.103 20.5 44 20.5C42.897 20.5 42 21.397 42 22.5C42 23.236 42.405 23.875 43 24.222V26.5H38V17.5H50L50.002 26.5Z" fill="#B3ADB4"/>
</svg>
