<svg width="12" height="20" viewBox="0 0 12 20" fill="none" xmlns="http://www.w3.org/2000/svg">
<path d="M10.8 0H1.2C0.881741 0 0.576516 0.131689 0.351472 0.366098C0.126429 0.600507 3.82878e-07 0.918434 3.82878e-07 1.24994V18.7053C-0.000189566 18.9531 0.0703006 19.1953 0.202521 19.4012C0.334741 19.6071 0.522727 19.7675 0.742611 19.8619C0.962495 19.9563 1.20436 19.9806 1.43749 19.9315C1.67063 19.8825 1.88451 19.7624 2.052 19.5865L5.976 15.5117L9.954 19.6365C10.1222 19.8106 10.3361 19.929 10.5688 19.9766C10.8014 20.0242 11.0424 19.9989 11.2613 19.9039C11.4802 19.809 11.6672 19.6486 11.7987 19.4431C11.9301 19.2376 12.0002 18.9961 12 18.7491V1.24994C12 0.918434 11.8736 0.600507 11.6485 0.366098C11.4235 0.131689 11.1183 0 10.8 0Z" fill="#FFCE1A"/>
</svg>
