<?xml version="1.0" encoding="UTF-8" standalone="no"?>
<!-- Created with Inkscape (http://www.inkscape.org/) -->

<svg
   xmlns:dc="http://purl.org/dc/elements/1.1/"
   xmlns:cc="http://creativecommons.org/ns#"
   xmlns:rdf="http://www.w3.org/1999/02/22-rdf-syntax-ns#"
   xmlns:svg="http://www.w3.org/2000/svg"
   xmlns="http://www.w3.org/2000/svg"
   xmlns:sodipodi="http://sodipodi.sourceforge.net/DTD/sodipodi-0.dtd"
   xmlns:inkscape="http://www.inkscape.org/namespaces/inkscape"
   version="1.1"
   id="svg878"
   width="148"
   height="148"
   viewBox="0 0 148 148"
   sodipodi:docname="ic_qr_template.svg"
   inkscape:version="0.92.2 2405546, 2018-03-11">
  <metadata
     id="metadata884">
    <rdf:RDF>
      <cc:Work
         rdf:about="">
        <dc:format>image/svg+xml</dc:format>
        <dc:type
           rdf:resource="http://purl.org/dc/dcmitype/StillImage" />
        <dc:title />
      </cc:Work>
    </rdf:RDF>
  </metadata>
  <defs
     id="defs882" />
  <sodipodi:namedview
     pagecolor="#ffffff"
     bordercolor="#666666"
     borderopacity="1"
     objecttolerance="10"
     gridtolerance="10"
     guidetolerance="10"
     inkscape:pageopacity="0"
     inkscape:pageshadow="2"
     inkscape:window-width="1920"
     inkscape:window-height="1051"
     id="namedview880"
     showgrid="true"
     inkscape:zoom="2.9560811"
     inkscape:cx="-41.12062"
     inkscape:cy="111.6814"
     inkscape:window-x="0"
     inkscape:window-y="29"
     inkscape:window-maximized="1"
     inkscape:current-layer="svg878">
    <inkscape:grid
       type="xygrid"
       id="grid888" />
  </sodipodi:namedview>
  <path
     style="opacity:1;fill:#9840a0;fill-opacity:0.50147492;stroke:none;stroke-width:2;stroke-linecap:butt;stroke-linejoin:round;stroke-miterlimit:4;stroke-dasharray:none;stroke-dashoffset:0;stroke-opacity:1"
     d="M 0 0 L 0 148 L 148 148 L 148 0 L 0 0 z M 4 4 L 144 4 L 144 144 L 4 144 L 4 4 z M 16 16 L 16 44 L 44 44 L 44 16 L 16 16 z M 104 16 L 104 44 L 132 44 L 132 16 L 104 16 z M 20 20 L 40 20 L 40 40 L 20 40 L 20 20 z M 108 20 L 128 20 L 128 40 L 108 40 L 108 20 z M 24 24 L 24 36 L 36 36 L 36 24 L 24 24 z M 112 24 L 112 36 L 124 36 L 124 24 L 112 24 z M 16 104 L 16 132 L 44 132 L 44 104 L 16 104 z M 20 108 L 40 108 L 40 128 L 20 128 L 20 108 z M 24 112 L 24 124 L 36 124 L 36 112 L 24 112 z "
     id="rect890" />
</svg>
