DOMAIN_NAME              HTTP_CODE   RESPONSE_TIME
google.com               301         0.039121    
nzz.ch                   301         0.015913    
haraldmueller.ch         301         0.014363    
