[
	{
		"type": "header",
		"version": "4.7.7",
		"comment": "Export to JSON plugin for PHPMyAdmin"
	},
	{
		"type": "database",
		"name": "db_m133"
	},
	{
		"type": "table",
		"name": "t_arbeitsstunden",
		"database": "db_m133",
		"data": [
			{
				"astd_id": "1",
				"astd_pers_krzl": "MUH",
				"astd_proj_krzl": "TBZ-IT",
				"astd_datum": "2019-04-22",
				"astd_tarif_krzl": "BK",
				"astd_stdzahl": "4",
				"astd_arbeitsbeschreibung": "Berufskunde-Unterricht M133 Klasse BI16c"
			},
			{
				"astd_id": "2",
				"astd_pers_krzl": "MUH",
				"astd_proj_krzl": "TBZ-IT",
				"astd_datum": "2019-04-23",
				"astd_tarif_krzl": "ABU",
				"astd_stdzahl": "3",
				"astd_arbeitsbeschreibung": "Unterricht ABU Klasse BI16c"
			}
		]
	}
]
